{"text_format":"1","workbook":"xlsx","n_sheets":3,"sheets":["Cover sheet","WP","WP configuration"],"not_rendered":{"charts":0,"images":0,"macros":1,"external_links":0,"defined_names":92,"comments":2,"pivot_tables":0},"unopened":[],"bounds":{"document_bytes":16777216,"sheet_cells":100000,"rows_first":2000,"rows_last":500,"rows_between":2000,"halvings":0,"cell_chars":16384,"cell_head_chars":4096},"cells_cut":0,"cells_raw":0,"read":"whole","date_system":"1900"}

{"sheet":"Cover sheet","index":0,"n_rows":56,"n_cols":121,"rows_kept":56,"cut":false,"hidden":false,"merged":[[39,40,39,43],[40,40,40,43],[31,40,31,43],[32,40,32,43],[33,40,33,43],[34,40,34,43],[35,40,35,43],[36,40,36,43],[38,3,38,5],[31,7,31,15],[32,7,32,15],[33,7,33,15],[34,7,34,15],[35,7,35,15],[38,40,38,43],[2,1,2,13],[20,4,20,15],[21,3,21,15],[27,7,27,15],[28,7,28,15],[29,7,29,15],[30,7,30,15],[18,40,18,43],[19,40,19,43],[20,40,20,43],[0,39,17,39],[26,40,26,43],[27,40,27,43],[28,40,28,43],[29,40,29,43],[30,40,30,43],[21,40,21,43],[22,40,22,43],[23,40,23,43],[24,40,24,43],[25,40,25,43],[25,1,25,2],[26,1,26,2],[27,1,27,2],[0,118,0,119],[1,118,1,119],[2,118,2,119],[18,82,18,116],[18,118,18,119],[18,46,18,80],[12,46,16,116],[0,41,0,42],[19,7,19,15],[1,1,1,11],[2,41,2,42],[20,1,20,2],[18,7,18,15],[23,7,23,15],[22,1,22,35],[6,2,6,15],[19,1,19,2],[18,1,18,2],[12,1,15,15],[10,12,10,15],[1,13,1,15],[37,40,37,43],[18,81,22,81],[0,45,17,45],[7,46,10,106],[4,46,6,106],[17,46,17,106],[17,1,17,35],[37,1,37,35],[38,7,38,15],[38,17,38,25],[38,27,38,35],[7,2,7,15],[9,2,9,15],[4,2,4,15],[5,2,5,15],[32,1,32,2],[33,1,33,2],[24,7,24,15],[25,7,25,15],[26,7,26,15],[34,1,34,2],[31,1,31,2],[24,1,24,2],[35,1,35,2],[55,2,55,15],[49,1,49,2],[28,1,28,2],[29,1,29,2],[30,1,30,2],[52,46,52,106],[39,2,40,2],[39,17,39,19],[39,23,39,25],[39,10,39,12],[39,27,39,29],[39,30,39,32],[39,33,39,35],[39,13,39,15],[39,20,39,22],[39,3,40,3],[39,4,40,4],[39,5,40,5],[44,1,44,2],[42,1,42,2],[41,1,41,2],[39,1,40,1],[39,7,39,9]]}
[null,null,null,null,null,null,null,null,null,null,null,null,null,null,null,null,null,null,null,null,null,null,null,null,null,null,null,null,null,null,null,null,null,null,null,null,null,null,null,"End of Cover Sheet",null,"Rapporteur's tools",null,null,null,"Start of Current Meeting Data",null,null,null,null,null,null,null,null,null,null,null,null,null,null,null,null,null,null,null,null,null,null,null,null,null,null,null,null,null,null,null,null,null,null,null,null,null,null,null,null,null,null,null,null,null,null,null,null,null,null,null,null,null,null,null,null,null,null,null,null,null,null,null,null,null,null,null,null,null,null,null,null,"Overall completion"]
[null,"3GPP TSG-RAN5 Meeting #92-e",null,null,null,null,null,null,null,null,null,null,null,"R5-215189",null,null,null,null,null,null,null,null,null,null,null,null,null,null,null,null,null,null,null,null,null,null,null,null,null,null,null,null,null,null,null,null,null,null,null,null,null,null,null,null,null,null,null,null,null,null,null,null,null,null,null,null,null,null,null,null,null,null,null,null,null,null,null,null,null,null,null,null,null,null,null,null,null,null,null,null,null,null,null,null,null,null,null,null,null,null,null,null,null,null,null,null,null,null,null,null,null,null,null,null,null,null,null,null,{"$f":"IF(OverallWp_SumWeights>0, (IF(AX26<>\"\",AX26*WP!AB10,0)+IF(AX27<>\"\",AX27*WP!AC10,0)+IF(AX28<>\"\",AX28*WP!AD10,0)+IF(AX30<>\"\",AX30*WP!AE10,0)+IF(AX31<>\"\",AX31*WP!AF10,0)+IF(AX32<>\"\",AX32*WP!AG10,0)+IF(AX34<>\"\",AX34*WP!AH10,0)+IF(AX35<>\"\",AX35*WP!AI10,0)+IF(AX36<>\"\",AX36*WP!AJ10,0))/OverallWp_SumWeights,0)","v":0.36112499999999992}]
[null,"Electronic Meeting, 16 – 27 August 2021",null,null,null,null,null,null,null,null,null,null,null,null,null,null,null,null,null,null,null,null,null,null,null,null,null,null,null,null,null,null,null,null,null,null,null,null,null,null,null,null,null,null,null,null,null,null,null,null,null,null,null,null,null,null,null,null,null,null,null,null,null,null,null,null,null,null,null,null,null,null,null,null,null,null,null,null,null,null,null,null,null,null,null,null,null,null,null,null,null,null,null,null,null,null,null,null,null,null,null,null,null,null,null,null,null,null,null,null,null,null,null,null,null,null,null,null,{"$f":"IFERROR(IF(CH20-DO2>0,CH20-DO2,0),0)","v":0}]
[]
[null,"Agenda Item:","7.4.2",null,null,null,null,null,null,null,null,null,null,null,null,null,null,null,null,null,null,null,null,null,null,null,null,null,null,null,null,null,null,null,null,null,null,null,null,null,null,null,"Edit/Protect status of cover sheet",null,null,null,null,null,null,null,null,null,null,null,null,null,null,null,null,null,null,null,null,null,null,null,null,null,null,null,null,null,null,null,null,null,null,null,null,null,null,null,null,null,null,null,null,null,null,null,null,null,null,null,null,null,null,null,null,null,null,null,null,null,null,null,null,null,null,null,null,null,null,null,null,null,null,null,null,"First status column in WP","Last status column in WP"]
[null,"Source:","Ligado Networks",null,null,null,null,null,null,null,null,null,null,null,null,null,null,null,null,null,null,null,null,null,null,null,null,null,null,null,null,null,null,null,null,null,null,null,null,null,null,null,"Protected",null,null,null,null,null,null,null,null,null,null,null,null,null,null,null,null,null,null,null,null,null,null,null,null,null,null,null,null,null,null,null,null,null,null,null,null,null,null,null,null,null,null,null,null,null,null,null,null,null,null,null,null,null,null,null,null,null,null,null,null,null,null,null,null,null,null,null,null,null,null,null,null,null,null,null,null,{"$f":"SUBSTITUTE(ADDRESS(1,COLUMN(StartOfWPstsCol)+1,4),\"1\",\"\")","v":"Q"},{"$f":"IF(WpAreaB_exist=FALSE,WpAreaA_Sub3_Column,IF(WpAreaC_exist=FALSE,WpAreaB_Sub3_Column,WpAreaC_Sub3_Column))","v":"S"}]
[null,"Title:","Work plan for Modification of LTE Band 24 Specifications to comply with updated regulatory emission limit",null,null,null,null,null,null,null,null,null,null,null,null,null,null,null,null,null,null,null,null,null,null,null,null,null,null,null,null,null,null,null,null,null,null,null,null,null,null,null,"Changed to Protected when switching worksheet",null,null,null,null,null,null,null,null,null,null,null,null,null,null,null,null,null,null,null,null,null,null,null,null,null,null,null,null,null,null,null,null,null,null,null,null,null,null,null,null,null,null,null,null,null,null,null,null,null,null,null,null,null,null,null,null,null,null,null,null,null,null,null,null,null,null,null,null,null,null,null,null,null,null,null,null,"First row WP items","Last row WP items"]
[null,"Work item code:","LTE_B24_mod-UEConTest",null,null,null,null,null,null,null,null,null,null,null,null,null,null,null,null,null,null,null,null,null,null,null,null,null,null,null,null,null,null,null,null,null,null,null,null,null,null,null,null,null,null,null,null,null,null,null,null,null,null,null,null,null,null,null,null,null,null,null,null,null,null,null,null,null,null,null,null,null,null,null,null,null,null,null,null,null,null,null,null,null,null,null,null,null,null,null,null,null,null,null,null,null,null,null,null,null,null,null,null,null,null,null,null,null,null,null,null,null,null,null,null,null,null,null,null,{"$f":"ROW(StartWpItems)","v":12},{"$f":"ROW(EndWPitems)","v":53}]
[null,"Release:","Rel-17"]
[null,"Document for:        ","Information",null,null,null,null,null,null,null,null,null,null,null,null,null,null,null,null,null,null,null,null,null,null,null,null,null,null,null,null,null,null,null,null,null,null,null,null,null,null,null,"Current baseline for progress indication:"]
[null,null,null,null,null,null,null,null,null,null,null,null,"RAN5 WP template v2.0",null,null,null,null,null,null,null,null,null,null,null,null,null,null,null,null,null,null,null,null,null,null,null,null,null,null,null,null,null,"2021-01-13 (09:27:52)"]
[null,"1. Introduction"]
[null,"At the RAN#91-e meeting in June 2021, a RAN5 work item for conformance test aspects related to the modification of the LTE Band 24 Specifications to comply with updated regulatory emission limits was approved [1]. The scope of this work is to assess and update affected conformance test cases related to LTE Band 24 in relevant conformance technical specifications.\n\nThe purpose of present document is to provide a work plan and status for the RAN5 work item related to updates necessary to the conformance specification as result of updates approved for LTE Band 24 in TS 36.101.  The work plan will be updated after each RAN5 meeting to give the status of the work item until the work is fully completed. ",null,null,null,null,null,null,null,null,null,null,null,null,null,null,null,null,null,null,null,null,null,null,null,null,null,null,null,null,null,null,null,null,null,null,null,null,null,null,null,null,null,null,null,null,"Source data used for calculating current status and progress from previous meeting"]
[]
[]
[]
[null,"2. Work item status"]
[null,"Estimation of WI overall completion:",null,null,null,null,null,null,null,null,null,null,null,null,null,null,null,null,null,null,null,null,null,null,null,null,null,null,null,null,null,null,null,null,null,null,null,null,null,null,null,null,null,null,null,null,"Start of source data"]
[null,"Area",null,"Completion\n\n","Number of new completed test cases\n(Note 1)","Number of new test cases",null,"Comments",null,null,null,null,null,null,null,null,null,null,null,null,null,null,null,null,null,null,null,null,null,null,null,null,null,null,null,null,null,null,"\n\n\n\n",null,"Don't remove this row",null,null,null,null,null,"Current meeting status",null,null,null,null,null,null,null,null,null,null,null,null,null,null,null,null,null,null,null,null,null,null,null,null,null,null,null,null,null,null,null,null,null,null,"End of Current Meeting Data","Previous meeting status baseline",null,null,null,null,null,null,null,null,null,null,null,null,null,null,null,null,null,null,null,null,null,null,null,null,null,null,null,null,null,null,null,null,null,null,null,"Sum WP weights"]
[null,"Overall completion\n",null,{"$f":"getProgress(AX20,CH20,\"%\",0,1)","v":"36%\n(+36%)"},{"$f":"getProgress(AY20,CI20,,,1)","v":""},{"$f":"getProgress(AZ20,CJ20,,,1)","v":""},null,null,null,null,null,null,null,null,null,null,null,null,null,null,null,null,null,null,null,null,null,null,null,null,null,null,null,null,null,null,null,null,null,null,"Don't remove this row",null,null,null,null,null,null,null,null,{"$f":"IF(OverallWp_SumWeights>0,DO2+DO3,\"\")","v":0.36112499999999992},{"$f":"IF(SUMPRODUCT(--(INDIRECT(WpIsNewTC_Rng)=\"Y\"),--(INDIRECT(WpOverall_Rng)=1),--(INDIRECT(WpWeight_Rng)>0))>0,SUMPRODUCT(--(INDIRECT(WpIsNewTC_Rng)=\"Y\"),--(INDIRECT(WpOverall_Rng)=1),INDIRECT(WpWeight_Rng)),IF(AZ20<>\"\",0,\"\"))","v":""},{"$f":"IF(SUMPRODUCT(--(INDIRECT(WpIsNewTC_Rng)=\"Y\"),--(INDIRECT(WpOverall_Rng)<>\"\"),--(INDIRECT(WpWeight_Rng)>0))<>0,SUMPRODUCT(--(INDIRECT(WpIsNewTC_Rng)=\"Y\"),--(INDIRECT(WpOverall_Rng)<>\"\"),INDIRECT(WpWeight_Rng)),\"\")","v":""},null,null,null,null,null,null,null,null,null,null,null,null,null,null,null,null,null,null,null,null,null,null,null,null,null,null,null,null,null,null,null,null,null,null,"","",null,null,null,null,null,null,null,null,null,null,null,null,null,null,null,null,null,null,null,null,null,null,null,null,null,null,null,null,null,null,"WP area A",{"$f":"IF(WpAreaA_exist,SUM(WP!AB10:AD10),0)","v":6}]
{"$rows_left_out":37}
{"sheet":"WP","index":1,"n_rows":53,"n_cols":51,"rows_kept":53,"cut":false,"hidden":false,"merged":[[52,27,52,40],[7,36,14,36],[0,27,5,35],[0,37,5,45],[2,17,2,23],[10,16,10,24],[7,26,14,26],[1,0,1,1],[0,47,0,50],[0,2,0,9],[3,0,3,1],[4,0,4,1],[0,0,0,1],[2,0,2,1],[1,2,1,9],[2,2,2,9],[4,2,4,4],[3,5,3,7],[3,8,3,9],[3,19,4,21],[0,25,6,25],[3,2,3,4],[4,5,4,7],[4,8,4,9],[1,47,4,47],[0,15,5,15],[3,11,4,14],[6,27,6,40],[1,48,4,50],[3,16,4,18],[5,47,5,48],[5,49,5,50],[3,22,4,24],[0,16,1,24]]}
["WP Title:",null,"Work plan for Modification of LTE Band 24 Specifications to comply with updated regulatory emission limit",null,null,null,null,null,null,null,null,null,null,null,null,"Start of workplan status columns.  Note! Do not remove this column. ","WP item status",null,null,null,null,null,null,null,null,"End of workplan columns.  Note! Do not remove this column. ",null,"Current meeting status",null,null,null,null,null,null,null,null,null,"Previous meeting status baseline",null,null,null,null,null,null,null,null,null,"WP rapporteur's private information. \nThese columns will be removed in the clean copy created by \"Create clean WP for publishing\".\n"]
["WI code",null,{"$f":"WI_code","v":"LTE_B24_mod-UEConTest"}]
["WP Scope:",null,"Assess and determine test environments and cases affected by updates to LTE Band 24 and update them in relevant conformance technical specifications",null,null,null,null,null,null,null,null,null,null,null,null,null,null,"vs Area"]
["WP Resp:",null,"Ojas Choksi",null,null,"ojas.choksi@ligado.com",null,null,null,null,null,"WP item completion",null,null,null,null,{"$f":"WpAreaA","v":"LTE"},null,null,{"$f":"WpAreaB","v":"N/A"},null,null,{"$f":"WpAreaC","v":"N/A"}]
["TS Resp:",null,"<TS responsible if a new TS is involved>",null,null,"<Email to TS responsible>"]
["WP Item ID","Is new test case?","TS/area","Clause","Title","Test purpose / Task","Company","Target","TDOC(s)","Comments","Weight","Overall",{"$f":"WpAreaA","v":"LTE"},{"$f":"WpAreaB","v":"N/A"},{"$f":"WpAreaC","v":"N/A"},null,{"$f":"WpAreaA_Sub1","v":"FDD"},{"$f":"WpAreaA_Sub2","v":"N/A"},{"$f":"WpAreaA_Sub3","v":"N/A"},{"$f":"WpAreaB_Sub1","v":"N/A"},{"$f":"WpAreaB_Sub2","v":"N/A"},{"$f":"WpAreaB_Sub3","v":"N/A"},{"$f":"WpAreaC_Sub1","v":"N/A"},{"$f":"WpAreaC_Sub2","v":"N/A"},{"$f":"WpAreaC_Sub3","v":"N/A"},null,null,null,null,null,null,null,null,null,null,null,null,null,null,null,null,null,null,null,null,null,null,"WP rapporteur internal notes",null,"Company <-> Contact email address(es)"]
[null,null,null,null,null,null,null,null,null,null,null,null,null,null,null,null,null,null,null,null,null,null,null,null,null,null,null,"Start of source data",null,null,null,null,null,null,null,null,null,null,null,null,null,null,null,null,null,null,null,"<Internal note column#1>","<Internal note column#2>","Company","E-mail address(es)"]
[null,null,null,null,null,null,null,null,null,null,null,null,null,null,"Overall",null,{"$f":"getProgress(AB8,AL8,\"%\",1,1)","v":"36.1%\n(+36.1%)"},{"$f":"getProgress(AC8,AM8,\"%\",1,1)","v":""},{"$f":"getProgress(AD8,AN8,\"%\",1,1)","v":""},{"$f":"getProgress(AE8,AO8,\"%\",1,1)","v":""},{"$f":"getProgress(AF8,AP8,\"%\",1,1)","v":""},{"$f":"getProgress(AG8,AQ8,\"%\",1,1)","v":""},{"$f":"getProgress(AH8,AR8,\"%\",1,1)","v":""},{"$f":"getProgress(AI8,AS8,\"%\",1,1)","v":""},{"$f":"getProgress(AJ8,AT8,\"%\",1,1)","v":""},null,"Start of Current Meeting Data",{"$f":"IF(SUMPRODUCT(--(INDIRECT(WpAreaA_Sub1_Rng)<>\"\"),INDIRECT(WpWeight_Rng)),$Q$11+(1-$Q$11)*(SUMPRODUCT(--(INDIRECT(WpAreaA_Sub1_Rng) <>\"\"),INDIRECT(WpWeight_Rng),INDIRECT(WpAreaA_Sub1_Rng))/SUMPRODUCT(--(INDIRECT(WpAreaA_Sub1_Rng) <>\"\"),INDIRECT(WpWeight_Rng))),\"\")","v":0.36112499999999992},{"$f":"IF(SUMPRODUCT(--(INDIRECT(WpAreaA_Sub2_Rng)<>\"\"),INDIRECT(WpWeight_Rng)),$Q$11+(1-$Q$11)*(SUMPRODUCT(--(INDIRECT(WpAreaA_Sub2_Rng) <>\"\"),INDIRECT(WpWeight_Rng),INDIRECT(WpAreaA_Sub2_Rng))/SUMPRODUCT(--(INDIRECT(WpAreaA_Sub2_Rng) <>\"\"),INDIRECT(WpWeight_Rng))),\"\")","v":""},{"$f":"IF(SUMPRODUCT(--(INDIRECT(WpAreaA_Sub3_Rng)<>\"\"),INDIRECT(WpWeight_Rng)),$Q$11+(1-$Q$11)*(SUMPRODUCT(--(INDIRECT(WpAreaA_Sub3_Rng) <>\"\"),INDIRECT(WpWeight_Rng),INDIRECT(WpAreaA_Sub3_Rng))/SUMPRODUCT(--(INDIRECT(WpAreaA_Sub3_Rng) <>\"\"),INDIRECT(WpWeight_Rng))),\"\")","v":""},{"$f":"IF(SUMPRODUCT(--(INDIRECT(WpAreaB_Sub1_Rng)<>\"\"),INDIRECT(WpWeight_Rng)),$Q$11+(1-$Q$11)*(SUMPRODUCT(--(INDIRECT(WpAreaB_Sub1_Rng) <>\"\"),INDIRECT(WpWeight_Rng),INDIRECT(WpAreaB_Sub1_Rng))/SUMPRODUCT(--(INDIRECT(WpAreaB_Sub1_Rng) <>\"\"),INDIRECT(WpWeight_Rng))),\"\")","v":""},{"$f":"IF(SUMPRODUCT(--(INDIRECT(WpAreaB_Sub2_Rng)<>\"\"),INDIRECT(WpWeight_Rng)),$Q$11+(1-$Q$11)*(SUMPRODUCT(--(INDIRECT(WpAreaB_Sub2_Rng) <>\"\"),INDIRECT(WpWeight_Rng),INDIRECT(WpAreaB_Sub2_Rng))/SUMPRODUCT(--(INDIRECT(WpAreaB_Sub2_Rng) <>\"\"),INDIRECT(WpWeight_Rng))),\"\")","v":""},{"$f":"IF(SUMPRODUCT(--(INDIRECT(WpAreaB_Sub3_Rng)<>\"\"),INDIRECT(WpWeight_Rng)),$Q$11+(1-$Q$11)*(SUMPRODUCT(--(INDIRECT(WpAreaB_Sub3_Rng) <>\"\"),INDIRECT(WpWeight_Rng),INDIRECT(WpAreaB_Sub3_Rng))/SUMPRODUCT(--(INDIRECT(WpAreaB_Sub3_Rng) <>\"\"),INDIRECT(WpWeight_Rng))),\"\")","v":""},{"$f":"IF(SUMPRODUCT(--(INDIRECT(WpAreaC_Sub1_Rng)<>\"\"),INDIRECT(WpWeight_Rng)),$Q$11+(1-$Q$11)*(SUMPRODUCT(--(INDIRECT(WpAreaC_Sub1_Rng) <>\"\"),INDIRECT(WpWeight_Rng),INDIRECT(WpAreaC_Sub1_Rng))/SUMPRODUCT(--(INDIRECT(WpAreaC_Sub1_Rng) <>\"\"),INDIRECT(WpWeight_Rng))),\"\")","v":""},{"$f":"IF(SUMPRODUCT(--(INDIRECT(WpAreaC_Sub2_Rng)<>\"\"),INDIRECT(WpWeight_Rng)),$Q$11+(1-$Q$11)*(SUMPRODUCT(--(INDIRECT(WpAreaC_Sub2_Rng) <>\"\"),INDIRECT(WpWeight_Rng),INDIRECT(WpAreaC_Sub2_Rng))/SUMPRODUCT(--(INDIRECT(WpAreaC_Sub2_Rng) <>\"\"),INDIRECT(WpWeight_Rng))),\"\")","v":""},{"$f":"IF(SUMPRODUCT(--(INDIRECT(WpAreaC_Sub3_Rng)<>\"\"),INDIRECT(WpWeight_Rng)),$Q$11+(1-$Q$11)*(SUMPRODUCT(--(INDIRECT(WpAreaC_Sub3_Rng) <>\"\"),INDIRECT(WpWeight_Rng),INDIRECT(WpAreaC_Sub3_Rng))/SUMPRODUCT(--(INDIRECT(WpAreaC_Sub3_Rng) <>\"\"),INDIRECT(WpWeight_Rng))),\"\")","v":""},"End of Current Meeting Data","","","","","","","","",""]
[null,null,null,null,null,null,null,null,null,null,null,null,null,null,"Number of WP items",null,{"$f":"getProgress(AB9,AL9,,,1)","v":"29\n(+29)"},{"$f":"getProgress(AC9,AM9,,,1)","v":"0"},{"$f":"getProgress(AD9,AN9,,,1)","v":"0"},{"$f":"getProgress(AE9,AO9,,,1)","v":"0"},{"$f":"getProgress(AF9,AP9,,,1)","v":"0"},{"$f":"getProgress(AG9,AQ9,,,1)","v":"0"},{"$f":"getProgress(AH9,AR9,,,1)","v":"0"},{"$f":"getProgress(AI9,AS9,,,1)","v":"0"},{"$f":"getProgress(AJ9,AT9,,,1)","v":"0"},null,null,{"$f":"IF(WpAreaA_Sub1_exist,COUNTA(INDIRECT(WpAreaA_Sub1_Rng)),0)","v":29},{"$f":"IF(WpAreaA_Sub1_exist,COUNTA(INDIRECT(WpAreaA_Sub2_Rng)),0)","v":0},{"$f":"IF(WpAreaA_Sub1_exist,COUNTA(INDIRECT(WpAreaA_Sub3_Rng)),0)","v":0},{"$f":"IF(WpAreaB_Sub1_exist,COUNTA(INDIRECT(WpAreaB_Sub1_Rng)),0)","v":0},{"$f":"IF(WpAreaB_Sub1_exist,COUNTA(INDIRECT(WpAreaB_Sub2_Rng)),0)","v":0},{"$f":"IF(WpAreaB_Sub1_exist,COUNTA(INDIRECT(WpAreaB_Sub3_Rng)),0)","v":0},{"$f":"IF(WpAreaC_Sub1_exist,COUNTA(INDIRECT(WpAreaC_Sub1_Rng)),0)","v":0},{"$f":"IF(WpAreaC_Sub1_exist,COUNTA(INDIRECT(WpAreaC_Sub2_Rng)),0)","v":0},{"$f":"IF(WpAreaC_Sub1_exist,COUNTA(INDIRECT(WpAreaC_Sub3_Rng)),0)","v":0},null,0,0,0,0,0,0,0,0,0]
[null,null,null,null,null,null,null,null,null,null,null,null,null,null,"Sum weight of WP items",null,{"$f":"getProgress(AB10,AL10,,1,1)","v":"6\n(+6)"},{"$f":"getProgress(AC10,AM10,,1,1)","v":"0"},{"$f":"getProgress(AD10,AN10,,1,1)","v":"0"},{"$f":"getProgress(AE10,AO10,,1,1)","v":"0"},{"$f":"getProgress(AF10,AP10,,1,1)","v":"0"},{"$f":"getProgress(AG10,AQ10,,1,1)","v":"0"},{"$f":"getProgress(AH10,AR10,,1,1)","v":"0"},{"$f":"getProgress(AI10,AS10,,1,1)","v":"0"},{"$f":"getProgress(AJ10,AT10,,1,1)","v":"0"},null,null,{"$f":"IF(WpAreaA_Sub1_exist,SUMPRODUCT(--(INDIRECT(WpAreaA_Sub1_Rng) <>\"\"),INDIRECT(WpWeight_Rng)),0)","v":6},{"$f":"IF(WpAreaA_Sub2_exist,SUMPRODUCT(--(INDIRECT(WpAreaA_Sub2_Rng) <>\"\"),INDIRECT(WpWeight_Rng)),0)","v":0},{"$f":"IF(WpAreaA_Sub3_exist,SUMPRODUCT(--(INDIRECT(WpAreaA_Sub3_Rng) <>\"\"),INDIRECT(WpWeight_Rng)),0)","v":0},{"$f":"IF(WpAreaB_Sub1_exist,SUMPRODUCT(--(INDIRECT(WpAreaB_Sub1_Rng) <>\"\"),INDIRECT(WpWeight_Rng)),0)","v":0},{"$f":"IF(WpAreaB_Sub2_exist,SUMPRODUCT(--(INDIRECT(WpAreaB_Sub2_Rng) <>\"\"),INDIRECT(WpWeight_Rng)),0)","v":0},{"$f":"IF(WpAreaB_Sub3_exist,SUMPRODUCT(--(INDIRECT(WpAreaB_Sub3_Rng) <>\"\"),INDIRECT(WpWeight_Rng)),0)","v":0},{"$f":"IF(WpAreaC_Sub1_exist,SUMPRODUCT(--(INDIRECT(WpAreaC_Sub1_Rng) <>\"\"),INDIRECT(WpWeight_Rng)),0)","v":0},{"$f":"IF(WpAreaC_Sub2_exist,SUMPRODUCT(--(INDIRECT(WpAreaC_Sub2_Rng) <>\"\"),INDIRECT(WpWeight_Rng)),0)","v":0},{"$f":"IF(WpAreaC_Sub3_exist,SUMPRODUCT(--(INDIRECT(WpAreaC_Sub3_Rng) <>\"\"),INDIRECT(WpWeight_Rng)),0)","v":0},null,0,0,0,0,0,0,0,0,0]
[null,null,null,null,null,null,null,null,null,null,null,null,null,null,"Contribution by  work plan analysis",null,0.05,null,null,null,null,null,null,null,null,null,null,{"$f":"Q11","v":0.05},null,null,null,null,null,null,null,null,null,0.05]
["Start of work plan items.  Note! Do not remove this row. Introduce new work plan rows/items below this row."]
["LTE"]
["LTE Common"]
["TS 36.508: Common test environment"]
[1,null,36.508000000000003,"4.3.1","Test frequencies","Update the test frequencies based on the consraints placed on use of the entire band 24 as well as addition of a new Tx-Rx spacing","Ligado Networks","RAN5#92 (Aug-21)","R5-215174",null,0.1,{"$f":"getProgress(AB16,AL16,\"%\",1,1)","v":"100%\n(+100%)"},{"$f":"getProgress(AC16,AM16,\"%\",1,1)","v":"100%\n(+100%)"},{"$f":"getProgress(AD16,AN16,\"%\",1,1)","v":""},{"$f":"getProgress(AE16,AO16,\"%\",1,1)","v":""},null,1,null,null,null,null,null,null,null,null,null,null,{"$f":"IF(SUMPRODUCT(--($Q$10:$Y$10>0),--(Q16:Y16<>\"\"))>0,SUMPRODUCT(--($Q$10:$Y$10>0),Q16:Y16)/SUMPRODUCT(--($Q$10:$Y$10>0),--(Q16:Y16<>\"\")),\"\")","v":1},{"$f":"IF(WpAreaA_exist,IF(SUMPRODUCT(--($Q$9:$S$9<>0),--(Q16:S16<>\"\"))>0,SUMPRODUCT(--($Q$9:$S$9>0),Q16:S16)/SUMPRODUCT(--($Q$9:$S$9<>0),--(Q16:S16<>\"\")),\"\"),\"\")","v":1},{"$f":"IF(WpAreaB_exist,IF(SUMPRODUCT(--($T$9:$V$9<>0),--(T16:V16<>\"\"))>0,SUMPRODUCT(--($T$9:$V$9>0),T16:V16)/SUMPRODUCT(--($T$9:$V$9<>0),--(T16:V16<>\"\")),\"\"),\"\")","v":""},{"$f":"IF(WpAreaC_exist,IF(SUMPRODUCT(--($W$9:$Y$9<>0),--(W16:Y16<>\"\"))>0,SUMPRODUCT(--($W$9:$Y$9>0),W16:Y16)/SUMPRODUCT(--($W$9:$Y$9<>0),--(W16:Y16<>\"\")),\"\"),\"\")","v":""},null,null,null,null,null,null,"","","",""]
[2,null,36.508000000000003,"6.2.3.1","Test frequencies for signaling test","Update the test frequencies based on the consraints placed on use of the entire band 24 as well as specifying the Tx-Rx spacing for protocol testing","Ligado Networks","RAN5#92 (Aug-21)","R5-215175",null,0.1,{"$f":"getProgress(AB17,AL17,\"%\",1,1)","v":"100%\n(+100%)"},{"$f":"getProgress(AC17,AM17,\"%\",1,1)","v":"100%\n(+100%)"},{"$f":"getProgress(AD17,AN17,\"%\",1,1)","v":""},{"$f":"getProgress(AE17,AO17,\"%\",1,1)","v":""},null,1,null,null,null,null,null,null,null,null,null,null,{"$f":"IF(SUMPRODUCT(--($Q$10:$Y$10>0),--(Q17:Y17<>\"\"))>0,SUMPRODUCT(--($Q$10:$Y$10>0),Q17:Y17)/SUMPRODUCT(--($Q$10:$Y$10>0),--(Q17:Y17<>\"\")),\"\")","v":1},{"$f":"IF(WpAreaA_exist,IF(SUMPRODUCT(--($Q$9:$S$9<>0),--(Q17:S17<>\"\"))>0,SUMPRODUCT(--($Q$9:$S$9>0),Q17:S17)/SUMPRODUCT(--($Q$9:$S$9<>0),--(Q17:S17<>\"\")),\"\"),\"\")","v":1},{"$f":"IF(WpAreaB_exist,IF(SUMPRODUCT(--($T$9:$V$9<>0),--(T17:V17<>\"\"))>0,SUMPRODUCT(--($T$9:$V$9>0),T17:V17)/SUMPRODUCT(--($T$9:$V$9<>0),--(T17:V17<>\"\")),\"\"),\"\")","v":""},{"$f":"IF(WpAreaC_exist,IF(SUMPRODUCT(--($W$9:$Y$9<>0),--(W17:Y17<>\"\"))>0,SUMPRODUCT(--($W$9:$Y$9>0),W17:Y17)/SUMPRODUCT(--($W$9:$Y$9<>0),--(W17:Y17<>\"\")),\"\"),\"\")","v":""},null,null,null,null,null,null,"","","",""]
["LTE RF/RRM"]
["TS 36.521-1: RF test cases - Common parts (general clauses, Annexes)"]
[1,null,"36.521-1",5.2,"Updating Operating Band 24 in 36.101","Updating operating bond with a note that constrains use of DL and UL frequencies","Ligado Networks","RAN5#92 (Aug-21)","R5-215177",null,0.1,null,null,null,null,null,1]
{"$rows_left_out":34}
{"sheet":"WP configuration","index":2,"n_rows":50,"n_cols":4,"rows_kept":50,"cut":false,"hidden":false,"merged":[[37,0,37,1],[48,0,48,1],[49,0,58,1],[46,0,46,1],[38,0,38,1],[28,0,28,1],[36,0,36,1],[1,0,1,1],[0,0,0,1],[16,0,16,1],[29,0,29,1],[30,0,30,1]]}
["Configure work plan properties",null,null,"WP support data - DO NOT EDIT THIS COLUMN"]
["Work plan scope"]
[null,"Define WP scope",null,"Active WP scope"]
["WP area A","LTE",null,{"$f":"IF(OR(B4=\"\",B4=\"N/A\"),\"N/A\",B4)","v":"LTE"}]
["sub-area#1","FDD",null,{"$f":"IF(D4=\"N/A\",\"N/A\",IF(OR(B5=\"\",B5=\"N/A\"),\"\",B5))","v":"FDD"}]
["sub-area#2","N/A",null,{"$f":"IF(OR(D5=\"N/A\",D5=\"-\"),\"N/A\",IF(B6=\"\",\"N/A\",B6))","v":"N/A"}]
["sub-area#3","FR1 + FR2",null,{"$f":"IF(OR(D6=\"N/A\",D6=\"-\"),\"N/A\",IF(B7=\"\",\"N/A\",B7))","v":"N/A"}]
["WP area B","N/A",null,{"$f":"IF(OR($D$4=\"N/A\",$B$8=\"\"),\"N/A\",B8)","v":"N/A"}]
["sub-area#1","FR1",null,{"$f":"IF(OR(D8=\"N/A\",B9=\"N/A\"),\"N/A\",IF(B9=\"\",\"\",B9))","v":"N/A"}]
["sub-area#2","FR2",null,{"$f":"IF(OR(D9=\"N/A\",B10=\"\"),\"N/A\",IF(B10=\"\",\"N/A\",B10))","v":"N/A"}]
["sub-area#3","FR1 + FR2",null,"N/A"]
["WP area C","LTE",null,{"$f":"IF(OR($D$8=\"N/A\",$B$12=\"\"),\"N/A\",B12)","v":"N/A"}]
["sub-area#1","FDD",null,{"$f":"IF(OR(D12=\"N/A\",B13=\"N/A\"),\"N/A\",IF(B13=\"\",\"\",B13))","v":"N/A"}]
["sub-area#2","TDD",null,{"$f":"IF(OR(D13=\"N/A\",$B$13=\"\"),\"N/A\",IF(B14=\"\",\"N/A\",B14))","v":"N/A"}]
["sub-area#3","FDD + TDD",null,"N/A"]
[]
["RAN5 meetings used as target values in WP"]
[null,"RAN5#88-e (Aug-20)"]
[null,"RAN5#89-e (Nov-20)"]
[null,"RAN5#90-e (Feb-21)"]
{"$rows_left_out":30}