{"text_format":"1","workbook":"xlsx","n_sheets":3,"sheets":["Cover sheet","WP","WP configuration"],"not_rendered":{"charts":0,"images":0,"macros":1,"external_links":0,"defined_names":92,"comments":2,"pivot_tables":0},"unopened":[],"bounds":{"document_bytes":16777216,"sheet_cells":100000,"rows_first":2000,"rows_last":500,"rows_between":2000,"halvings":0,"cell_chars":16384,"cell_head_chars":4096},"cells_cut":0,"cells_raw":0,"read":"whole","date_system":"1900"}

{"sheet":"Cover sheet","index":0,"n_rows":56,"n_cols":121,"rows_kept":56,"cut":false,"hidden":false,"merged":[[39,40,39,43],[40,40,40,43],[31,40,31,43],[32,40,32,43],[33,40,33,43],[34,40,34,43],[35,40,35,43],[36,40,36,43],[38,3,38,5],[31,7,31,15],[32,7,32,15],[33,7,33,15],[34,7,34,15],[35,7,35,15],[38,40,38,43],[2,1,2,13],[20,4,20,15],[21,3,21,15],[27,7,27,15],[28,7,28,15],[29,7,29,15],[30,7,30,15],[18,40,18,43],[19,40,19,43],[20,40,20,43],[0,39,17,39],[26,40,26,43],[27,40,27,43],[28,40,28,43],[29,40,29,43],[30,40,30,43],[21,40,21,43],[22,40,22,43],[23,40,23,43],[24,40,24,43],[25,40,25,43],[25,1,25,2],[26,1,26,2],[27,1,27,2],[0,118,0,119],[1,118,1,119],[2,118,2,119],[18,82,18,116],[18,118,18,119],[18,46,18,80],[12,46,16,116],[0,41,0,42],[19,7,19,15],[1,1,1,11],[2,41,2,42],[20,1,20,2],[18,7,18,15],[23,7,23,15],[22,1,22,35],[6,2,6,15],[19,1,19,2],[18,1,18,2],[12,1,15,15],[10,12,10,15],[1,13,1,15],[37,40,37,43],[18,81,22,81],[0,45,17,45],[7,46,10,106],[4,46,6,106],[17,46,17,106],[17,1,17,35],[37,1,37,35],[38,7,38,15],[38,17,38,25],[38,27,38,35],[7,2,7,15],[9,2,9,15],[4,2,4,15],[5,2,5,15],[32,1,32,2],[33,1,33,2],[24,7,24,15],[25,7,25,15],[26,7,26,15],[34,1,34,2],[31,1,31,2],[24,1,24,2],[35,1,35,2],[55,2,55,15],[49,1,49,2],[28,1,28,2],[29,1,29,2],[30,1,30,2],[52,46,52,106],[39,2,40,2],[39,17,39,19],[39,23,39,25],[39,10,39,12],[39,27,39,29],[39,30,39,32],[39,33,39,35],[39,13,39,15],[39,20,39,22],[39,3,40,3],[39,4,40,4],[39,5,40,5],[44,1,44,2],[42,1,42,2],[41,1,41,2],[39,1,40,1],[39,7,39,9]]}
[null,null,null,null,null,null,null,null,null,null,null,null,null,null,null,null,null,null,null,null,null,null,null,null,null,null,null,null,null,null,null,null,null,null,null,null,null,null,null,"End of Cover Sheet",null,"Rapporteur's tools",null,null,null,"Start of Current Meeting Data",null,null,null,null,null,null,null,null,null,null,null,null,null,null,null,null,null,null,null,null,null,null,null,null,null,null,null,null,null,null,null,null,null,null,null,null,null,null,null,null,null,null,null,null,null,null,null,null,null,null,null,null,null,null,null,null,null,null,null,null,null,null,null,null,null,null,null,null,null,null,null,null,"Overall completion"]
[null,"3GPP TSG-RAN5 Meeting #92-e",null,null,null,null,null,null,null,null,null,null,null,"R5-215189",null,null,null,null,null,null,null,null,null,null,null,null,null,null,null,null,null,null,null,null,null,null,null,null,null,null,null,null,null,null,null,null,null,null,null,null,null,null,null,null,null,null,null,null,null,null,null,null,null,null,null,null,null,null,null,null,null,null,null,null,null,null,null,null,null,null,null,null,null,null,null,null,null,null,null,null,null,null,null,null,null,null,null,null,null,null,null,null,null,null,null,null,null,null,null,null,null,null,null,null,null,null,null,null,{"$f":"IF(OverallWp_SumWeights>0, (IF(AX26<>\"\",AX26*WP!AB10,0)+IF(AX27<>\"\",AX27*WP!AC10,0)+IF(AX28<>\"\",AX28*WP!AD10,0)+IF(AX30<>\"\",AX30*WP!AE10,0)+IF(AX31<>\"\",AX31*WP!AF10,0)+IF(AX32<>\"\",AX32*WP!AG10,0)+IF(AX34<>\"\",AX34*WP!AH10,0)+IF(AX35<>\"\",AX35*WP!AI10,0)+IF(AX36<>\"\",AX36*WP!AJ10,0))/OverallWp_SumWeights,0)","v":0.36112499999999992}]
[null,"Electronic Meeting, 16 – 27 August 2021",null,null,null,null,null,null,null,null,null,null,null,null,null,null,null,null,null,null,null,null,null,null,null,null,null,null,null,null,null,null,null,null,null,null,null,null,null,null,null,null,null,null,null,null,null,null,null,null,null,null,null,null,null,null,null,null,null,null,null,null,null,null,null,null,null,null,null,null,null,null,null,null,null,null,null,null,null,null,null,null,null,null,null,null,null,null,null,null,null,null,null,null,null,null,null,null,null,null,null,null,null,null,null,null,null,null,null,null,null,null,null,null,null,null,null,null,{"$f":"IFERROR(IF(CH20-DO2>0,CH20-DO2,0),0)","v":0}]
[]
[null,"Agenda Item:","7.4.2",null,null,null,null,null,null,null,null,null,null,null,null,null,null,null,null,null,null,null,null,null,null,null,null,null,null,null,null,null,null,null,null,null,null,null,null,null,null,null,"Edit/Protect status of cover sheet",null,null,null,null,null,null,null,null,null,null,null,null,null,null,null,null,null,null,null,null,null,null,null,null,null,null,null,null,null,null,null,null,null,null,null,null,null,null,null,null,null,null,null,null,null,null,null,null,null,null,null,null,null,null,null,null,null,null,null,null,null,null,null,null,null,null,null,null,null,null,null,null,null,null,null,null,"First status column in WP","Last status column in WP"]
[null,"Source:","Ligado Networks",null,null,null,null,null,null,null,null,null,null,null,null,null,null,null,null,null,null,null,null,null,null,null,null,null,null,null,null,null,null,null,null,null,null,null,null,null,null,null,"Protected",null,null,null,null,null,null,null,null,null,null,null,null,null,null,null,null,null,null,null,null,null,null,null,null,null,null,null,null,null,null,null,null,null,null,null,null,null,null,null,null,null,null,null,null,null,null,null,null,null,null,null,null,null,null,null,null,null,null,null,null,null,null,null,null,null,null,null,null,null,null,null,null,null,null,null,null,{"$f":"SUBSTITUTE(ADDRESS(1,COLUMN(StartOfWPstsCol)+1,4),\"1\",\"\")","v":"Q"},{"$f":"IF(WpAreaB_exist=FALSE,WpAreaA_Sub3_Column,IF(WpAreaC_exist=FALSE,WpAreaB_Sub3_Column,WpAreaC_Sub3_Column))","v":"S"}]
[null,"Title:","Work plan for Modification of LTE Band 24 Specifications to comply with updated regulatory emission limit",null,null,null,null,null,null,null,null,null,null,null,null,null,null,null,null,null,null,null,null,null,null,null,null,null,null,null,null,null,null,null,null,null,null,null,null,null,null,null,"Changed to Protected when switching worksheet",null,null,null,null,null,null,null,null,null,null,null,null,null,null,null,null,null,null,null,null,null,null,null,null,null,null,null,null,null,null,null,null,null,null,null,null,null,null,null,null,null,null,null,null,null,null,null,null,null,null,null,null,null,null,null,null,null,null,null,null,null,null,null,null,null,null,null,null,null,null,null,null,null,null,null,null,"First row WP items","Last row WP items"]
[null,"Work item code:","LTE_B24_mod-UEConTest",null,null,null,null,null,null,null,null,null,null,null,null,null,null,null,null,null,null,null,null,null,null,null,null,null,null,null,null,null,null,null,null,null,null,null,null,null,null,null,null,null,null,null,null,null,null,null,null,null,null,null,null,null,null,null,null,null,null,null,null,null,null,null,null,null,null,null,null,null,null,null,null,null,null,null,null,null,null,null,null,null,null,null,null,null,null,null,null,null,null,null,null,null,null,null,null,null,null,null,null,null,null,null,null,null,null,null,null,null,null,null,null,null,null,null,null,{"$f":"ROW(StartWpItems)","v":12},{"$f":"ROW(EndWPitems)","v":53}]
[null,"Release:","Rel-17"]
[null,"Document for:        ","Information",null,null,null,null,null,null,null,null,null,null,null,null,null,null,null,null,null,null,null,null,null,null,null,null,null,null,null,null,null,null,null,null,null,null,null,null,null,null,null,"Current baseline for progress indication:"]
[null,null,null,null,null,null,null,null,null,null,null,null,"RAN5 WP template v2.0",null,null,null,null,null,null,null,null,null,null,null,null,null,null,null,null,null,null,null,null,null,null,null,null,null,null,null,null,null,"2021-01-13 (09:27:52)"]
[null,"1. Introduction"]
[null,"At the RAN#91-e meeting in June 2021, a RAN5 work item for conformance test aspects related to the modification of the LTE Band 24 Specifications to comply with updated regulatory emission limits was approved [1]. The scope of this work is to assess and update affected conformance test cases related to LTE Band 24 in relevant conformance technical specifications.\n\nThe purpose of present document is to provide a work plan and status for the RAN5 work item related to updates necessary to the conformance specification as result of updates approved for LTE Band 24 in TS 36.101.  The work plan will be updated after each RAN5 meeting to give the status of the work item until the work is fully completed. ",null,null,null,null,null,null,null,null,null,null,null,null,null,null,null,null,null,null,null,null,null,null,null,null,null,null,null,null,null,null,null,null,null,null,null,null,null,null,null,null,null,null,null,null,"Source data used for calculating current status and progress from previous meeting"]
[]
[]
[]
[null,"2. Work item status"]
[null,"Estimation of WI overall completion:",null,null,null,null,null,null,null,null,null,null,null,null,null,null,null,null,null,null,null,null,null,null,null,null,null,null,null,null,null,null,null,null,null,null,null,null,null,null,null,null,null,null,null,null,"Start of source data"]
[null,"Area",null,"Completion\n\n","Number of new completed test cases\n(Note 1)","Number of new test cases",null,"Comments",null,null,null,null,null,null,null,null,null,null,null,null,null,null,null,null,null,null,null,null,null,null,null,null,null,null,null,null,null,null,"\n\n\n\n",null,"Don't remove this row",null,null,null,null,null,"Current meeting status",null,null,null,null,null,null,null,null,null,null,null,null,null,null,null,null,null,null,null,null,null,null,null,null,null,null,null,null,null,null,null,null,null,null,"End of Current Meeting Data","Previous meeting status baseline",null,null,null,null,null,null,null,null,null,null,null,null,null,null,null,null,null,null,null,null,null,null,null,null,null,null,null,null,null,null,null,null,null,null,null,"Sum WP weights"]
[null,"Overall completion\n",null,{"$f":"getProgress(AX20,CH20,\"%\",0,1)","v":"36%\n(+36%)"},{"$f":"getProgress(AY20,CI20,,,1)","v":""},{"$f":"getProgress(AZ20,CJ20,,,1)","v":""},null,null,null,null,null,null,null,null,null,null,null,null,null,null,null,null,null,null,null,null,null,null,null,null,null,null,null,null,null,null,null,null,null,null,"Don't remove this row",null,null,null,null,null,null,null,null,{"$f":"IF(OverallWp_SumWeights>0,DO2+DO3,\"\")","v":0.36112499999999992},{"$f":"IF(SUMPRODUCT(--(INDIRECT(WpIsNewTC_Rng)=\"Y\"),--(INDIRECT(WpOverall_Rng)=1),--(INDIRECT(WpWeight_Rng)>0))>0,SUMPRODUCT(--(INDIRECT(WpIsNewTC_Rng)=\"Y\"),--(INDIRECT(WpOverall_Rng)=1),INDIRECT(WpWeight_Rng)),IF(AZ20<>\"\",0,\"\"))","v":""},{"$f":"IF(SUMPRODUCT(--(INDIRECT(WpIsNewTC_Rng)=\"Y\"),--(INDIRECT(WpOverall_Rng)<>\"\"),--(INDIRECT(WpWeight_Rng)>0))<>0,SUMPRODUCT(--(INDIRECT(WpIsNewTC_Rng)=\"Y\"),--(INDIRECT(WpOverall_Rng)<>\"\"),INDIRECT(WpWeight_Rng)),\"\")","v":""},null,null,null,null,null,null,null,null,null,null,null,null,null,null,null,null,null,null,null,null,null,null,null,null,null,null,null,null,null,null,null,null,null,null,"","",null,null,null,null,null,null,null,null,null,null,null,null,null,null,null,null,null,null,null,null,null,null,null,null,null,null,null,null,null,null,"WP area A",{"$f":"IF(WpAreaA_exist,SUM(WP!AB10:AD10),0)","v":6}]
[null,"Completion Compensation ",null,{"$f":"IF(AND(D20<>\"\",DO3>0),DO3,\"-\")","v":"-"},null,null,null,null,null,null,null,null,null,null,null,null,null,null,null,null,null,null,null,null,null,null,null,null,null,null,null,null,null,null,null,null,null,null,null,null,"Don't remove this row",null,null,null,null,null,null,null,null,null,null,null,null,null,null,null,null,null,null,null,null,null,null,null,null,null,null,null,null,null,null,null,null,null,null,null,null,null,null,null,null,null,null,null,null,null,null,null,null,null,null,null,null,null,null,null,null,null,null,null,null,null,null,null,null,null,null,null,null,null,null,null,null,null,null,null,null,null,"WP area B",{"$f":"IF(WpAreaB_exist,SUM(WP!AE10:AG10),0)","v":0}]
["\n\n",null,"Note 1: ","Only test cases completed for all applicable WP areas and sub-areas are counted. For completed test cases per WP areas and WP sub-areas see below.",null,null,null,null,null,null,null,null,null,null,null,null,null,null,null,null,null,null,null,null,null,null,null,null,null,null,null,null,null,null,null,null,null,null,null,null,"Don't remove this row",null,null,null,null,null,null,null,null,null,null,null,null,null,null,null,null,null,null,null,null,null,null,null,null,null,null,null,null,null,null,null,null,null,null,null,null,null,null,null,null,null,null,null,null,null,null,null,null,null,null,null,null,null,null,null,null,null,null,null,null,null,null,null,null,null,null,null,null,null,null,null,null,null,null,null,null,null,"WP area C",{"$f":"IF(WpAreaC_exist,SUM(WP!AH10:AJ10),0)","v":0}]
[null,"Estimation WI completion per area and sub-area:",null,null,null,null,null,null,null,null,null,null,null,null,null,null,null,null,null,null,null,null,null,null,null,null,null,null,null,null,null,null,null,null,null,null,null,null,null,null,"Don't remove this row",null,null,null,null,null,null,null,null,null,null,null,null,null,null,null,null,null,null,null,null,null,null,null,null,null,null,null,null,null,null,null,null,null,null,null,null,null,null,null,null,null,null,null,null,null,null,null,null,null,null,null,null,null,null,null,null,null,null,null,null,null,null,null,null,null,null,null,null,null,null,null,null,null,null,null,null,null,"Overall",{"$f":"SUM(DP20:DP22)","v":6}]
["\n",null,null,"Completion\n\n","Number of new completed test cases","Number of new test cases",null,"Comments",null,null,null,null,null,null,null,null,null,null,null,null,null,null,null,null,null,null,null,null,null,null,null,null,null,null,null,null,null,null,"\n",null,"Don't remove this row",null,null,null,null,null,null,null,null,null,null,null,null,null,null,null,null,null,null,null,null,null,null,null,null,null,null,null,null,null,null,null,null,null,null,null,null,null,null,null,null,null,null,null,null,null,null,null,null,null,null,null,null,null,null,null,null,null,null,null,null,null,null,null,null,null,null,null,null,null,null,null,null,null,null,null,null,null,null,"Column","Range"]
["\n",{"$f":"IF(WpAreaA_exist,IF(WpAreaA_Sub2_exist,WpAreaA,WpAreaA & IF(WpAreaA_Sub1<>\"\",\" (\" & WpAreaA_Sub1 &\")\",\"\")),\"WP Scope not defined\")","v":"LTE (FDD)"},null,{"$f":"getProgress(AX25,CH25,\"%\",1,1)","v":"36.1%\n(+36.1%)"},{"$f":"getProgress(AY25,CI25,,,1)","v":""},{"$f":"getProgress(AZ25,CJ25,,,1)","v":""},null,null,null,null,null,null,null,null,null,null,null,null,null,null,null,null,null,null,null,null,null,null,null,null,null,null,null,null,null,null,null,null,null,null,"Don't remove this row",null,null,null,null,null,null,null,null,{"$f":"IF(WpAreaA_exist,IF(WpAreaA_SumWeights>0,(IF(AX26<>\"\",AX26*WP!$AB$10,0)+IF(AX27<>\"\",AX27*WP!$AC$10,0)+IF(AX28<>\"\",AX28*WP!$AD$10,0))/WpAreaA_SumWeights,\"\"),\"\")","v":0.36112499999999992},{"$f":"IF(WpAreaA_exist,IF(SUMPRODUCT(--(INDIRECT(WpIsNewTC_Rng)=\"Y\"),--(INDIRECT(WpAreaAoverall_Rng)=1),--(INDIRECT(WpWeight_Rng)>0))<>0,SUMPRODUCT(--(INDIRECT(WpIsNewTC_Rng)=\"Y\"),--(INDIRECT(WpAreaAoverall_Rng)=1),INDIRECT(WpWeight_Rng)),IF(AZ25<>\"\",0,\"\")),\"\")","v":""},{"$f":"IF(WpAreaA_exist,IF(SUMPRODUCT(--(INDIRECT(WpIsNewTC_Rng)=\"Y\"),--(INDIRECT(WpAreaAoverall_Rng)<>\"\"),--(INDIRECT(WpWeight_Rng)>0))<>0,SUMPRODUCT(--(INDIRECT(WpIsNewTC_Rng)=\"Y\"),--(INDIRECT(WpAreaAoverall_Rng)<>\"\"),INDIRECT(WpWeight_Rng)),\"\"),\"\")","v":""},null,null,null,null,null,null,null,null,null,null,null,null,null,null,null,null,null,null,null,null,null,null,null,null,null,null,null,null,null,null,null,null,null,"","","",null,null,null,null,null,null,null,null,null,null,null,null,null,null,null,null,null,null,null,null,null,null,null,null,null,null,null,null,null,null,"Is new text case",{"$f":"SUBSTITUTE(ADDRESS(1,COLUMN(WP!$B$6),4),\"1\",\"\")","v":"B"},{"$f":"\"WP!$\"&DP25&\"$\"&FirstRowWPitems&\":$\"&DP25&\"$\"&LastRowWPitems","v":"WP!$B$12:$B$53"}]
[null,{"$f":"IF(WpAreaA_exist,WpAreaA_Sub1,\"N/A\")","v":"FDD"},null,{"$f":"getProgress(AX26,CH26,\"%\",1,1)","v":"36.1%\n(+36.1%)"},{"$f":"getProgress(AY26,CI26,,,1)","v":""},{"$f":"getProgress(AZ26,CJ26,,,1)","v":""},null,null,null,null,null,null,null,null,null,null,null,null,null,null,null,null,null,null,null,null,null,null,null,null,null,null,null,null,null,null,null,null,null,null,"Don't remove this row",null,null,null,null,null,null,null,null,{"$f":"IF(WpAreaA_Sub1_exist,WP!$AB$8,\"\")","v":0.36112499999999992},{"$f":"IF(WpAreaA_exist,IF(SUMPRODUCT(--(INDIRECT(WpIsNewTC_Rng)=\"Y\"),--(INDIRECT(WpAreaA_Sub1_Rng)=1),--(INDIRECT(WpWeight_Rng)>0))<>0,SUMPRODUCT(--(INDIRECT(WpIsNewTC_Rng)=\"Y\"),--(INDIRECT(WpAreaA_Sub1_Rng)=1),INDIRECT(WpWeight_Rng)),IF(AZ26<>\"\",0,\"\")),\"\")","v":""},{"$f":"IF(WpAreaA_exist,IF(SUMPRODUCT(--(INDIRECT(WpIsNewTC_Rng)=\"Y\"),--(INDIRECT(WpAreaA_Sub1_Rng)<>\"\"),--(INDIRECT(WpWeight_Rng)>0))<>0,SUMPRODUCT(--(INDIRECT(WpIsNewTC_Rng)=\"Y\"),--(INDIRECT(WpAreaA_Sub1_Rng)<>\"\"),INDIRECT(WpWeight_Rng)),\"\"),\"\")","v":""},null,null,null,null,null,null,null,null,null,null,null,null,null,null,null,null,null,null,null,null,null,null,null,null,null,null,null,null,null,null,null,null,null,"","","",null,null,null,null,null,null,null,null,null,null,null,null,null,null,null,null,null,null,null,null,null,null,null,null,null,null,null,null,null,null,"TS/TR",{"$f":"SUBSTITUTE(ADDRESS(1,COLUMN(WP!$C$6),4),\"1\",\"\")","v":"C"},"WP!$C$12:$C$53"]
[null,{"$f":"IF(WpAreaA_exist,WpAreaA_Sub2,\"N/A\")","v":"N/A"},null,{"$f":"getProgress(AX27,CH27,\"%\",1,1)","v":""},{"$f":"getProgress(AY27,CI27,,,1)","v":""},{"$f":"getProgress(AZ27,CJ27,,,1)","v":""},null,null,null,null,null,null,null,null,null,null,null,null,null,null,null,null,null,null,null,null,null,null,null,null,null,null,null,null,null,null,null,null,null,null,"Don't remove this row",null,null,null,null,null,null,null,null,{"$f":"IF(WpAreaA_Sub2_exist,WP!$AC$8,\"\")","v":""},{"$f":"IF(WpAreaA_exist,IF(SUMPRODUCT(--(INDIRECT(WpIsNewTC_Rng)=\"Y\"),--(INDIRECT(WpAreaA_Sub2_Rng)=1),--(INDIRECT(WpWeight_Rng)>0))<>0,SUMPRODUCT(--(INDIRECT(WpIsNewTC_Rng)=\"Y\"),--(INDIRECT(WpAreaA_Sub2_Rng)=1),INDIRECT(WpWeight_Rng)),IF(AZ27<>\"\",0,\"\")),\"\")","v":""},{"$f":"IF(WpAreaA_exist,IF(SUMPRODUCT(--(INDIRECT(WpIsNewTC_Rng)=\"Y\"),--(INDIRECT(WpAreaA_Sub2_Rng)<>\"\"),--(INDIRECT(WpWeight_Rng)>0))<>0,SUMPRODUCT(--(INDIRECT(WpIsNewTC_Rng)=\"Y\"),--(INDIRECT(WpAreaA_Sub2_Rng)<>\"\"),INDIRECT(WpWeight_Rng)),\"\"),\"\")","v":""},null,null,null,null,null,null,null,null,null,null,null,null,null,null,null,null,null,null,null,null,null,null,null,null,null,null,null,null,null,null,null,null,null,"","","",null,null,null,null,null,null,null,null,null,null,null,null,null,null,null,null,null,null,null,null,null,null,null,null,null,null,null,null,null,null,"Weight",{"$f":"SUBSTITUTE(ADDRESS(1,COLUMN(WP!$K$6),4),\"1\",\"\")","v":"K"},"WP!$K$12:$K$53"]
[null,{"$f":"IF(WpAreaA_exist,WpAreaA_Sub3,\"N/A\")","v":"N/A"},null,{"$f":"getProgress(AX28,CH28,\"%\",1,1)","v":""},{"$f":"getProgress(AY28,CI28,,,1)","v":""},{"$f":"getProgress(AZ28,CJ28,,,1)","v":""},null,null,null,null,null,null,null,null,null,null,null,null,null,null,null,null,null,null,null,null,null,null,null,null,null,null,null,null,null,null,null,null,"\n",null,"Don't remove this row",null,null,null,null,null,null,null,null,{"$f":"IF(WpAreaA_Sub3_exist,WP!$AD$8,\"\")","v":""},{"$f":"IF(WpAreaA_exist,IF(SUMPRODUCT(--(INDIRECT(WpIsNewTC_Rng)=\"Y\"),--(INDIRECT(WpAreaA_Sub3_Rng)=1),--(INDIRECT(WpWeight_Rng)>0))<>0,SUMPRODUCT(--(INDIRECT(WpIsNewTC_Rng)=\"Y\"),--(INDIRECT(WpAreaA_Sub3_Rng)=1),INDIRECT(WpWeight_Rng)),IF(AZ28<>\"\",0,\"\")),\"\")","v":""},{"$f":"IF(WpAreaA_exist,IF(SUMPRODUCT(--(INDIRECT(WpIsNewTC_Rng)=\"Y\"),--(INDIRECT(WpAreaA_Sub3_Rng)<>\"\"),--(INDIRECT(WpWeight_Rng)>0))<>0,SUMPRODUCT(--(INDIRECT(WpIsNewTC_Rng)=\"Y\"),--(INDIRECT(WpAreaA_Sub3_Rng)<>\"\"),INDIRECT(WpWeight_Rng)),\"\"),\"\")","v":""},null,null,null,null,null,null,null,null,null,null,null,null,null,null,null,null,null,null,null,null,null,null,null,null,null,null,null,null,null,null,null,null,null,"","","",null,null,null,null,null,null,null,null,null,null,null,null,null,null,null,null,null,null,null,null,null,null,null,null,null,null,null,null,null,null,"Overall",{"$f":"SUBSTITUTE(ADDRESS(1,COLUMN(WP!$AB$6),4),\"1\",\"\")","v":"AB"},"WP!$AB$12:$AB$53"]
[null,{"$f":"IF(WpAreaB_exist,WpAreaB,\"N/A\")","v":"N/A"},null,{"$f":"getProgress(AX29,CH29,\"%\",1,1,WpAreaB_exist)","v":""},{"$f":"getProgress(AY29,CI29,,,1,WpAreaB_exist)","v":""},{"$f":"getProgress(AZ29,CJ29,,,1,WpAreaB_exist)","v":""},null,null,null,null,null,null,null,null,null,null,null,null,null,null,null,null,null,null,null,null,null,null,null,null,null,null,null,null,null,null,null,null,"\n",null,"Don't remove this row",null,null,null,null,null,null,null,null,{"$f":"IF(WpAreaB_exist,IF(WpAreaB_SumWeights>0,(IF(AX30<>\"\",AX30*WP!$AE$10,0)+IF(AX31<>\"\",AX31*WP!$AF$10,0)+IF(AX32<>\"\",AX32*WP!$AG$10,0))/WpAreaB_SumWeights,\"\"),\"\")","v":""},{"$f":"IF(WpAreaB_exist,IF(SUMPRODUCT(--(INDIRECT(WpIsNewTC_Rng)=\"Y\"),--(INDIRECT(WpAreaBoverall_Rng)=1),--(INDIRECT(WpWeight_Rng)>0))<>0,SUMPRODUCT(--(INDIRECT(WpIsNewTC_Rng)=\"Y\"),--(INDIRECT(WpAreaBoverall_Rng)=1),INDIRECT(WpWeight_Rng)),IF(AZ29<>\"\",0,\"\")),\"\")","v":""},{"$f":"IF(WpAreaB_exist,IF(SUMPRODUCT(--(INDIRECT(WpIsNewTC_Rng)=\"Y\"),--(INDIRECT(WpAreaBoverall_Rng)<>\"\"),--(INDIRECT(WpWeight_Rng)>0))<>0,SUMPRODUCT(--(INDIRECT(WpIsNewTC_Rng)=\"Y\"),--(INDIRECT(WpAreaBoverall_Rng)<>\"\"),INDIRECT(WpWeight_Rng)),\"\"),\"\")","v":""},null,null,null,null,null,null,null,null,null,null,null,null,null,null,null,null,null,null,null,null,null,null,null,null,null,null,null,null,null,null,null,null,null,"","","",null,null,null,null,null,null,null,null,null,null,null,null,null,null,null,null,null,null,null,null,null,null,null,null,null,null,null,null,null,null,"Overall Area A",{"$f":"SUBSTITUTE(ADDRESS(1,COLUMN(WP!$AC$6),4),\"1\",\"\")","v":"AC"},"WP!$AC$12:$AC$53"]
[null,{"$f":"IF(WpAreaB_exist,WpAreaB_Sub1,\"N/A\")","v":"N/A"},null,{"$f":"getProgress(AX30,CH30,\"%\",1,1,WpAreaB_exist)","v":""},{"$f":"getProgress(AY30,CI30,,,1,WpAreaB_exist)","v":""},{"$f":"getProgress(AZ30,CJ30,,,1,WpAreaB_exist)","v":""},null,null,null,null,null,null,null,null,null,null,null,null,null,null,null,null,null,null,null,null,null,null,null,null,null,null,null,null,null,null,null,null,null,null,"Don't remove this row",null,null,null,null,null,null,null,null,{"$f":"IF(WpAreaB_exist,WP!$AE$8,\"\")","v":""},{"$f":"IF(WpAreaB_exist,IF(SUMPRODUCT(--(INDIRECT(WpIsNewTC_Rng)=\"Y\"),--(INDIRECT(WpAreaB_Sub1_Rng)=1),--(INDIRECT(WpWeight_Rng)>0))<>0,SUMPRODUCT(--(INDIRECT(WpIsNewTC_Rng)=\"Y\"),--(INDIRECT(WpAreaB_Sub1_Rng)=1),INDIRECT(WpWeight_Rng)),IF(AZ30<>\"\",0,\"\")),\"\")","v":""},{"$f":"IF(WpAreaB_exist,IF(SUMPRODUCT(--(INDIRECT(WpIsNewTC_Rng)=\"Y\"),--(INDIRECT(WpAreaB_Sub1_Rng)<>\"\"),--(INDIRECT(WpWeight_Rng)>0))<>0,SUMPRODUCT(--(INDIRECT(WpIsNewTC_Rng)=\"Y\"),--(INDIRECT(WpAreaB_Sub1_Rng)<>\"\"),INDIRECT(WpWeight_Rng)),\"\"),\"\")","v":""},null,null,null,null,null,null,null,null,null,null,null,null,null,null,null,null,null,null,null,null,null,null,null,null,null,null,null,null,null,null,null,null,null,"","","",null,null,null,null,null,null,null,null,null,null,null,null,null,null,null,null,null,null,null,null,null,null,null,null,null,null,null,null,null,null,"Overall Area B",{"$f":"SUBSTITUTE(ADDRESS(1,COLUMN(WP!$AD$6),4),\"1\",\"\")","v":"AD"},"WP!$AD$12:$AD$53"]
[null,{"$f":"IF(WpAreaB_exist,WpAreaB_Sub2,\"N/A\")","v":"N/A"},null,{"$f":"getProgress(AX31,CH31,\"%\",1,1,WpAreaB_exist)","v":""},{"$f":"getProgress(AY31,CI31,,,1,WpAreaB_exist)","v":""},{"$f":"getProgress(AZ31,CJ31,,,1,WpAreaB_exist)","v":""},null,null,null,null,null,null,null,null,null,null,null,null,null,null,null,null,null,null,null,null,null,null,null,null,null,null,null,null,null,null,null,null,null,null,"Don't remove this row",null,null,null,null,null,null,null,null,{"$f":"IF(WpAreaB_exist,WP!$AF$8,\"\")","v":""},{"$f":"IF(WpAreaB_exist,IF(SUMPRODUCT(--(INDIRECT(WpIsNewTC_Rng)=\"Y\"),--(INDIRECT(WpAreaB_Sub2_Rng)=1),--(INDIRECT(WpWeight_Rng)>0))<>0,SUMPRODUCT(--(INDIRECT(WpIsNewTC_Rng)=\"Y\"),--(INDIRECT(WpAreaB_Sub2_Rng)=1),INDIRECT(WpWeight_Rng)),IF(AZ31<>\"\",0,\"\")),\"\")","v":""},{"$f":"IF(WpAreaB_exist,IF(SUMPRODUCT(--(INDIRECT(WpIsNewTC_Rng)=\"Y\"),--(INDIRECT(WpAreaB_Sub2_Rng)<>\"\"),--(INDIRECT(WpWeight_Rng)>0))<>0,SUMPRODUCT(--(INDIRECT(WpIsNewTC_Rng)=\"Y\"),--(INDIRECT(WpAreaB_Sub2_Rng)<>\"\"),INDIRECT(WpWeight_Rng)),\"\"),\"\")","v":""},null,null,null,null,null,null,null,null,null,null,null,null,null,null,null,null,null,null,null,null,null,null,null,null,null,null,null,null,null,null,null,null,null,"","","",null,null,null,null,null,null,null,null,null,null,null,null,null,null,null,null,null,null,null,null,null,null,null,null,null,null,null,null,null,null,"Overall Area C",{"$f":"SUBSTITUTE(ADDRESS(1,COLUMN(WP!$AE$6),4),\"1\",\"\")","v":"AE"},"WP!$AE$12:$AE$53"]
[null,{"$f":"IF(WpAreaB_exist,WpAreaB_Sub3,\"N/A\")","v":"N/A"},null,{"$f":"getProgress(AX32,CH32,\"%\",1,1,WpAreaB_exist)","v":""},{"$f":"getProgress(AY32,CI32,,,1,WpAreaB_exist)","v":""},{"$f":"getProgress(AZ32,CJ32,,,1,WpAreaB_exist)","v":""},null,null,null,null,null,null,null,null,null,null,null,null,null,null,null,null,null,null,null,null,null,null,null,null,null,null,null,null,null,null,null,null,null,null,"Don't remove this row",null,null,null,null,null,null,null,null,{"$f":"IF(WpAreaB_exist,WP!$AG$8,\"\")","v":""},{"$f":"IF(WpAreaB_exist,IF(SUMPRODUCT(--(INDIRECT(WpIsNewTC_Rng)=\"Y\"),--(INDIRECT(WpAreaB_Sub3_Rng)=1),--(INDIRECT(WpWeight_Rng)>0))<>0,SUMPRODUCT(--(INDIRECT(WpIsNewTC_Rng)=\"Y\"),--(INDIRECT(WpAreaB_Sub3_Rng)=1),INDIRECT(WpWeight_Rng)),IF(AZ32<>\"\",0,\"\")),\"\")","v":""},{"$f":"IF(WpAreaB_exist,IF(SUMPRODUCT(--(INDIRECT(WpIsNewTC_Rng)=\"Y\"),--(INDIRECT(WpAreaB_Sub3_Rng)<>\"\"),--(INDIRECT(WpWeight_Rng)>0))<>0,SUMPRODUCT(--(INDIRECT(WpIsNewTC_Rng)=\"Y\"),--(INDIRECT(WpAreaB_Sub3_Rng)<>\"\"),INDIRECT(WpWeight_Rng)),\"\"),\"\")","v":""},null,null,null,null,null,null,null,null,null,null,null,null,null,null,null,null,null,null,null,null,null,null,null,null,null,null,null,null,null,null,null,null,null,"","","",null,null,null,null,null,null,null,null,null,null,null,null,null,null,null,null,null,null,null,null,null,null,null,null,null,null,null,null,null,null,"WP area A Sub1",{"$f":"SUBSTITUTE(ADDRESS(1,COLUMN(WP!$Q$6),4),\"1\",\"\")","v":"Q"},"WP!$Q$12:$Q$53"]
[null,{"$f":"IF(WpAreaC_exist,WpAreaC,\"N/A\")","v":"N/A"},null,{"$f":"getProgress(AX33,CH33,\"%\",1,1,WpAreaC_exist)","v":""},{"$f":"getProgress(AY33,CI33,,,1,WpAreaC_exist)","v":""},{"$f":"getProgress(AZ33,CJ33,,,1,WpAreaC_exist)","v":""},null,null,null,null,null,null,null,null,null,null,null,null,null,null,null,null,null,null,null,null,null,null,null,null,null,null,null,null,null,null,null,null,null,null,"Don't remove this row",null,null,null,null,null,null,null,null,{"$f":"IF(WpAreaC_exist,IF(WpAreaC_SumWeights>0,(IF(AX34<>\"\",AX34*WP!$AH$10,0)+IF(AX35<>\"\",AX35*WP!$AI$10,0)+IF(AX36<>\"\",AX36*WP!$AJ$10,0))/WpAreaC_SumWeights,\"\"),\"\")","v":""},{"$f":"IF(WpAreaC_exist,IF(SUMPRODUCT(--(INDIRECT(WpIsNewTC_Rng)=\"Y\"),--(INDIRECT(WpAreaCoverall_Rng)=1),--(INDIRECT(WpWeight_Rng)>0))<>0,SUMPRODUCT(--(INDIRECT(WpIsNewTC_Rng)=\"Y\"),--(INDIRECT(WpAreaCoverall_Rng)=1),INDIRECT(WpWeight_Rng)),IF(AZ33<>\"\",0,\"\")),\"\")","v":""},{"$f":"IF(WpAreaC_exist,IF(SUMPRODUCT(--(INDIRECT(WpIsNewTC_Rng)=\"Y\"),--(INDIRECT(WpAreaCoverall_Rng)<>\"\"),--(INDIRECT(WpWeight_Rng)>0))<>0,SUMPRODUCT(--(INDIRECT(WpIsNewTC_Rng)=\"Y\"),--(INDIRECT(WpAreaCoverall_Rng)<>\"\"),INDIRECT(WpWeight_Rng)),\"\"),\"\")","v":""},null,null,null,null,null,null,null,null,null,null,null,null,null,null,null,null,null,null,null,null,null,null,null,null,null,null,null,null,null,null,null,null,null,"","","",null,null,null,null,null,null,null,null,null,null,null,null,null,null,null,null,null,null,null,null,null,null,null,null,null,null,null,null,null,null,"WP area A Sub2",{"$f":"SUBSTITUTE(ADDRESS(1,COLUMN(WP!$R$6),4),\"1\",\"\")","v":"R"},"WP!$R$12:$R$53"]
[null,{"$f":"IF(WpAreaC_exist,WpAreaC_Sub1,\"N/A\")","v":"N/A"},null,{"$f":"getProgress(AX34,CH34,\"%\",1,1,WpAreaC_exist)","v":""},{"$f":"getProgress(AY34,CI34,,,1,WpAreaC_exist)","v":""},{"$f":"getProgress(AZ34,CJ34,,,1,WpAreaC_exist)","v":""},null,null,null,null,null,null,null,null,null,null,null,null,null,null,null,null,null,null,null,null,null,null,null,null,null,null,null,null,null,null,null,null,null,null,"Don't remove this row",null,null,null,null,null,null,null,null,{"$f":"IF(WpAreaC_exist,WP!$AH$8,\"\")","v":""},{"$f":"IF(WpAreaC_exist,IF(SUMPRODUCT(--(INDIRECT(WpIsNewTC_Rng)=\"Y\"),--(INDIRECT(WpAreaC_Sub1_Rng)=1),--(INDIRECT(WpWeight_Rng)>0))<>0,SUMPRODUCT(--(INDIRECT(WpIsNewTC_Rng)=\"Y\"),--(INDIRECT(WpAreaC_Sub1_Rng)=1),INDIRECT(WpWeight_Rng)),IF(AZ34<>\"\",0,\"\")),\"\")","v":""},{"$f":"IF(WpAreaC_exist,IF(SUMPRODUCT(--(INDIRECT(WpIsNewTC_Rng)=\"Y\"),--(INDIRECT(WpAreaC_Sub1_Rng)<>\"\"),--(INDIRECT(WpWeight_Rng)>0))<>0,SUMPRODUCT(--(INDIRECT(WpIsNewTC_Rng)=\"Y\"),--(INDIRECT(WpAreaC_Sub1_Rng)<>\"\"),INDIRECT(WpWeight_Rng)),\"\"),\"\")","v":""},null,null,null,null,null,null,null,null,null,null,null,null,null,null,null,null,null,null,null,null,null,null,null,null,null,null,null,null,null,null,null,null,null,"","","",null,null,null,null,null,null,null,null,null,null,null,null,null,null,null,null,null,null,null,null,null,null,null,null,null,null,null,null,null,null,"WP area A Sub3",{"$f":"SUBSTITUTE(ADDRESS(1,COLUMN(WP!$S$6),4),\"1\",\"\")","v":"S"},"WP!$S$12:$S$53"]
[null,{"$f":"IF(WpAreaC_exist,WpAreaC_Sub2,\"N/A\")","v":"N/A"},null,{"$f":"getProgress(AX35,CH35,\"%\",1,1,WpAreaC_exist)","v":""},{"$f":"getProgress(AY35,CI35,,,1,WpAreaC_exist)","v":""},{"$f":"getProgress(AZ35,CJ35,,,1,WpAreaC_exist)","v":""},null,null,null,null,null,null,null,null,null,null,null,null,null,null,null,null,null,null,null,null,null,null,null,null,null,null,null,null,null,null,null,null,null,null,"Don't remove this row",null,null,null,null,null,null,null,null,{"$f":"IF(WpAreaC_exist,WP!$AI$8,\"\")","v":""},{"$f":"IF(WpAreaC_exist,IF(SUMPRODUCT(--(INDIRECT(WpIsNewTC_Rng)=\"Y\"),--(INDIRECT(WpAreaC_Sub2_Rng)=1),--(INDIRECT(WpWeight_Rng)>0))<>0,SUMPRODUCT(--(INDIRECT(WpIsNewTC_Rng)=\"Y\"),--(INDIRECT(WpAreaC_Sub2_Rng)=1),INDIRECT(WpWeight_Rng)),IF(AZ35<>\"\",0,\"\")),\"\")","v":""},{"$f":"IF(WpAreaC_exist,IF(SUMPRODUCT(--(INDIRECT(WpIsNewTC_Rng)=\"Y\"),--(INDIRECT(WpAreaC_Sub2_Rng)<>\"\"),--(INDIRECT(WpWeight_Rng)>0))<>0,SUMPRODUCT(--(INDIRECT(WpIsNewTC_Rng)=\"Y\"),--(INDIRECT(WpAreaC_Sub2_Rng)<>\"\"),INDIRECT(WpWeight_Rng)),\"\"),\"\")","v":""},null,null,null,null,null,null,null,null,null,null,null,null,null,null,null,null,null,null,null,null,null,null,null,null,null,null,null,null,null,null,null,null,null,"","","",null,null,null,null,null,null,null,null,null,null,null,null,null,null,null,null,null,null,null,null,null,null,null,null,null,null,null,null,null,null,"WP area B Sub1",{"$f":"SUBSTITUTE(ADDRESS(1,COLUMN(WP!$T$6),4),\"1\",\"\")","v":"T"},"WP!$T$12:$T$53"]
[null,{"$f":"IF(WpAreaC_exist,WpAreaC_Sub3,\"N/A\")","v":"N/A"},null,{"$f":"getProgress(AX36,CH36,\"%\",1,1,WpAreaC_exist)","v":""},{"$f":"getProgress(AY36,CI36,,,1,WpAreaC_exist)","v":""},{"$f":"getProgress(AZ36,CJ36,,,1,WpAreaC_exist)","v":""},null,null,null,null,null,null,null,null,null,null,null,null,null,null,null,null,null,null,null,null,null,null,null,null,null,null,null,null,null,null,null,null,null,null,"Don't remove this row",null,null,null,null,null,null,null,null,{"$f":"IF(WpAreaC_exist,WP!$AJ$8,\"\")","v":""},{"$f":"IF(WpAreaC_exist,IF(SUMPRODUCT(--(INDIRECT(WpIsNewTC_Rng)=\"Y\"),--(INDIRECT(WpAreaC_Sub3_Rng)=1),--(INDIRECT(WpWeight_Rng)>0))<>0,SUMPRODUCT(--(INDIRECT(WpIsNewTC_Rng)=\"Y\"),--(INDIRECT(WpAreaC_Sub3_Rng)=1),INDIRECT(WpWeight_Rng)),IF(AZ36<>\"\",0,\"\")),\"\")","v":""},{"$f":"IF(WpAreaC_exist,IF(SUMPRODUCT(--(INDIRECT(WpIsNewTC_Rng)=\"Y\"),--(INDIRECT(WpAreaC_Sub3_Rng)<>\"\"),--(INDIRECT(WpWeight_Rng)>0))<>0,SUMPRODUCT(--(INDIRECT(WpIsNewTC_Rng)=\"Y\"),--(INDIRECT(WpAreaC_Sub3_Rng)<>\"\"),INDIRECT(WpWeight_Rng)),\"\"),\"\")","v":""},null,null,null,null,null,null,null,null,null,null,null,null,null,null,null,null,null,null,null,null,null,null,null,null,null,null,null,null,null,null,null,null,null,"","","",null,null,null,null,null,null,null,null,null,null,null,null,null,null,null,null,null,null,null,null,null,null,null,null,null,null,null,null,null,null,"WP area B Sub2",{"$f":"SUBSTITUTE(ADDRESS(1,COLUMN(WP!$U$6),4),\"1\",\"\")","v":"U"},"WP!$U$12:$U$53"]
[null,null,null,null,null,null,null,null,null,null,null,null,null,null,null,null,null,null,null,null,null,null,null,null,null,null,null,null,null,null,null,null,null,null,null,null,null,null,null,null,"Don't remove this row",null,null,null,null,null,null,null,null,null,null,null,{"$f":"WpAreaA<>\"N/A\"","v":true},null,null,null,null,null,null,null,null,null,{"$f":"WpAreaB<>\"N/A\"","v":false},null,null,null,null,null,null,null,null,null,{"$f":"WpAreaC<>\"N/A\"","v":false},null,null,null,null,null,null,null,null,null,null,null,null,null,null,null,true,null,null,null,null,null,null,null,null,null,true,null,null,null,null,null,null,null,null,null,true,null,null,null,null,null,null,null,null,null,"WP area B Sub3",{"$f":"SUBSTITUTE(ADDRESS(1,COLUMN(WP!$V$6),4),\"1\",\"\")","v":"V"},"WP!$V$12:$V$53"]
[null,"Estimation of completion per TS (area):",null,null,null,null,null,null,null,null,null,null,null,null,null,null,null,null,null,null,null,null,null,null,null,null,null,null,null,null,null,null,null,null,null,null,null,null,null,null,"Don't remove this row",null,null,null,null,null,null,null,null,null,null,null,{"$f":"WpAreaA_Sub1<>\"N/A\"","v":true},null,null,{"$f":"WpAreaA_Sub2<>\"N/A\"","v":false},null,null,{"$f":"WpAreaA_Sub3<>\"N/A\"","v":false},null,null,null,{"$f":"WpAreaB_Sub1<>\"N/A\"","v":false},null,null,{"$f":"WpAreaB_Sub2<>\"N/A\"","v":false},null,null,{"$f":"WpAreaB_Sub3<>\"N/A\"","v":false},null,null,null,{"$f":"WpAreaC_Sub1<>\"N/A\"","v":false},null,null,{"$f":"WpAreaC_Sub2<>\"N/A\"","v":false},null,null,{"$f":"WpAreaC_Sub3<>\"N/A\"","v":false},null,null,null,null,null,null,null,null,null,true,null,null,true,null,null,true,null,null,null,true,null,null,true,null,null,true,null,null,null,true,null,null,true,null,null,true,null,null,null,"WP area C Sub1",{"$f":"SUBSTITUTE(ADDRESS(1,COLUMN(WP!$W$6),4),\"1\",\"\")","v":"W"},"WP!$W$12:$W$53"]
[null,null,null,"TS/TR overall completion",null,null,null,{"$f":"WpAreaA","v":"LTE"},null,null,null,null,null,null,null,null,null,{"$f":"WpAreaB","v":"N/A"},null,null,null,null,null,null,null,null,null,{"$f":"WpAreaC","v":"N/A"},null,null,null,null,null,null,null,null,null,null,null,null,"Don't remove this row",null,null,null,null,null,null,null,null,"Overall",null,null,{"$f":"IF(WpAreaA<>\"\",WpAreaA,\"N/A\")","v":"LTE"},null,null,null,null,null,null,null,null,null,{"$f":"IF(WpAreaB<>\"\",WpAreaB,\"N/A\")","v":"N/A"},null,null,null,null,null,null,null,null,null,{"$f":"IF(WpAreaC<>\"\",WpAreaC,\"N/A\")","v":"N/A"},null,null,null,null,null,null,null,null,null,null,null,null,"Overall",null,null,"SA Option 2 (SA NR)",null,null,null,null,null,null,null,null,null,"NSA Option 3 (EN-DC)",null,null,null,null,null,null,null,null,null,"LTE",null,null,null,null,null,null,null,null,null,"WP area C Sub2",{"$f":"SUBSTITUTE(ADDRESS(1,COLUMN(WP!$X$6),4),\"1\",\"\")","v":"X"},{"$f":"\"WP!$\"&DP39&\"$\"&FirstRowWPitems&\":$\"&DP39&\"$\"&LastRowWPitems","v":"WP!$X$12:$X$53"}]
[null,"TS/TR Scope\n","TS/TR\n","Completion","Number of new completed test cases","Number of new test cases",null,{"$f":"IF(WpAreaA_Sub1_exist,WpAreaA_Sub1,\"\")","v":"FDD"},null,null,{"$f":"IF(WpAreaA_Sub2_exist,WpAreaA_Sub2,\"\")","v":""},null,null,null,null,null,null,{"$f":"IF(WpAreaB_Sub1_exist,WpAreaB_Sub1,\"\")","v":""},null,null,{"$f":"IF(WpAreaB_Sub2_exist,WpAreaB_Sub2,\"\")","v":""},null,null,{"$f":"IF(WpAreaB_Sub3_exist,WpAreaB_Sub3,\"\")","v":""},null,null,null,{"$f":"IF(WpAreaC_Sub1_exist,WpAreaC_Sub1,\"\")","v":""},null,null,{"$f":"IF(WpAreaC_Sub2_exist,WpAreaC_Sub2,\"\")","v":""},null,null,{"$f":"IF(WpAreaC_Sub3_exist,WpAreaC_Sub3,\"\")","v":""},null,null,null,null,null,null,"Don't remove this row",null,null,null,null,null,null,null,null,null,null,null,{"$f":"WpAreaA_Sub1","v":"FDD"},null,null,{"$f":"WpAreaA_Sub2","v":"N/A"},null,null,{"$f":"WpAreaA_Sub3","v":"N/A"},null,null,null,{"$f":"WpAreaB_Sub1","v":"N/A"},null,null,{"$f":"WpAreaB_Sub2","v":"N/A"},null,null,{"$f":"WpAreaB_Sub3","v":"N/A"},null,null,null,{"$f":"WpAreaC_Sub1","v":"N/A"},null,null,{"$f":"WpAreaB_Sub2","v":"N/A"},null,null,{"$f":"WpAreaB_Sub3","v":"N/A"},null,null,null,null,null,null,null,null,null,"FR1",null,null,"FR2",null,null,"FR1 + FR2",null,null,null,"FR1",null,null,"FR2",null,null,"FR1 + FR2",null,null,null,"FDD",null,null,"FR2",null,null,"FR1 + FR2",null,null,null,"WP area C Sub3",{"$f":"SUBSTITUTE(ADDRESS(1,COLUMN(WP!$Y$6),4),\"1\",\"\")","v":"Y"},"WP!$Y$12:$Y$53"]
[null,null,null,null,null,null,null,{"$f":"IF(WpAreaA_Sub1_exist,\"Completion\",\"\")","v":"Completion"},{"$f":"IF(WpAreaA_Sub1_exist,\"Number of new completed test cases\",\"\")","v":"Number of new completed test cases"},{"$f":"IF(WpAreaA_Sub1_exist,\"Number of new test cases\",\"\")","v":"Number of new test cases"},{"$f":"IF(WpAreaA_Sub2_exist,\"Completion\",\"\")","v":""},{"$f":"IF(WpAreaA_Sub2_exist,\"Number of new completed test cases\",\"\")","v":""},{"$f":"IF(WpAreaA_Sub2_exist,\"Number of new test cases\",\"\")","v":""},{"$f":"IF(WpAreaA_Sub3_exist,\"Completion\",\"\")","v":""},{"$f":"IF(WpAreaA_Sub3_exist,\"Number of new completed test cases\",\"\")","v":""},{"$f":"IF(WpAreaA_Sub3_exist,\"Number of new test cases\",\"\")","v":""},null,{"$f":"IF(WpAreaB_Sub1_exist,\"Completion\",\"\")","v":""},{"$f":"IF(WpAreaB_Sub1_exist,\"Number of new completed test cases\",\"\")","v":""},{"$f":"IF(WpAreaB_Sub1_exist,\"Number of new test cases\",\"\")","v":""},{"$f":"IF(WpAreaB_Sub2_exist,\"Completion\",\"\")","v":""},{"$f":"IF(WpAreaB_Sub2_exist,\"Number of new completed test cases\",\"\")","v":""},{"$f":"IF(WpAreaB_Sub2_exist,\"Number of new test cases\",\"\")","v":""},{"$f":"IF(WpAreaB_Sub3_exist,\"Completion\",\"\")","v":""},{"$f":"IF(WpAreaB_Sub3_exist,\"Number of new completed test cases\",\"\")","v":""},{"$f":"IF(WpAreaB_Sub3_exist,\"Number of new test cases\",\"\")","v":""},null,{"$f":"IF(WpAreaC_Sub1_exist,\"Completion\",\"\")","v":""},{"$f":"IF(WpAreaC_Sub1_exist,\"Number of new completed test cases\",\"\")","v":""},{"$f":"IF(WpAreaC_Sub1_exist,\"Number of new test cases\",\"\")","v":""},{"$f":"IF(WpAreaC_Sub2_exist,\"Completion\",\"\")","v":""},{"$f":"IF(WpAreaC_Sub2_exist,\"Number of new completed test cases\",\"\")","v":""},{"$f":"IF(WpAreaC_Sub2_exist,\"Number of new test cases\",\"\")","v":""},{"$f":"IF(WpAreaC_Sub3_exist,\"Completion\",\"\")","v":""},{"$f":"IF(WpAreaC_Sub3_exist,\"Number of new completed test cases\",\"\")","v":""},{"$f":"IF(WpAreaC_Sub3_exist,\"Number of new test cases\",\"\")","v":""},null,null,null,null,"Don't remove this row",null,null,null,null,null,null,null,null,{"$f":"SUBSTITUTE(ADDRESS(1,COLUMN(WP!$AB:$AB),4),\"1\",\"\")","v":"AB"},null,null,{"$f":"SUBSTITUTE(ADDRESS(1,COLUMN(WP!$Q:$Q),4),\"1\",\"\")","v":"Q"},null,null,{"$f":"SUBSTITUTE(ADDRESS(1,COLUMN(WP!$R:$R),4),\"1\",\"\")","v":"R"},null,null,{"$f":"SUBSTITUTE(ADDRESS(1,COLUMN(WP!$S:$S),4),\"1\",\"\")","v":"S"},null,null,null,{"$f":"SUBSTITUTE(ADDRESS(1,COLUMN(WP!$T:$T),4),\"1\",\"\")","v":"T"},null,null,{"$f":"SUBSTITUTE(ADDRESS(1,COLUMN(WP!$U:$U),4),\"1\",\"\")","v":"U"},null,null,{"$f":"SUBSTITUTE(ADDRESS(1,COLUMN(WP!$V:$V),4),\"1\",\"\")","v":"V"},null,null,null,{"$f":"SUBSTITUTE(ADDRESS(1,COLUMN(WP!$W:$W),4),\"1\",\"\")","v":"W"},null,null,{"$f":"SUBSTITUTE(ADDRESS(1,COLUMN(WP!$X:$X),4),\"1\",\"\")","v":"X"},null,null,{"$f":"SUBSTITUTE(ADDRESS(1,COLUMN(WP!$Y:$Y),4),\"1\",\"\")","v":"Y"},null,null,null,null,null,null,"AB",null,null,"Q",null,null,"R",null,null,"S",null,null,null,"T",null,null,"U",null,null,"V",null,null,null,"W",null,null,"X",null,null,"Y"]
[null,"LTE"]
[null,"LTE Common"]
[null,"Common test environment",36.508000000000003,{"$f":"getProgress(AX44,CH44,\"%\",1,1)","v":"100%\n(+100%)"},{"$f":"getProgress(AY44,CI44,,,1)","v":""},{"$f":"getProgress(AZ44,CJ44,,,1)","v":""},null,{"$f":"getProgress(BA44,CK44,\"%\",1,1,WpAreaA_Sub1_exist)","v":"100%\n(+100%)"},{"$f":"getProgress(BB44,CL44,,,1,WpAreaA_Sub1_exist)","v":""},{"$f":"getProgress(BC44,CM44,,,1,WpAreaA_Sub1_exist)","v":""},{"$f":"getProgress(BD44,CN44,\"%\",1,1,WpAreaA_Sub2_exist)","v":""},{"$f":"getProgress(BE44,CO44,,,1,WpAreaA_Sub2_exist)","v":""},{"$f":"getProgress(BF44,CP44,,,1,WpAreaA_Sub2_exist)","v":""},{"$f":"getProgress(BG44,CQ44,\"%\",1,1,WpAreaA_Sub3_exist)","v":""},{"$f":"getProgress(BH44,CR44,,,1,WpAreaA_Sub3_exist)","v":""},{"$f":"getProgress(BI44,CS44,,,1,WpAreaA_Sub3_exist)","v":""},null,{"$f":"getProgress(BK44,CU44,\"%\",1,1,WpAreaB_Sub1_exist)","v":""},{"$f":"getProgress(BL44,CV44,,,1,WpAreaB_Sub1_exist)","v":""},{"$f":"getProgress(BM44,CW44,,,1,WpAreaB_Sub1_exist)","v":""},{"$f":"getProgress(BN44,CX44,\"%\",1,1,WpAreaB_Sub2_exist)","v":""},{"$f":"getProgress(BO44,CY44,,,1,WpAreaB_Sub2_exist)","v":""},{"$f":"getProgress(BP44,CZ44,,,1,WpAreaB_Sub2_exist)","v":""},{"$f":"getProgress(BQ44,DA44,\"%\",1,1,WpAreaB_Sub3_exist)","v":""},{"$f":"getProgress(BR44,DB44,,,1,WpAreaB_Sub3_exist)","v":""},{"$f":"getProgress(BS44,DC44,,,1,WpAreaB_Sub3_exist)","v":""},null,{"$f":"getProgress(BU44,DE44,\"%\",1,1,WpAreaC_Sub1_exist)","v":""},{"$f":"getProgress(BV44,DF44,,,1,WpAreaC_Sub1_exist)","v":""},{"$f":"getProgress(BW44,DG44,,,1,WpAreaC_Sub1_exist)","v":""},{"$f":"getProgress(BX44,DH44,\"%\",1,1,WpAreaC_Sub2_exist)","v":""},{"$f":"getProgress(BY44,DI44,,,1,WpAreaC_Sub2_exist)","v":""},{"$f":"getProgress(BZ44,DJ44,,,1,WpAreaC_Sub2_exist)","v":""},{"$f":"getProgress(CA44,DK44,\"%\",1,1,WpAreaC_Sub3_exist)","v":""},{"$f":"getProgress(CB44,DL44,,,1,WpAreaC_Sub3_exist)","v":""},{"$f":"getProgress(CC44,DM44,,,1,WpAreaC_Sub3_exist)","v":""},null,null,null,null,null,null,null,null,null,null,null,null,null,{"$f":"IFERROR((IF(WpAreaA_exist,IF(BA44<>\"\",BA44*WP!$AB$9,0)+IF(BD44<>\"\",BD44*WP!$AC$9,0)+IF(BG44<>\"\",BG44*WP!$AD$9,0),0)+IF(WpAreaB_exist,IF(BK44<>\"\",BK44*WP!$AE$10)+IF(BN44<>\"\",BN44*WP!$AF$10,0)+IF(BQ44<>\"\",BQ44*WP!$AG$10,0),0)+IF(WpAreaC_exist,IF(BU44<>\"\",BU44*WP!$AH$10)+IF(BX44<>\"\",BX44*WP!$AI$10,0)+IF(CA44<>\"\",CA44*WP!$AJ$10,0),0))/(IF(WpAreaA_exist,IF(BA44<>\"\",WP!$AB$9,0)+IF(BD44<>\"\",WP!$AC$9,0)+IF(BG44<>\"\",WP!$AD$9,0),0)+IF(WpAreaB_exist,IF(BK44<>\"\",WP!$AE$10,0)+IF(BN44<>\"\",WP!$AF$10,0)+IF(BQ44<>\"\",WP!$AG$10,0),0)+ IF(WpAreaC_exist,IF(BU44<>\"\",WP!$AH$10,0)+IF(BX44<>\"\",WP!$AI$10,0)+IF(CA44<>\"\",WP!$AJ$10,0),0)),\"\")","v":1},{"$f":"IFERROR(IF(SUMPRODUCT(--(INDIRECT(\"WP!$C$\" & $DO44 & \":$C$\" & $DP44)=$C44),--(INDIRECT(\"WP!$B$\" & $DO44 & \":$B$\" & $DP44)=\"Y\"),--(INDIRECT(\"WP!$\" & $AX$41 & \"$\" & $DO44 & \":$\" & $AX$41 & \"$\" & $DP44)=1),--(INDIRECT(\"WP!$K$\" & $DO44 & \":$K$\" & $DP44)>0))<>0,SUMPRODUCT(--(INDIRECT(\"WP!$C$\" & $DO44 & \":$C$\" & $DP44)=$C44),--(INDIRECT(\"WP!$B$\" & $DO44 & \":$B$\" & $DP44)=\"Y\"),--(INDIRECT(\"WP!$\" & $AX$41 & \"$\" & $DO44 & \":$\" & $AX$41 & \"$\" & $DP44)=1),INDIRECT(\"WP!$K$\" & $DO44 & \":$K$\" & $DP44)),IF(AZ44<>\"\",0,\"\")),\"\")","v":""},{"$f":"IFERROR(IF(SUMPRODUCT(--(INDIRECT(\"WP!$C$\" & $DO44 & \":$C$\" & $DP44)=$C44),--(INDIRECT(\"WP!$B\" & $DO44 & \":$B\" & $DP44)=\"Y\"),--(INDIRECT(\"WP!$\" & $AX$41 & \"$\" & $DO44 & \":$\" & $AX$41 & \"$\" & $DP44)<>\"\"),--(INDIRECT(\"WP!$K\" & $DO44 & \":$K\" & $DP44)>0))<>0,SUMPRODUCT(--(INDIRECT(\"WP!$C$\" & $DO44 & \":$C$\" & $DP44)=$C44),--(INDIRECT(\"WP!$B\" & $DO44 & \":$B\" & $DP44)=\"Y\"),--(INDIRECT(\"WP!$\" & $AX$41 & \"$\" &  $DO44 & \":$\" & $AX$41 & \"$\" & $DP44)<>\"\"),INDIRECT(\"WP!$K\" & $DO44 & \":$K\" & $DP44)),\"\"),\"\")","v":""},{"$f":"IFERROR(IF(WpAreaA_Sub1_exist,IF(SUMPRODUCT(--(INDIRECT(\"WP!$C$\" & $DO44 & \":$C$\" & $DP44) =$C44),--(INDIRECT(\"WP!$\" & $BA$41 & \"$\" & $DO44 & \":$\" & $BA$41 & \"$\" & $DP44) <>\"\"),--(INDIRECT(\"WP!$K$\" & $DO44 & \":$K$\" & $DP44)>0))>0,SUMPRODUCT(--(INDIRECT(\"WP!$C$\" & $DO44 & \":$C$\" & $DP44) =$C44),--(INDIRECT(\"WP!$\" & $BA$41 & \"$\" & $DO44 & \":$\" & $BA$41 & \"$\" & $DP44) <>\"\"),INDIRECT(\"WP!$K$\" & $DO44 & \":$K$\" & $DP44),INDIRECT(\"WP!$\" & $BA$41 & \"$\" & $DO44 & \":$\" & $BA$41 & \"$\" & $DP44))/SUMPRODUCT(--(INDIRECT(\"WP!$C$\" & $DO44 & \":$C$\" & $DP44) =$C44),--(INDIRECT(\"WP!$\" & $BA$41 & \"$\" & $DO44 & \":$\" & $BA$41 & \"$\" & $DP44) <>\"\"),INDIRECT(\"WP!$K$\" & $DO44 & \":$K$\" & $DP44)),\"\"),\"\"),\"\")","v":1},{"$f":"IFERROR(IF(WpAreaA_Sub1_exist,IF(SUMPRODUCT(--(INDIRECT(\"WP!$C$\" & $DO44 & \":$C$\" & $DP44)=$C44),--(INDIRECT(\"WP!$B$\" & $DO44 & \":$B$\" & $DP44)=\"Y\"),--(INDIRECT(\"WP!$\" & $BA$41 & \"$\" & $DO44 & \":$\" & $BA$41 & \"$\" & $DP44)=1),--(INDIRECT(\"WP!$K$\" & $DO44 & \":$K$\" & $DP44)>0))<>0,SUMPRODUCT(--(INDIRECT(\"WP!$C$\" & $DO44 & \":$C$\" & $DP44)=$C44),--(INDIRECT(\"WP!$B$\" & $DO44 & \":$B$\" & $DP44)=\"Y\"),--(INDIRECT(\"WP!$\" & $BA$41 & \"$\" & $DO44 & \":$\" & $BA$41 & \"$\" & $DP44)=1),INDIRECT(\"WP!$K$\" & $DO44 & \":$K$\" & $DP44)),IF(BC44<>\"\",0,\"\")),\"\"),\"\")","v":""},{"$f":"IFERROR(IF(WpAreaA_Sub1_exist,IF(SUMPRODUCT(--(INDIRECT(\"WP!$C$\" & $DO44 & \":$C$\" & $DP44)=$C44),--(INDIRECT(\"WP!$B\" & $DO44 & \":$B\" & $DP44)=\"Y\"),--(INDIRECT(\"WP!$\" & $BA$41 & \"$\" & $DO44 & \":$\" & $BA$41 & \"$\" & $DP44)<>\"\"),--(INDIRECT(\"WP!$K\" & $DO44 & \":$K\" & $DP44)>0))<>0,SUMPRODUCT(--(INDIRECT(\"WP!$C$\" & $DO44 & \":$C$\" & $DP44)=$C44),--(INDIRECT(\"WP!$B\" & $DO44 & \":$B\" & $DP44)=\"Y\"),--(INDIRECT(\"WP!$\" & $BA$41 & \"$\" &  $DO44 & \":$\" & $BA$41 & \"$\" & $DP44)<>\"\"),INDIRECT(\"WP!$K\" & $DO44 & \":$K\" & $DP44)),\"\"),\"\"),\"\")","v":""},{"$f":"IFERROR(IF(WpAreaA_Sub2_exist,IF(SUMPRODUCT(--(INDIRECT(\"WP!$C$\" & $DO44 & \":$C$\" & $DP44) =$C44),--(INDIRECT(\"WP!$\" & $BD$41 & \"$\" & $DO44 & \":$\" & $BD$41 & \"$\" & $DP44) <>\"\"),--(INDIRECT(\"WP!$K$\" & $DO44 & \":$K$\" & $DP44)>0))>0,SUMPRODUCT(--(INDIRECT(\"WP!$C$\" & $DO44 & \":$C$\" & $DP44) =$C44),--(INDIRECT(\"WP!$\" & $BD$41 & \"$\" & $DO44 & \":$\" & $BD$41 & \"$\" & $DP44) <>\"\"),INDIRECT(\"WP!$K\" & $DO44 & \":$K\" & $DP44),INDIRECT(\"WP!$\" & $BD$41 & \"$\" & $DO44 & \":$\" & $BD$41 & \"$\" & $DP44))/SUMPRODUCT(--(INDIRECT(\"WP!$C$\" & $DO44 & \":$C$\" & $DP44) =$C44),--(INDIRECT(\"WP!$\" & $BD$41 & \"$\" & $DO44 & \":$\" & $BD$41 & \"$\" & $DP44) <>\"\"),INDIRECT(\"WP!$K\" & $DO44 & \":$K\" & $DP44)),\"\"),\"\"),\"\")","v":""},{"$f":"IFERROR(IF(WpAreaA_Sub2_exist,IF(SUMPRODUCT(--(INDIRECT(\"WP!$C$\" & $DO44 & \":$C$\" & $DP44)=$C44),--(INDIRECT(\"WP!$B\" & $DO44 & \":$B\" & $DP44)=\"Y\"),--(INDIRECT(\"WP!$\" & $BD$41 & \"$\" & $DO44 & \":$\" & $BD$41 & \"$\" & $DP44)=1),--(INDIRECT(\"WP!$K\" & $DO44 & \":$K\" & $DP44)>0))<>0,SUMPRODUCT(--(INDIRECT(\"WP!$C$\" & $DO44 & \":$C$\" & $DP44)=$C44),--(INDIRECT(\"WP!$B\" & $DO44 & \":$B\" & $DP44)=\"Y\"),--(INDIRECT(\"WP!$\" & $BD$41 & \"$\" & $DO44 & \":$\" & $BD$41 & \"$\" & $DP44)=1),INDIRECT(\"WP!$K\" & $DO44 & \":$K\" & $DP44)),IF(BF44<>\"\",0,\"\")),\"\"),\"\")","v":""},{"$f":"IFERROR(IF(WpAreaA_Sub2_exist,IF(SUMPRODUCT(--(INDIRECT(\"WP!$C$\" & $DO44 & \":$C$\" & $DP44)=$C44),--(INDIRECT(\"WP!$B\" & $DO44 & \":$B\" & $DP44)=\"Y\"),--(INDIRECT(\"WP!$\" & $BD$41 & \"$\" & $DO44 & \":$\" & $BD$41 & \"$\" & $DP44)<>\"\"),--(INDIRECT(\"WP!$K\" & $DO44 & \":$K\" & $DP44)>0))<>0,SUMPRODUCT(--(INDIRECT(\"WP!$C$\" & $DO44 & \":$C$\" & $DP44)=$C44),--(INDIRECT(\"WP!$B\" & $DO44 & \":$B\" & $DP44)=\"Y\"),--(INDIRECT(\"WP!$\" & $BD$41 & \"$\" & $DO44 & \":$\" & $BD$41 & \"$\" & $DP44)<>\"\"),INDIRECT(\"WP!$K\" & $DO44 & \":$K\" & $DP44)),\"\"),\"\"),\"\")","v":""},{"$f":"IFERROR(IF(WpAreaA_Sub3_exist,IF(SUMPRODUCT(--(INDIRECT(\"WP!$C$\" & $DO44 & \":$C$\" & $DP44) =$C44),--(INDIRECT(\"WP!$\" & $BG$41 & \"$\" & $DO44 & \":$\" & $BG$41 & \"$\" & $DP44) <>\"\"),--(INDIRECT(\"WP!$K$\" & $DO44 & \":$K$\" & $DP44)>0))>0,SUMPRODUCT(--(INDIRECT(\"WP!$C$\" & $DO44 & \":$C$\" & $DP44) =$C44),--(INDIRECT(\"WP!$\" & $BG$41 & \"$\" & $DO44 & \":$\" & $BG$41 & \"$\" & $DP44) <>\"\"),INDIRECT(\"WP!$K\" & $DO44 & \":$K\" & $DP44),INDIRECT(\"WP!$\" & $BG$41 & \"$\" & $DO44 & \":$\" & $BG$41 & \"$\" & $DP44))/SUMPRODUCT(--(INDIRECT(\"WP!$C$\" & $DO44 & \":$C$\" & $DP44) =$C44),--(INDIRECT(\"WP!$\" & $BG$41 & \"$\" & $DO44 & \":$\" & $BG$41 & \"$\" & $DP44) <>\"\"),INDIRECT(\"WP!$K\" & $DO44 & \":$K\" & $DP44)),\"\"),\"\"),\"\")","v":""},{"$f":"IFERROR(IF(WpAreaA_Sub3_exist,IF(SUMPRODUCT(--(INDIRECT(\"WP!$C$\" & $DO44 & \":$C$\" & $DP44)=$C44),--(INDIRECT(\"WP!$B\" & $DO44 & \":$B\" & $DP44)=\"Y\"),--(INDIRECT(\"WP!$\" & $BG$41 & \"$\" & $DO44 & \":$\" & $BG$41 & \"$\" & $DP44)=1),--(INDIRECT(\"WP!$K\" & $DO44 & \":$K\" & $DP44)>0))<>0,SUMPRODUCT(--(INDIRECT(\"WP!$C$\" & $DO44 & \":$C$\" & $DP44)=$C44),--(INDIRECT(\"WP!$B\" & $DO44 & \":$B\" & $DP44)=\"Y\"),--(INDIRECT(\"WP!$\" & $BG$41 & \"$\" & $DO44 & \":$\" & $BG$41 & \"$\" & $DP44)=1),INDIRECT(\"WP!$K\" & $DO44 & \":$K\" & $DP44)),IF(BI44<>\"\",0,\"\")),\"\"),\"\")","v":""},{"$f":"IFERROR(IF(WpAreaA_Sub3_exist,IF(SUMPRODUCT(--(INDIRECT(\"WP!$C$\" & $DO44 & \":$C$\" & $DP44)=$C44),--(INDIRECT(\"WP!$B\" & $DO44 & \":$B\" & $DP44)=\"Y\"),--(INDIRECT(\"WP!$\" & $BG$41 & \"$\" & $DO44 & \":$\" & $BG$41 & \"$\" & $DP44)<>\"\"),--(INDIRECT(\"WP!$K\" & $DO44 & \":$K\" & $DP44)>0))<>0,SUMPRODUCT(--(INDIRECT(\"WP!$C$\" & $DO44 & \":$C$\" & $DP44)=$C44),--(INDIRECT(\"WP!$B\" & $DO44 & \":$B\" & $DP44)=\"Y\"),--(INDIRECT(\"WP!$\" & $BG$41 & \"$\" & $DO44 & \":$\" & $BG$41 & \"$\" & $DP44)<>\"\"),INDIRECT(\"WP!$K\" & $DO44 & \":$K\" & $DP44)),\"\"),\"\"),\"\")","v":""},null,{"$f":"IFERROR(IF(WpAreaB_Sub1_exist,IF(SUMPRODUCT(--(INDIRECT(\"WP!$C$\" & $DO44 & \":$C$\" & $DP44) =$C44),--(INDIRECT(\"WP!$\" & $BK$41 & \"$\" & $DO44 & \":$\" & $BK$41 & \"$\" & $DP44) <>\"\"),--(INDIRECT(\"WP!$K$\" & $DO44 & \":$K$\" & $DP44)>0))>0,SUMPRODUCT(--(INDIRECT(\"WP!$C$\" & $DO44 & \":$C$\" & $DP44) =$C44),--(INDIRECT(\"WP!$\" & $BK$41 & \"$\" & $DO44 & \":$\" & $BK$41 & \"$\" & $DP44) <>\"\"),INDIRECT(\"WP!$K\" & $DO44 & \":$K\" & $DP44),INDIRECT(\"WP!$\" & $BK$41 & \"$\" & $DO44 & \":$\" & $BK$41 & \"$\" & $DP44))/SUMPRODUCT(--(INDIRECT(\"WP!$C$\" & $DO44 & \":$C$\" & $DP44) =$C44),--(INDIRECT(\"WP!$\" & $BK$41 & \"$\" & $DO44 & \":$\" & $BK$41 & \"$\" & $DP44) <>\"\"),INDIRECT(\"WP!$K\" & $DO44 & \":$K\" & $DP44)),\"\"),\"\"),\"\")","v":""},{"$f":"IFERROR(IF(WpAreaB_Sub1_exist,IF(SUMPRODUCT(--(INDIRECT(\"WP!$C$\" & $DO44 & \":$C$\" & $DP44)=$C44),--(INDIRECT(\"WP!$B\" & $DO44 & \":$B\" & $DP44)=\"Y\"),--(INDIRECT(\"WP!$\" & $BK$41 & \"$\" & $DO44 & \":$\" & $BK$41 & \"$\" & $DP44)=1),--(INDIRECT(\"WP!$K\" & $DO44 & \":$K\" & $DP44)>0))<>0,SUMPRODUCT(--(INDIRECT(\"WP!$C$\" & $DO44 & \":$C$\" & $DP44)=$C44),--(INDIRECT(\"WP!$B\" & $DO44 & \":$B\" & $DP44)=\"Y\"),--(INDIRECT(\"WP!$\" & $BK$41 & \"$\" & $DO44 & \":$\" & $BK$41 & \"$\" & $DP44)=1),INDIRECT(\"WP!$K\" & $DO44 & \":$K\" & $DP44)),IF(BM44<>\"\",0,\"\")),\"\"),\"\")","v":""},{"$f":"IFERROR(IF(WpAreaB_Sub1_exist,IF(SUMPRODUCT(--(INDIRECT(\"WP!$C$\" & $DO44 & \":$C$\" & $DP44)=$C44),--(INDIRECT(\"WP!$B\" & $DO44 & \":$B\" & $DP44)=\"Y\"),--(INDIRECT(\"WP!$\" & $BK$41 & \"$\" & $DO44 & \":$\" & $BK$41 & \"$\" & $DP44)<>\"\"),--(INDIRECT(\"WP!$K\" & $DO44 & \":$K\" & $DP44)>0))<>0,SUMPRODUCT(--(INDIRECT(\"WP!$C$\" & $DO44 & \":$C$\" & $DP44)=$C44),--(INDIRECT(\"WP!$B\" & $DO44 & \":$B\" & $DP44)=\"Y\"),--(INDIRECT(\"WP!$\" & $BK$41 & \"$\" & $DO44 & \":$\" & $BK$41 & \"$\" & $DP44)<>\"\"),INDIRECT(\"WP!$K\" & $DO44 & \":$K\" & $DP44)),\"\"),\"\"),\"\")","v":""},{"$f":"IFERROR(IF(WpAreaB_Sub2_exist,IF(SUMPRODUCT(--(INDIRECT(\"WP!$C$\" & $DO44 & \":$C$\" & $DP44) =$C44),--(INDIRECT(\"WP!$\" & $BN$41 & \"$\" & $DO44 & \":$\" & $BN$41 & \"$\" & $DP44) <>\"\"),--(INDIRECT(\"WP!$K$\" & $DO44 & \":$K$\" & $DP44)>0))>0,SUMPRODUCT(--(INDIRECT(\"WP!$C$\" & $DO44 & \":$C$\" & $DP44) =$C44),--(INDIRECT(\"WP!$\" & $BN$41 & \"$\" & $DO44 & \":$\" & $BN$41 & \"$\" & $DP44) <>\"\"),INDIRECT(\"WP!$K\" & $DO44 & \":$K\" & $DP44),INDIRECT(\"WP!$\" & $BN$41 & \"$\" & $DO44 & \":$\" & $BN$41 & \"$\" & $DP44))/SUMPRODUCT(--(INDIRECT(\"WP!$C$\" & $DO44 & \":$C$\" & $DP44) =$C44),--(INDIRECT(\"WP!$\" & $BN$41 & \"$\" & $DO44 & \":$\" & $BN$41 & \"$\" & $DP44) <>\"\"),INDIRECT(\"WP!$K\" & $DO44 & \":$K\" & $DP44)),\"\"),\"\"),\"\")","v":""},{"$f":"IFERROR(IF(WpAreaB_Sub2_exist,IF(SUMPRODUCT(--(INDIRECT(\"WP!$C$\" & $DO44 & \":$C$\" & $DP44)=$C44),--(INDIRECT(\"WP!$B\" & $DO44 & \":$B\" & $DP44)=\"Y\"),--(INDIRECT(\"WP!$\" & $BN$41 & \"$\" & $DO44 & \":$\" & $BN$41 & \"$\" & $DP44)=1),--(INDIRECT(\"WP!$K\" & $DO44 & \":$K\" & $DP44)>0))<>0,SUMPRODUCT(--(INDIRECT(\"WP!$C$\" & $DO44 & \":$C$\" & $DP44)=$C44),--(INDIRECT(\"WP!$B\" & $DO44 & \":$B\" & $DP44)=\"Y\"),--(INDIRECT(\"WP!$\" & $BN$41 & \"$\" & $DO44 & \":$\" & $BN$41 & \"$\" & $DP44)=1),INDIRECT(\"WP!$K\" & $DO44 & \":$K\" & $DP44)),IF(BP44<>\"\",0,\"\")),\"\"),\"\")","v":""},{"$f":"IFERROR(IF(WpAreaB_Sub2_exist,IF(SUMPRODUCT(--(INDIRECT(\"WP!$C$\" & $DO44 & \":$C$\" & $DP44)=$C44),--(INDIRECT(\"WP!$B\" & $DO44 & \":$B\" & $DP44)=\"Y\"),--(INDIRECT(\"WP!$\" & $BN$41 & \"$\" & $DO44 & \":$\" & $BN$41 & \"$\" & $DP44)<>\"\"),--(INDIRECT(\"WP!$K\" & $DO44 & \":$K\" & $DP44)>0))<>0,SUMPRODUCT(--(INDIRECT(\"WP!$C$\" & $DO44 & \":$C$\" & $DP44)=$C44),--(INDIRECT(\"WP!$B\" & $DO44 & \":$B\" & $DP44)=\"Y\"),--(INDIRECT(\"WP!$\" & $BN$41 & \"$\" & $DO44 & \":$\" & $BN$41 & \"$\" & $DP44)<>\"\"),INDIRECT(\"WP!$K\" & $DO44 & \":$K\" & $DP44)),\"\"),\"\"),\"\")","v":""},{"$f":"IFERROR(IF(WpAreaB_Sub3_exist,IF(SUMPRODUCT(--(INDIRECT(\"WP!$C$\" & $DO44 & \":$C$\" & $DP44) =$C44),--(INDIRECT(\"WP!$\" & $BQ$41 & \"$\" & $DO44 & \":$\" & $BQ$41 & \"$\" & $DP44) <>\"\"),--(INDIRECT(\"WP!$K$\" & $DO44 & \":$K$\" & $DP44)>0))>0,SUMPRODUCT(--(INDIRECT(\"WP!$C$\" & $DO44 & \":$C$\" & $DP44) =$C44),--(INDIRECT(\"WP!$\" & $BQ$41 & \"$\" & $DO44 & \":$\" & $BQ$41 & \"$\" & $DP44) <>\"\"),INDIRECT(\"WP!$K\" & $DO44 & \":$K\" & $DP44),INDIRECT(\"WP!$\" & $BQ$41 & \"$\" & $DO44 & \":$\" & $BQ$41 & \"$\" & $DP44))/SUMPRODUCT(--(INDIRECT(\"WP!$C$\" & $DO44 & \":$C$\" & $DP44) =$C44),--(INDIRECT(\"WP!$\" & $BQ$41 & \"$\" & $DO44 & \":$\" & $BQ$41 & \"$\" & $DP44) <>\"\"),INDIRECT(\"WP!$K\" & $DO44 & \":$K\" & $DP44)),\"\"),\"\"),\"\")","v":""},{"$f":"IFERROR(IF(WpAreaB_Sub3_exist,IF(SUMPRODUCT(--(INDIRECT(\"WP!$C$\" & $DO44 & \":$C$\" & $DP44)=$C44),--(INDIRECT(\"WP!$B\" & $DO44 & \":$B\" & $DP44)=\"Y\"),--(INDIRECT(\"WP!$\" & $BQ$41 & \"$\" & $DO44 & \":$\" & $BQ$41 & \"$\" & $DP44)=1),--(INDIRECT(\"WP!$K\" & $DO44 & \":$K\" & $DP44)>0))<>0,SUMPRODUCT(--(INDIRECT(\"WP!$C$\" & $DO44 & \":$C$\" & $DP44)=$C44),--(INDIRECT(\"WP!$B\" & $DO44 & \":$B\" & $DP44)=\"Y\"),--(INDIRECT(\"WP!$\" & $BQ$41 & \"$\" & $DO44 & \":$\" & $BQ$41 & \"$\" & $DP44)=1),INDIRECT(\"WP!$K\" & $DO44 & \":$K\" & $DP44)),IF(BS44<>\"\",0,\"\")),\"\"),\"\")","v":""},{"$f":"IFERROR(IF(WpAreaB_Sub3_exist,IF(SUMPRODUCT(--(INDIRECT(\"WP!$C$\" & $DO44 & \":$C$\" & $DP44)=$C44),--(INDIRECT(\"WP!$B\" & $DO44 & \":$B\" & $DP44)=\"Y\"),--(INDIRECT(\"WP!$\" & $BQ$41 & \"$\" & $DO44 & \":$\" & $BQ$41 & \"$\" & $DP44)<>\"\"),--(INDIRECT(\"WP!$K\" & $DO44 & \":$K\" & $DP44)>0))<>0,SUMPRODUCT(--(INDIRECT(\"WP!$C$\" & $DO44 & \":$C$\" & $DP44)=$C44),--(INDIRECT(\"WP!$B\" & $DO44 & \":$B\" & $DP44)=\"Y\"),--(INDIRECT(\"WP!$\" & $BQ$41 & \"$\" & $DO44 & \":$\" & $BQ$41 & \"$\" & $DP44)<>\"\"),INDIRECT(\"WP!$K\" & $DO44 & \":$K\" & $DP44)),\"\"),\"\"),\"\")","v":""},null,{"$f":"IFERROR(IF(WpAreaC_Sub1_exist,IF(SUMPRODUCT(--(INDIRECT(\"WP!$C$\" & $DO44 & \":$C$\" & $DP44) =$C44),--(INDIRECT(\"WP!$\" & $BU$41 & \"$\" & $DO44 & \":$\" & $BU$41 & \"$\" & $DP44) <>\"\"),--(INDIRECT(\"WP!$K$\" & $DO44 & \":$K$\" & $DP44)>0))>0,SUMPRODUCT(--(INDIRECT(\"WP!$C$\" & $DO44 & \":$C$\" & $DP44) =$C44),--(INDIRECT(\"WP!$\" & $BU$41 & \"$\" & $DO44 & \":$\" & $BU$41 & \"$\" & $DP44) <>\"\"),INDIRECT(\"WP!$K\" & $DO44 & \":$K\" & $DP44),INDIRECT(\"WP!$\" & $BU$41 & \"$\" & $DO44 & \":$\" & $BU$41 & \"$\" & $DP44))/SUMPRODUCT(--(INDIRECT(\"WP!$C$\" & $DO44 & \":$C$\" & $DP44) =$C44),--(INDIRECT(\"WP!$\" & $BU$41 & \"$\" & $DO44 & \":$\" & $BU$41 & \"$\" & $DP44) <>\"\"),INDIRECT(\"WP!$K\" & $DO44 & \":$K\" & $DP44)),\"\"),\"\"),\"\")","v":""},{"$f":"IFERROR(IF(WpAreaC_Sub1_exist,IF(SUMPRODUCT(--(INDIRECT(\"WP!$C$\" & $DO44 & \":$C$\" & $DP44)=$C44),--(INDIRECT(\"WP!$B\" & $DO44 & \":$B\" & $DP44)=\"Y\"),--(INDIRECT(\"WP!$\" & $BU$41 & \"$\" & $DO44 & \":$\" & $BU$41 & \"$\" & $DP44)=1),--(INDIRECT(\"WP!$K\" & $DO44 & \":$K\" & $DP44)>0))<>0,SUMPRODUCT(--(INDIRECT(\"WP!$C$\" & $DO44 & \":$C$\" & $DP44)=$C44),--(INDIRECT(\"WP!$B\" & $DO44 & \":$B\" & $DP44)=\"Y\"),--(INDIRECT(\"WP!$\" & $BU$41 & \"$\" & $DO44 & \":$\" & $BU$41 & \"$\" & $DP44)=1),INDIRECT(\"WP!$K\" & $DO44 & \":$K\" & $DP44)),IF(BW44<>\"\",0,\"\")),\"\"),\"\")","v":""},{"$f":"IFERROR(IF(WpAreaC_Sub1_exist,IF(SUMPRODUCT(--(INDIRECT(\"WP!$C$\" & $DO44 & \":$C$\" & $DP44)=$C44),--(INDIRECT(\"WP!$B\" & $DO44 & \":$B\" & $DP44)=\"Y\"),--(INDIRECT(\"WP!$\" & $BU$41 & \"$\" & $DO44 & \":$\" & $BU$41 & \"$\" & $DP44)<>\"\"),--(INDIRECT(\"WP!$K\" & $DO44 & \":$K\" & $DP44)>0))<>0,SUMPRODUCT(--(INDIRECT(\"WP!$C$\" & $DO44 & \":$C$\" & $DP44)=$C44),--(INDIRECT(\"WP!$B\" & $DO44 & \":$B\" & $DP44)=\"Y\"),--(INDIRECT(\"WP!$\" & $BU$41 & \"$\" & $DO44 & \":$\" & $BU$41 & \"$\" & $DP44)<>\"\"),INDIRECT(\"WP!$K\" & $DO44 & \":$K\" & $DP44)),\"\"),\"\"),\"\")","v":""},{"$f":"IFERROR(IF(WpAreaC_Sub2_exist,IF(SUMPRODUCT(--(INDIRECT(\"WP!$C$\" & $DO44 & \":$C$\" & $DP44) =$C44),--(INDIRECT(\"WP!$\" & $BX$41 & \"$\" & $DO44 & \":$\" & $BX$41 & \"$\" & $DP44) <>\"\"),--(INDIRECT(\"WP!$K$\" & $DO44 & \":$K$\" & $DP44)>0))>0,SUMPRODUCT(--(INDIRECT(\"WP!$C$\" & $DO44 & \":$C$\" & $DP44) =$C44),--(INDIRECT(\"WP!$\" & $BX$41 & \"$\" & $DO44 & \":$\" & $BX$41 & \"$\" & $DP44) <>\"\"),INDIRECT(\"WP!$K\" & $DO44 & \":$K\" & $DP44),INDIRECT(\"WP!$\" & $BX$41 & \"$\" & $DO44 & \":$\" & $BX$41 & \"$\" & $DP44))/SUMPRODUCT(--(INDIRECT(\"WP!$C$\" & $DO44 & \":$C$\" & $DP44) =$C44),--(INDIRECT(\"WP!$\" & $BX$41 & \"$\" & $DO44 & \":$\" & $BX$41 & \"$\" & $DP44) <>\"\"),INDIRECT(\"WP!$K\" & $DO44 & \":$K\" & $DP44)),\"\"),\"\"),\"\")","v":""},{"$f":"IFERROR(IF(WpAreaC_Sub2_exist,IF(SUMPRODUCT(--(INDIRECT(\"WP!$C$\" & $DO44 & \":$C$\" & $DP44)=$C44),--(INDIRECT(\"WP!$B\" & $DO44 & \":$B\" & $DP44)=\"Y\"),--(INDIRECT(\"WP!$\" & $BX$41 & \"$\" & $DO44 & \":$\" & $BX$41 & \"$\" & $DP44)=1),--(INDIRECT(\"WP!$K\" & $DO44 & \":$K\" & $DP44)>0))<>0,SUMPRODUCT(--(INDIRECT(\"WP!$C$\" & $DO44 & \":$C$\" & $DP44)=$C44),--(INDIRECT(\"WP!$B\" & $DO44 & \":$B\" & $DP44)=\"Y\"),--(INDIRECT(\"WP!$\" & $BX$41 & \"$\" & $DO44 & \":$\" & $BX$41 & \"$\" & $DP44)=1),INDIRECT(\"WP!$K\" & $DO44 & \":$K\" & $DP44)),IF(BZ44<>\"\",0,\"\")),\"\"),\"\")","v":""},{"$f":"IFERROR(IF(WpAreaC_Sub2_exist,IF(SUMPRODUCT(--(INDIRECT(\"WP!$C$\" & $DO44 & \":$C$\" & $DP44)=$C44),--(INDIRECT(\"WP!$B\" & $DO44 & \":$B\" & $DP44)=\"Y\"),--(INDIRECT(\"WP!$\" & $BX$41 & \"$\" & $DO44 & \":$\" & $BX$41 & \"$\" & $DP44)<>\"\"),--(INDIRECT(\"WP!$K\" & $DO44 & \":$K\" & $DP44)>0))<>0,SUMPRODUCT(--(INDIRECT(\"WP!$C$\" & $DO44 & \":$C$\" & $DP44)=$C44),--(INDIRECT(\"WP!$B\" & $DO44 & \":$B\" & $DP44)=\"Y\"),--(INDIRECT(\"WP!$\" & $BX$41 & \"$\" & $DO44 & \":$\" & $BX$41 & \"$\" & $DP44)<>\"\"),INDIRECT(\"WP!$K\" & $DO44 & \":$K\" & $DP44)),\"\"),\"\"),\"\")","v":""},{"$f":"IFERROR(IF(WpAreaC_Sub3_exist,F(SUMPRODUCT(--(INDIRECT(\"WP!$C$\" & $DO44 & \":$C$\" & $DP44) =$C44),--(INDIRECT(\"WP!$\" & $CA$41 & \"$\" & $DO44 & \":$\" & $CA$41 & \"$\" & $DP44) <>\"\"),--(INDIRECT(\"WP!$K$\" & $DO44 & \":$K$\" & $DP44)>0))>0,SUMPRODUCT(--(INDIRECT(\"WP!$C$\" & $DO44 & \":$C$\" & $DP44) =$C44),--(INDIRECT(\"WP!$\" & $CA$41 & \"$\" & $DO44 & \":$\" & $CA$41 & \"$\" & $DP44) <>\"\"),INDIRECT(\"WP!$K\" & $DO44 & \":$K\" & $DP44),INDIRECT(\"WP!$\" & $CA$41 & \"$\" & $DO44 & \":$\" & $CA$41 & \"$\" & $DP44))/SUMPRODUCT(--(INDIRECT(\"WP!$C$\" & $DO44 & \":$C$\" & $DP44) =$C44),--(INDIRECT(\"WP!$\" & $CA$41 & \"$\" & $DO44 & \":$\" & $CA$41 & \"$\" & $DP44) <>\"\"),INDIRECT(\"WP!$K\" & $DO44 & \":$K\" & $DP44)),\"\"),\"\"),\"\")","v":""},{"$f":"IFERROR(IF(WpAreaC_Sub3_exist,IF(SUMPRODUCT(--(INDIRECT(\"WP!$C$\" & $DO44 & \":$C$\" & $DP44)=$C44),--(INDIRECT(\"WP!$B\" & $DO44 & \":$B\" & $DP44)=\"Y\"),--(INDIRECT(\"WP!$\" & $CA$41 & \"$\" & $DO44 & \":$\" & $CA$41 & \"$\" & $DP44)=1),--(INDIRECT(\"WP!$K\" & $DO44 & \":$K\" & $DP44)>0))<>0,SUMPRODUCT(--(INDIRECT(\"WP!$C$\" & $DO44 & \":$C$\" & $DP44)=$C44),--(INDIRECT(\"WP!$B\" & $DO44 & \":$B\" & $DP44)=\"Y\"),--(INDIRECT(\"WP!$\" & $CA$41 & \"$\" & $DO44 & \":$\" & $CA$41 & \"$\" & $DP44)=1),INDIRECT(\"WP!$K\" & $DO44 & \":$K\" & $DP44)),IF(CC44<>\"\",0,\"\")),\"\"),\"\")","v":""},{"$f":"IFERROR(IF(WpAreaC_Sub3_exist,IF(SUMPRODUCT(--(INDIRECT(\"WP!$C$\" & $DO44 & \":$C$\" & $DP44)=$C44),--(INDIRECT(\"WP!$B\" & $DO44 & \":$B\" & $DP44)=\"Y\"),--(INDIRECT(\"WP!$\" & $CA$41 & \"$\" & $DO44 & \":$\" & $CA$41 & \"$\" & $DP44)<>\"\"),--(INDIRECT(\"WP!$K\" & $DO44 & \":$K\" & $DP44)>0))<>0,SUMPRODUCT(--(INDIRECT(\"WP!$C$\" & $DO44 & \":$C$\" & $DP44)=$C44),--(INDIRECT(\"WP!$B\" & $DO44 & \":$B\" & $DP44)=\"Y\"),--(INDIRECT(\"WP!$\" & $CA$41 & \"$\" & $DO44 & \":$\" & $CA$41 & \"$\" & $DP44)<>\"\"),INDIRECT(\"WP!$K\" & $DO44 & \":$K\" & $DP44)),\"\"),\"\"),\"\")","v":""},null,null,null,null,"","","","","","","","","","","","",null,"","","","","","","","","",null,"","","","","","","","","",null,{"$f":"MIN(IF(WP!$C$12:$C$53=$C44,ROW(WP!$C$12:$C$53),\"\"))","v":16},{"$f":"MAX(IF(WP!$C$12:$C$53=$C44,ROW(WP!$C$12:$C$53),\"\"))","v":17}]
[null,"LTE RF/RRM"]
[null,"RF common parts","36.521-1",{"$f":"getProgress(AX46,CH46,\"%\",1,1)","v":"50%\n(+50%)"},{"$f":"getProgress(AY46,CI46,,,1)","v":""},{"$f":"getProgress(AZ46,CJ46,,,1)","v":""},null,{"$f":"getProgress(BA46,CK46,\"%\",1,1,WpAreaA_Sub1_exist)","v":"50%\n(+50%)"},{"$f":"getProgress(BB46,CL46,,,1,WpAreaA_Sub1_exist)","v":""},{"$f":"getProgress(BC46,CM46,,,1,WpAreaA_Sub1_exist)","v":""},{"$f":"getProgress(BD46,CN46,\"%\",1,1,WpAreaA_Sub2_exist)","v":""},{"$f":"getProgress(BE46,CO46,,,1,WpAreaA_Sub2_exist)","v":""},{"$f":"getProgress(BF46,CP46,,,1,WpAreaA_Sub2_exist)","v":""},{"$f":"getProgress(BG46,CQ46,\"%\",1,1,WpAreaA_Sub3_exist)","v":""},{"$f":"getProgress(BH46,CR46,,,1,WpAreaA_Sub3_exist)","v":""},{"$f":"getProgress(BI46,CS46,,,1,WpAreaA_Sub3_exist)","v":""},null,{"$f":"getProgress(BK46,CU46,\"%\",1,1,WpAreaB_Sub1_exist)","v":""},{"$f":"getProgress(BL46,CV46,,,1,WpAreaB_Sub1_exist)","v":""},{"$f":"getProgress(BM46,CW46,,,1,WpAreaB_Sub1_exist)","v":""},{"$f":"getProgress(BN46,CX46,\"%\",1,1,WpAreaB_Sub2_exist)","v":""},{"$f":"getProgress(BO46,CY46,,,1,WpAreaB_Sub2_exist)","v":""},{"$f":"getProgress(BP46,CZ46,,,1,WpAreaB_Sub2_exist)","v":""},{"$f":"getProgress(BQ46,DA46,\"%\",1,1,WpAreaB_Sub3_exist)","v":""},{"$f":"getProgress(BR46,DB46,,,1,WpAreaB_Sub3_exist)","v":""},{"$f":"getProgress(BS46,DC46,,,1,WpAreaB_Sub3_exist)","v":""},null,{"$f":"getProgress(BU46,DE46,\"%\",1,1,WpAreaC_Sub1_exist)","v":""},{"$f":"getProgress(BV46,DF46,,,1,WpAreaC_Sub1_exist)","v":""},{"$f":"getProgress(BW46,DG46,,,1,WpAreaC_Sub1_exist)","v":""},{"$f":"getProgress(BX46,DH46,\"%\",1,1,WpAreaC_Sub2_exist)","v":""},{"$f":"getProgress(BY46,DI46,,,1,WpAreaC_Sub2_exist)","v":""},{"$f":"getProgress(BZ46,DJ46,,,1,WpAreaC_Sub2_exist)","v":""},{"$f":"getProgress(CA46,DK46,\"%\",1,1,WpAreaC_Sub3_exist)","v":""},{"$f":"getProgress(CB46,DL46,,,1,WpAreaC_Sub3_exist)","v":""},{"$f":"getProgress(CC46,DM46,,,1,WpAreaC_Sub3_exist)","v":""},null,null,null,null,null,null,null,null,null,null,null,null,null,{"$f":"IFERROR((IF(WpAreaA_exist,IF(BA46<>\"\",BA46*WP!$AB$9,0)+IF(BD46<>\"\",BD46*WP!$AC$9,0)+IF(BG46<>\"\",BG46*WP!$AD$9,0),0)+IF(WpAreaB_exist,IF(BK46<>\"\",BK46*WP!$AE$10)+IF(BN46<>\"\",BN46*WP!$AF$10,0)+IF(BQ46<>\"\",BQ46*WP!$AG$10,0),0)+IF(WpAreaC_exist,IF(BU46<>\"\",BU46*WP!$AH$10)+IF(BX46<>\"\",BX46*WP!$AI$10,0)+IF(CA46<>\"\",CA46*WP!$AJ$10,0),0))/(IF(WpAreaA_exist,IF(BA46<>\"\",WP!$AB$9,0)+IF(BD46<>\"\",WP!$AC$9,0)+IF(BG46<>\"\",WP!$AD$9,0),0)+IF(WpAreaB_exist,IF(BK46<>\"\",WP!$AE$10,0)+IF(BN46<>\"\",WP!$AF$10,0)+IF(BQ46<>\"\",WP!$AG$10,0),0)+ IF(WpAreaC_exist,IF(BU46<>\"\",WP!$AH$10,0)+IF(BX46<>\"\",WP!$AI$10,0)+IF(CA46<>\"\",WP!$AJ$10,0),0)),\"\")","v":0.5},{"$f":"IFERROR(IF(SUMPRODUCT(--(INDIRECT(\"WP!$C$\" & $DO46 & \":$C$\" & $DP46)=$C46),--(INDIRECT(\"WP!$B$\" & $DO46 & \":$B$\" & $DP46)=\"Y\"),--(INDIRECT(\"WP!$\" & $AX$41 & \"$\" & $DO46 & \":$\" & $AX$41 & \"$\" & $DP46)=1),--(INDIRECT(\"WP!$K$\" & $DO46 & \":$K$\" & $DP46)>0))<>0,SUMPRODUCT(--(INDIRECT(\"WP!$C$\" & $DO46 & \":$C$\" & $DP46)=$C46),--(INDIRECT(\"WP!$B$\" & $DO46 & \":$B$\" & $DP46)=\"Y\"),--(INDIRECT(\"WP!$\" & $AX$41 & \"$\" & $DO46 & \":$\" & $AX$41 & \"$\" & $DP46)=1),INDIRECT(\"WP!$K$\" & $DO46 & \":$K$\" & $DP46)),IF(AZ46<>\"\",0,\"\")),\"\")","v":""},{"$f":"IFERROR(IF(SUMPRODUCT(--(INDIRECT(\"WP!$C$\" & $DO46 & \":$C$\" & $DP46)=$C46),--(INDIRECT(\"WP!$B\" & $DO46 & \":$B\" & $DP46)=\"Y\"),--(INDIRECT(\"WP!$\" & $AX$41 & \"$\" & $DO46 & \":$\" & $AX$41 & \"$\" & $DP46)<>\"\"),--(INDIRECT(\"WP!$K\" & $DO46 & \":$K\" & $DP46)>0))<>0,SUMPRODUCT(--(INDIRECT(\"WP!$C$\" & $DO46 & \":$C$\" & $DP46)=$C46),--(INDIRECT(\"WP!$B\" & $DO46 & \":$B\" & $DP46)=\"Y\"),--(INDIRECT(\"WP!$\" & $AX$41 & \"$\" &  $DO46 & \":$\" & $AX$41 & \"$\" & $DP46)<>\"\"),INDIRECT(\"WP!$K\" & $DO46 & \":$K\" & $DP46)),\"\"),\"\")","v":""},{"$f":"IFERROR(IF(WpAreaA_Sub1_exist,IF(SUMPRODUCT(--(INDIRECT(\"WP!$C$\" & $DO46 & \":$C$\" & $DP46) =$C46),--(INDIRECT(\"WP!$\" & $BA$41 & \"$\" & $DO46 & \":$\" & $BA$41 & \"$\" & $DP46) <>\"\"),--(INDIRECT(\"WP!$K$\" & $DO46 & \":$K$\" & $DP46)>0))>0,SUMPRODUCT(--(INDIRECT(\"WP!$C$\" & $DO46 & \":$C$\" & $DP46) =$C46),--(INDIRECT(\"WP!$\" & $BA$41 & \"$\" & $DO46 & \":$\" & $BA$41 & \"$\" & $DP46) <>\"\"),INDIRECT(\"WP!$K$\" & $DO46 & \":$K$\" & $DP46),INDIRECT(\"WP!$\" & $BA$41 & \"$\" & $DO46 & \":$\" & $BA$41 & \"$\" & $DP46))/SUMPRODUCT(--(INDIRECT(\"WP!$C$\" & $DO46 & \":$C$\" & $DP46) =$C46),--(INDIRECT(\"WP!$\" & $BA$41 & \"$\" & $DO46 & \":$\" & $BA$41 & \"$\" & $DP46) <>\"\"),INDIRECT(\"WP!$K$\" & $DO46 & \":$K$\" & $DP46)),\"\"),\"\"),\"\")","v":0.5},{"$f":"IFERROR(IF(WpAreaA_Sub1_exist,IF(SUMPRODUCT(--(INDIRECT(\"WP!$C$\" & $DO46 & \":$C$\" & $DP46)=$C46),--(INDIRECT(\"WP!$B$\" & $DO46 & \":$B$\" & $DP46)=\"Y\"),--(INDIRECT(\"WP!$\" & $BA$41 & \"$\" & $DO46 & \":$\" & $BA$41 & \"$\" & $DP46)=1),--(INDIRECT(\"WP!$K$\" & $DO46 & \":$K$\" & $DP46)>0))<>0,SUMPRODUCT(--(INDIRECT(\"WP!$C$\" & $DO46 & \":$C$\" & $DP46)=$C46),--(INDIRECT(\"WP!$B$\" & $DO46 & \":$B$\" & $DP46)=\"Y\"),--(INDIRECT(\"WP!$\" & $BA$41 & \"$\" & $DO46 & \":$\" & $BA$41 & \"$\" & $DP46)=1),INDIRECT(\"WP!$K$\" & $DO46 & \":$K$\" & $DP46)),IF(BC46<>\"\",0,\"\")),\"\"),\"\")","v":""},{"$f":"IFERROR(IF(WpAreaA_Sub1_exist,IF(SUMPRODUCT(--(INDIRECT(\"WP!$C$\" & $DO46 & \":$C$\" & $DP46)=$C46),--(INDIRECT(\"WP!$B\" & $DO46 & \":$B\" & $DP46)=\"Y\"),--(INDIRECT(\"WP!$\" & $BA$41 & \"$\" & $DO46 & \":$\" & $BA$41 & \"$\" & $DP46)<>\"\"),--(INDIRECT(\"WP!$K\" & $DO46 & \":$K\" & $DP46)>0))<>0,SUMPRODUCT(--(INDIRECT(\"WP!$C$\" & $DO46 & \":$C$\" & $DP46)=$C46),--(INDIRECT(\"WP!$B\" & $DO46 & \":$B\" & $DP46)=\"Y\"),--(INDIRECT(\"WP!$\" & $BA$41 & \"$\" &  $DO46 & \":$\" & $BA$41 & \"$\" & $DP46)<>\"\"),INDIRECT(\"WP!$K\" & $DO46 & \":$K\" & $DP46)),\"\"),\"\"),\"\")","v":""},{"$f":"IFERROR(IF(WpAreaA_Sub2_exist,IF(SUMPRODUCT(--(INDIRECT(\"WP!$C$\" & $DO46 & \":$C$\" & $DP46) =$C46),--(INDIRECT(\"WP!$\" & $BD$41 & \"$\" & $DO46 & \":$\" & $BD$41 & \"$\" & $DP46) <>\"\"),--(INDIRECT(\"WP!$K$\" & $DO46 & \":$K$\" & $DP46)>0))>0,SUMPRODUCT(--(INDIRECT(\"WP!$C$\" & $DO46 & \":$C$\" & $DP46) =$C46),--(INDIRECT(\"WP!$\" & $BD$41 & \"$\" & $DO46 & \":$\" & $BD$41 & \"$\" & $DP46) <>\"\"),INDIRECT(\"WP!$K\" & $DO46 & \":$K\" & $DP46),INDIRECT(\"WP!$\" & $BD$41 & \"$\" & $DO46 & \":$\" & $BD$41 & \"$\" & $DP46))/SUMPRODUCT(--(INDIRECT(\"WP!$C$\" & $DO46 & \":$C$\" & $DP46) =$C46),--(INDIRECT(\"WP!$\" & $BD$41 & \"$\" & $DO46 & \":$\" & $BD$41 & \"$\" & $DP46) <>\"\"),INDIRECT(\"WP!$K\" & $DO46 & \":$K\" & $DP46)),\"\"),\"\"),\"\")","v":""},{"$f":"IFERROR(IF(WpAreaA_Sub2_exist,IF(SUMPRODUCT(--(INDIRECT(\"WP!$C$\" & $DO46 & \":$C$\" & $DP46)=$C46),--(INDIRECT(\"WP!$B\" & $DO46 & \":$B\" & $DP46)=\"Y\"),--(INDIRECT(\"WP!$\" & $BD$41 & \"$\" & $DO46 & \":$\" & $BD$41 & \"$\" & $DP46)=1),--(INDIRECT(\"WP!$K\" & $DO46 & \":$K\" & $DP46)>0))<>0,SUMPRODUCT(--(INDIRECT(\"WP!$C$\" & $DO46 & \":$C$\" & $DP46)=$C46),--(INDIRECT(\"WP!$B\" & $DO46 & \":$B\" & $DP46)=\"Y\"),--(INDIRECT(\"WP!$\" & $BD$41 & \"$\" & $DO46 & \":$\" & $BD$41 & \"$\" & $DP46)=1),INDIRECT(\"WP!$K\" & $DO46 & \":$K\" & $DP46)),IF(BF46<>\"\",0,\"\")),\"\"),\"\")","v":""},{"$f":"IFERROR(IF(WpAreaA_Sub2_exist,IF(SUMPRODUCT(--(INDIRECT(\"WP!$C$\" & $DO46 & \":$C$\" & $DP46)=$C46),--(INDIRECT(\"WP!$B\" & $DO46 & \":$B\" & $DP46)=\"Y\"),--(INDIRECT(\"WP!$\" & $BD$41 & \"$\" & $DO46 & \":$\" & $BD$41 & \"$\" & $DP46)<>\"\"),--(INDIRECT(\"WP!$K\" & $DO46 & \":$K\" & $DP46)>0))<>0,SUMPRODUCT(--(INDIRECT(\"WP!$C$\" & $DO46 & \":$C$\" & $DP46)=$C46),--(INDIRECT(\"WP!$B\" & $DO46 & \":$B\" & $DP46)=\"Y\"),--(INDIRECT(\"WP!$\" & $BD$41 & \"$\" & $DO46 & \":$\" & $BD$41 & \"$\" & $DP46)<>\"\"),INDIRECT(\"WP!$K\" & $DO46 & \":$K\" & $DP46)),\"\"),\"\"),\"\")","v":""},{"$f":"IFERROR(IF(WpAreaA_Sub3_exist,IF(SUMPRODUCT(--(INDIRECT(\"WP!$C$\" & $DO46 & \":$C$\" & $DP46) =$C46),--(INDIRECT(\"WP!$\" & $BG$41 & \"$\" & $DO46 & \":$\" & $BG$41 & \"$\" & $DP46) <>\"\"),--(INDIRECT(\"WP!$K$\" & $DO46 & \":$K$\" & $DP46)>0))>0,SUMPRODUCT(--(INDIRECT(\"WP!$C$\" & $DO46 & \":$C$\" & $DP46) =$C46),--(INDIRECT(\"WP!$\" & $BG$41 & \"$\" & $DO46 & \":$\" & $BG$41 & \"$\" & $DP46) <>\"\"),INDIRECT(\"WP!$K\" & $DO46 & \":$K\" & $DP46),INDIRECT(\"WP!$\" & $BG$41 & \"$\" & $DO46 & \":$\" & $BG$41 & \"$\" & $DP46))/SUMPRODUCT(--(INDIRECT(\"WP!$C$\" & $DO46 & \":$C$\" & $DP46) =$C46),--(INDIRECT(\"WP!$\" & $BG$41 & \"$\" & $DO46 & \":$\" & $BG$41 & \"$\" & $DP46) <>\"\"),INDIRECT(\"WP!$K\" & $DO46 & \":$K\" & $DP46)),\"\"),\"\"),\"\")","v":""},{"$f":"IFERROR(IF(WpAreaA_Sub3_exist,IF(SUMPRODUCT(--(INDIRECT(\"WP!$C$\" & $DO46 & \":$C$\" & $DP46)=$C46),--(INDIRECT(\"WP!$B\" & $DO46 & \":$B\" & $DP46)=\"Y\"),--(INDIRECT(\"WP!$\" & $BG$41 & \"$\" & $DO46 & \":$\" & $BG$41 & \"$\" & $DP46)=1),--(INDIRECT(\"WP!$K\" & $DO46 & \":$K\" & $DP46)>0))<>0,SUMPRODUCT(--(INDIRECT(\"WP!$C$\" & $DO46 & \":$C$\" & $DP46)=$C46),--(INDIRECT(\"WP!$B\" & $DO46 & \":$B\" & $DP46)=\"Y\"),--(INDIRECT(\"WP!$\" & $BG$41 & \"$\" & $DO46 & \":$\" & $BG$41 & \"$\" & $DP46)=1),INDIRECT(\"WP!$K\" & $DO46 & \":$K\" & $DP46)),IF(BI46<>\"\",0,\"\")),\"\"),\"\")","v":""},{"$f":"IFERROR(IF(WpAreaA_Sub3_exist,IF(SUMPRODUCT(--(INDIRECT(\"WP!$C$\" & $DO46 & \":$C$\" & $DP46)=$C46),--(INDIRECT(\"WP!$B\" & $DO46 & \":$B\" & $DP46)=\"Y\"),--(INDIRECT(\"WP!$\" & $BG$41 & \"$\" & $DO46 & \":$\" & $BG$41 & \"$\" & $DP46)<>\"\"),--(INDIRECT(\"WP!$K\" & $DO46 & \":$K\" & $DP46)>0))<>0,SUMPRODUCT(--(INDIRECT(\"WP!$C$\" & $DO46 & \":$C$\" & $DP46)=$C46),--(INDIRECT(\"WP!$B\" & $DO46 & \":$B\" & $DP46)=\"Y\"),--(INDIRECT(\"WP!$\" & $BG$41 & \"$\" & $DO46 & \":$\" & $BG$41 & \"$\" & $DP46)<>\"\"),INDIRECT(\"WP!$K\" & $DO46 & \":$K\" & $DP46)),\"\"),\"\"),\"\")","v":""},null,{"$f":"IFERROR(IF(WpAreaB_Sub1_exist,IF(SUMPRODUCT(--(INDIRECT(\"WP!$C$\" & $DO46 & \":$C$\" & $DP46) =$C46),--(INDIRECT(\"WP!$\" & $BK$41 & \"$\" & $DO46 & \":$\" & $BK$41 & \"$\" & $DP46) <>\"\"),--(INDIRECT(\"WP!$K$\" & $DO46 & \":$K$\" & $DP46)>0))>0,SUMPRODUCT(--(INDIRECT(\"WP!$C$\" & $DO46 & \":$C$\" & $DP46) =$C46),--(INDIRECT(\"WP!$\" & $BK$41 & \"$\" & $DO46 & \":$\" & $BK$41 & \"$\" & $DP46) <>\"\"),INDIRECT(\"WP!$K\" & $DO46 & \":$K\" & $DP46),INDIRECT(\"WP!$\" & $BK$41 & \"$\" & $DO46 & \":$\" & $BK$41 & \"$\" & $DP46))/SUMPRODUCT(--(INDIRECT(\"WP!$C$\" & $DO46 & \":$C$\" & $DP46) =$C46),--(INDIRECT(\"WP!$\" & $BK$41 & \"$\" & $DO46 & \":$\" & $BK$41 & \"$\" & $DP46) <>\"\"),INDIRECT(\"WP!$K\" & $DO46 & \":$K\" & $DP46)),\"\"),\"\"),\"\")","v":""},{"$f":"IFERROR(IF(WpAreaB_Sub1_exist,IF(SUMPRODUCT(--(INDIRECT(\"WP!$C$\" & $DO46 & \":$C$\" & $DP46)=$C46),--(INDIRECT(\"WP!$B\" & $DO46 & \":$B\" & $DP46)=\"Y\"),--(INDIRECT(\"WP!$\" & $BK$41 & \"$\" & $DO46 & \":$\" & $BK$41 & \"$\" & $DP46)=1),--(INDIRECT(\"WP!$K\" & $DO46 & \":$K\" & $DP46)>0))<>0,SUMPRODUCT(--(INDIRECT(\"WP!$C$\" & $DO46 & \":$C$\" & $DP46)=$C46),--(INDIRECT(\"WP!$B\" & $DO46 & \":$B\" & $DP46)=\"Y\"),--(INDIRECT(\"WP!$\" & $BK$41 & \"$\" & $DO46 & \":$\" & $BK$41 & \"$\" & $DP46)=1),INDIRECT(\"WP!$K\" & $DO46 & \":$K\" & $DP46)),IF(BM46<>\"\",0,\"\")),\"\"),\"\")","v":""},{"$f":"IFERROR(IF(WpAreaB_Sub1_exist,IF(SUMPRODUCT(--(INDIRECT(\"WP!$C$\" & $DO46 & \":$C$\" & $DP46)=$C46),--(INDIRECT(\"WP!$B\" & $DO46 & \":$B\" & $DP46)=\"Y\"),--(INDIRECT(\"WP!$\" & $BK$41 & \"$\" & $DO46 & \":$\" & $BK$41 & \"$\" & $DP46)<>\"\"),--(INDIRECT(\"WP!$K\" & $DO46 & \":$K\" & $DP46)>0))<>0,SUMPRODUCT(--(INDIRECT(\"WP!$C$\" & $DO46 & \":$C$\" & $DP46)=$C46),--(INDIRECT(\"WP!$B\" & $DO46 & \":$B\" & $DP46)=\"Y\"),--(INDIRECT(\"WP!$\" & $BK$41 & \"$\" & $DO46 & \":$\" & $BK$41 & \"$\" & $DP46)<>\"\"),INDIRECT(\"WP!$K\" & $DO46 & \":$K\" & $DP46)),\"\"),\"\"),\"\")","v":""},{"$f":"IFERROR(IF(WpAreaB_Sub2_exist,IF(SUMPRODUCT(--(INDIRECT(\"WP!$C$\" & $DO46 & \":$C$\" & $DP46) =$C46),--(INDIRECT(\"WP!$\" & $BN$41 & \"$\" & $DO46 & \":$\" & $BN$41 & \"$\" & $DP46) <>\"\"),--(INDIRECT(\"WP!$K$\" & $DO46 & \":$K$\" & $DP46)>0))>0,SUMPRODUCT(--(INDIRECT(\"WP!$C$\" & $DO46 & \":$C$\" & $DP46) =$C46),--(INDIRECT(\"WP!$\" & $BN$41 & \"$\" & $DO46 & \":$\" & $BN$41 & \"$\" & $DP46) <>\"\"),INDIRECT(\"WP!$K\" & $DO46 & \":$K\" & $DP46),INDIRECT(\"WP!$\" & $BN$41 & \"$\" & $DO46 & \":$\" & $BN$41 & \"$\" & $DP46))/SUMPRODUCT(--(INDIRECT(\"WP!$C$\" & $DO46 & \":$C$\" & $DP46) =$C46),--(INDIRECT(\"WP!$\" & $BN$41 & \"$\" & $DO46 & \":$\" & $BN$41 & \"$\" & $DP46) <>\"\"),INDIRECT(\"WP!$K\" & $DO46 & \":$K\" & $DP46)),\"\"),\"\"),\"\")","v":""},{"$f":"IFERROR(IF(WpAreaB_Sub2_exist,IF(SUMPRODUCT(--(INDIRECT(\"WP!$C$\" & $DO46 & \":$C$\" & $DP46)=$C46),--(INDIRECT(\"WP!$B\" & $DO46 & \":$B\" & $DP46)=\"Y\"),--(INDIRECT(\"WP!$\" & $BN$41 & \"$\" & $DO46 & \":$\" & $BN$41 & \"$\" & $DP46)=1),--(INDIRECT(\"WP!$K\" & $DO46 & \":$K\" & $DP46)>0))<>0,SUMPRODUCT(--(INDIRECT(\"WP!$C$\" & $DO46 & \":$C$\" & $DP46)=$C46),--(INDIRECT(\"WP!$B\" & $DO46 & \":$B\" & $DP46)=\"Y\"),--(INDIRECT(\"WP!$\" & $BN$41 & \"$\" & $DO46 & \":$\" & $BN$41 & \"$\" & $DP46)=1),INDIRECT(\"WP!$K\" & $DO46 & \":$K\" & $DP46)),IF(BP46<>\"\",0,\"\")),\"\"),\"\")","v":""},{"$f":"IFERROR(IF(WpAreaB_Sub2_exist,IF(SUMPRODUCT(--(INDIRECT(\"WP!$C$\" & $DO46 & \":$C$\" & $DP46)=$C46),--(INDIRECT(\"WP!$B\" & $DO46 & \":$B\" & $DP46)=\"Y\"),--(INDIRECT(\"WP!$\" & $BN$41 & \"$\" & $DO46 & \":$\" & $BN$41 & \"$\" & $DP46)<>\"\"),--(INDIRECT(\"WP!$K\" & $DO46 & \":$K\" & $DP46)>0))<>0,SUMPRODUCT(--(INDIRECT(\"WP!$C$\" & $DO46 & \":$C$\" & $DP46)=$C46),--(INDIRECT(\"WP!$B\" & $DO46 & \":$B\" & $DP46)=\"Y\"),--(INDIRECT(\"WP!$\" & $BN$41 & \"$\" & $DO46 & \":$\" & $BN$41 & \"$\" & $DP46)<>\"\"),INDIRECT(\"WP!$K\" & $DO46 & \":$K\" & $DP46)),\"\"),\"\"),\"\")","v":""},{"$f":"IFERROR(IF(WpAreaB_Sub3_exist,IF(SUMPRODUCT(--(INDIRECT(\"WP!$C$\" & $DO46 & \":$C$\" & $DP46) =$C46),--(INDIRECT(\"WP!$\" & $BQ$41 & \"$\" & $DO46 & \":$\" & $BQ$41 & \"$\" & $DP46) <>\"\"),--(INDIRECT(\"WP!$K$\" & $DO46 & \":$K$\" & $DP46)>0))>0,SUMPRODUCT(--(INDIRECT(\"WP!$C$\" & $DO46 & \":$C$\" & $DP46) =$C46),--(INDIRECT(\"WP!$\" & $BQ$41 & \"$\" & $DO46 & \":$\" & $BQ$41 & \"$\" & $DP46) <>\"\"),INDIRECT(\"WP!$K\" & $DO46 & \":$K\" & $DP46),INDIRECT(\"WP!$\" & $BQ$41 & \"$\" & $DO46 & \":$\" & $BQ$41 & \"$\" & $DP46))/SUMPRODUCT(--(INDIRECT(\"WP!$C$\" & $DO46 & \":$C$\" & $DP46) =$C46),--(INDIRECT(\"WP!$\" & $BQ$41 & \"$\" & $DO46 & \":$\" & $BQ$41 & \"$\" & $DP46) <>\"\"),INDIRECT(\"WP!$K\" & $DO46 & \":$K\" & $DP46)),\"\"),\"\"),\"\")","v":""},{"$f":"IFERROR(IF(WpAreaB_Sub3_exist,IF(SUMPRODUCT(--(INDIRECT(\"WP!$C$\" & $DO46 & \":$C$\" & $DP46)=$C46),--(INDIRECT(\"WP!$B\" & $DO46 & \":$B\" & $DP46)=\"Y\"),--(INDIRECT(\"WP!$\" & $BQ$41 & \"$\" & $DO46 & \":$\" & $BQ$41 & \"$\" & $DP46)=1),--(INDIRECT(\"WP!$K\" & $DO46 & \":$K\" & $DP46)>0))<>0,SUMPRODUCT(--(INDIRECT(\"WP!$C$\" & $DO46 & \":$C$\" & $DP46)=$C46),--(INDIRECT(\"WP!$B\" & $DO46 & \":$B\" & $DP46)=\"Y\"),--(INDIRECT(\"WP!$\" & $BQ$41 & \"$\" & $DO46 & \":$\" & $BQ$41 & \"$\" & $DP46)=1),INDIRECT(\"WP!$K\" & $DO46 & \":$K\" & $DP46)),IF(BS46<>\"\",0,\"\")),\"\"),\"\")","v":""},{"$f":"IFERROR(IF(WpAreaB_Sub3_exist,IF(SUMPRODUCT(--(INDIRECT(\"WP!$C$\" & $DO46 & \":$C$\" & $DP46)=$C46),--(INDIRECT(\"WP!$B\" & $DO46 & \":$B\" & $DP46)=\"Y\"),--(INDIRECT(\"WP!$\" & $BQ$41 & \"$\" & $DO46 & \":$\" & $BQ$41 & \"$\" & $DP46)<>\"\"),--(INDIRECT(\"WP!$K\" & $DO46 & \":$K\" & $DP46)>0))<>0,SUMPRODUCT(--(INDIRECT(\"WP!$C$\" & $DO46 & \":$C$\" & $DP46)=$C46),--(INDIRECT(\"WP!$B\" & $DO46 & \":$B\" & $DP46)=\"Y\"),--(INDIRECT(\"WP!$\" & $BQ$41 & \"$\" & $DO46 & \":$\" & $BQ$41 & \"$\" & $DP46)<>\"\"),INDIRECT(\"WP!$K\" & $DO46 & \":$K\" & $DP46)),\"\"),\"\"),\"\")","v":""},null,{"$f":"IFERROR(IF(WpAreaC_Sub1_exist,IF(SUMPRODUCT(--(INDIRECT(\"WP!$C$\" & $DO46 & \":$C$\" & $DP46) =$C46),--(INDIRECT(\"WP!$\" & $BU$41 & \"$\" & $DO46 & \":$\" & $BU$41 & \"$\" & $DP46) <>\"\"),--(INDIRECT(\"WP!$K$\" & $DO46 & \":$K$\" & $DP46)>0))>0,SUMPRODUCT(--(INDIRECT(\"WP!$C$\" & $DO46 & \":$C$\" & $DP46) =$C46),--(INDIRECT(\"WP!$\" & $BU$41 & \"$\" & $DO46 & \":$\" & $BU$41 & \"$\" & $DP46) <>\"\"),INDIRECT(\"WP!$K\" & $DO46 & \":$K\" & $DP46),INDIRECT(\"WP!$\" & $BU$41 & \"$\" & $DO46 & \":$\" & $BU$41 & \"$\" & $DP46))/SUMPRODUCT(--(INDIRECT(\"WP!$C$\" & $DO46 & \":$C$\" & $DP46) =$C46),--(INDIRECT(\"WP!$\" & $BU$41 & \"$\" & $DO46 & \":$\" & $BU$41 & \"$\" & $DP46) <>\"\"),INDIRECT(\"WP!$K\" & $DO46 & \":$K\" & $DP46)),\"\"),\"\"),\"\")","v":""},{"$f":"IFERROR(IF(WpAreaC_Sub1_exist,IF(SUMPRODUCT(--(INDIRECT(\"WP!$C$\" & $DO46 & \":$C$\" & $DP46)=$C46),--(INDIRECT(\"WP!$B\" & $DO46 & \":$B\" & $DP46)=\"Y\"),--(INDIRECT(\"WP!$\" & $BU$41 & \"$\" & $DO46 & \":$\" & $BU$41 & \"$\" & $DP46)=1),--(INDIRECT(\"WP!$K\" & $DO46 & \":$K\" & $DP46)>0))<>0,SUMPRODUCT(--(INDIRECT(\"WP!$C$\" & $DO46 & \":$C$\" & $DP46)=$C46),--(INDIRECT(\"WP!$B\" & $DO46 & \":$B\" & $DP46)=\"Y\"),--(INDIRECT(\"WP!$\" & $BU$41 & \"$\" & $DO46 & \":$\" & $BU$41 & \"$\" & $DP46)=1),INDIRECT(\"WP!$K\" & $DO46 & \":$K\" & $DP46)),IF(BW46<>\"\",0,\"\")),\"\"),\"\")","v":""},{"$f":"IFERROR(IF(WpAreaC_Sub1_exist,IF(SUMPRODUCT(--(INDIRECT(\"WP!$C$\" & $DO46 & \":$C$\" & $DP46)=$C46),--(INDIRECT(\"WP!$B\" & $DO46 & \":$B\" & $DP46)=\"Y\"),--(INDIRECT(\"WP!$\" & $BU$41 & \"$\" & $DO46 & \":$\" & $BU$41 & \"$\" & $DP46)<>\"\"),--(INDIRECT(\"WP!$K\" & $DO46 & \":$K\" & $DP46)>0))<>0,SUMPRODUCT(--(INDIRECT(\"WP!$C$\" & $DO46 & \":$C$\" & $DP46)=$C46),--(INDIRECT(\"WP!$B\" & $DO46 & \":$B\" & $DP46)=\"Y\"),--(INDIRECT(\"WP!$\" & $BU$41 & \"$\" & $DO46 & \":$\" & $BU$41 & \"$\" & $DP46)<>\"\"),INDIRECT(\"WP!$K\" & $DO46 & \":$K\" & $DP46)),\"\"),\"\"),\"\")","v":""},{"$f":"IFERROR(IF(WpAreaC_Sub2_exist,IF(SUMPRODUCT(--(INDIRECT(\"WP!$C$\" & $DO46 & \":$C$\" & $DP46) =$C46),--(INDIRECT(\"WP!$\" & $BX$41 & \"$\" & $DO46 & \":$\" & $BX$41 & \"$\" & $DP46) <>\"\"),--(INDIRECT(\"WP!$K$\" & $DO46 & \":$K$\" & $DP46)>0))>0,SUMPRODUCT(--(INDIRECT(\"WP!$C$\" & $DO46 & \":$C$\" & $DP46) =$C46),--(INDIRECT(\"WP!$\" & $BX$41 & \"$\" & $DO46 & \":$\" & $BX$41 & \"$\" & $DP46) <>\"\"),INDIRECT(\"WP!$K\" & $DO46 & \":$K\" & $DP46),INDIRECT(\"WP!$\" & $BX$41 & \"$\" & $DO46 & \":$\" & $BX$41 & \"$\" & $DP46))/SUMPRODUCT(--(INDIRECT(\"WP!$C$\" & $DO46 & \":$C$\" & $DP46) =$C46),--(INDIRECT(\"WP!$\" & $BX$41 & \"$\" & $DO46 & \":$\" & $BX$41 & \"$\" & $DP46) <>\"\"),INDIRECT(\"WP!$K\" & $DO46 & \":$K\" & $DP46)),\"\"),\"\"),\"\")","v":""},{"$f":"IFERROR(IF(WpAreaC_Sub2_exist,IF(SUMPRODUCT(--(INDIRECT(\"WP!$C$\" & $DO46 & \":$C$\" & $DP46)=$C46),--(INDIRECT(\"WP!$B\" & $DO46 & \":$B\" & $DP46)=\"Y\"),--(INDIRECT(\"WP!$\" & $BX$41 & \"$\" & $DO46 & \":$\" & $BX$41 & \"$\" & $DP46)=1),--(INDIRECT(\"WP!$K\" & $DO46 & \":$K\" & $DP46)>0))<>0,SUMPRODUCT(--(INDIRECT(\"WP!$C$\" & $DO46 & \":$C$\" & $DP46)=$C46),--(INDIRECT(\"WP!$B\" & $DO46 & \":$B\" & $DP46)=\"Y\"),--(INDIRECT(\"WP!$\" & $BX$41 & \"$\" & $DO46 & \":$\" & $BX$41 & \"$\" & $DP46)=1),INDIRECT(\"WP!$K\" & $DO46 & \":$K\" & $DP46)),IF(BZ46<>\"\",0,\"\")),\"\"),\"\")","v":""},{"$f":"IFERROR(IF(WpAreaC_Sub2_exist,IF(SUMPRODUCT(--(INDIRECT(\"WP!$C$\" & $DO46 & \":$C$\" & $DP46)=$C46),--(INDIRECT(\"WP!$B\" & $DO46 & \":$B\" & $DP46)=\"Y\"),--(INDIRECT(\"WP!$\" & $BX$41 & \"$\" & $DO46 & \":$\" & $BX$41 & \"$\" & $DP46)<>\"\"),--(INDIRECT(\"WP!$K\" & $DO46 & \":$K\" & $DP46)>0))<>0,SUMPRODUCT(--(INDIRECT(\"WP!$C$\" & $DO46 & \":$C$\" & $DP46)=$C46),--(INDIRECT(\"WP!$B\" & $DO46 & \":$B\" & $DP46)=\"Y\"),--(INDIRECT(\"WP!$\" & $BX$41 & \"$\" & $DO46 & \":$\" & $BX$41 & \"$\" & $DP46)<>\"\"),INDIRECT(\"WP!$K\" & $DO46 & \":$K\" & $DP46)),\"\"),\"\"),\"\")","v":""},{"$f":"IFERROR(IF(WpAreaC_Sub3_exist,F(SUMPRODUCT(--(INDIRECT(\"WP!$C$\" & $DO46 & \":$C$\" & $DP46) =$C46),--(INDIRECT(\"WP!$\" & $CA$41 & \"$\" & $DO46 & \":$\" & $CA$41 & \"$\" & $DP46) <>\"\"),--(INDIRECT(\"WP!$K$\" & $DO46 & \":$K$\" & $DP46)>0))>0,SUMPRODUCT(--(INDIRECT(\"WP!$C$\" & $DO46 & \":$C$\" & $DP46) =$C46),--(INDIRECT(\"WP!$\" & $CA$41 & \"$\" & $DO46 & \":$\" & $CA$41 & \"$\" & $DP46) <>\"\"),INDIRECT(\"WP!$K\" & $DO46 & \":$K\" & $DP46),INDIRECT(\"WP!$\" & $CA$41 & \"$\" & $DO46 & \":$\" & $CA$41 & \"$\" & $DP46))/SUMPRODUCT(--(INDIRECT(\"WP!$C$\" & $DO46 & \":$C$\" & $DP46) =$C46),--(INDIRECT(\"WP!$\" & $CA$41 & \"$\" & $DO46 & \":$\" & $CA$41 & \"$\" & $DP46) <>\"\"),INDIRECT(\"WP!$K\" & $DO46 & \":$K\" & $DP46)),\"\"),\"\"),\"\")","v":""},{"$f":"IFERROR(IF(WpAreaC_Sub3_exist,IF(SUMPRODUCT(--(INDIRECT(\"WP!$C$\" & $DO46 & \":$C$\" & $DP46)=$C46),--(INDIRECT(\"WP!$B\" & $DO46 & \":$B\" & $DP46)=\"Y\"),--(INDIRECT(\"WP!$\" & $CA$41 & \"$\" & $DO46 & \":$\" & $CA$41 & \"$\" & $DP46)=1),--(INDIRECT(\"WP!$K\" & $DO46 & \":$K\" & $DP46)>0))<>0,SUMPRODUCT(--(INDIRECT(\"WP!$C$\" & $DO46 & \":$C$\" & $DP46)=$C46),--(INDIRECT(\"WP!$B\" & $DO46 & \":$B\" & $DP46)=\"Y\"),--(INDIRECT(\"WP!$\" & $CA$41 & \"$\" & $DO46 & \":$\" & $CA$41 & \"$\" & $DP46)=1),INDIRECT(\"WP!$K\" & $DO46 & \":$K\" & $DP46)),IF(CC46<>\"\",0,\"\")),\"\"),\"\")","v":""},{"$f":"IFERROR(IF(WpAreaC_Sub3_exist,IF(SUMPRODUCT(--(INDIRECT(\"WP!$C$\" & $DO46 & \":$C$\" & $DP46)=$C46),--(INDIRECT(\"WP!$B\" & $DO46 & \":$B\" & $DP46)=\"Y\"),--(INDIRECT(\"WP!$\" & $CA$41 & \"$\" & $DO46 & \":$\" & $CA$41 & \"$\" & $DP46)<>\"\"),--(INDIRECT(\"WP!$K\" & $DO46 & \":$K\" & $DP46)>0))<>0,SUMPRODUCT(--(INDIRECT(\"WP!$C$\" & $DO46 & \":$C$\" & $DP46)=$C46),--(INDIRECT(\"WP!$B\" & $DO46 & \":$B\" & $DP46)=\"Y\"),--(INDIRECT(\"WP!$\" & $CA$41 & \"$\" & $DO46 & \":$\" & $CA$41 & \"$\" & $DP46)<>\"\"),INDIRECT(\"WP!$K\" & $DO46 & \":$K\" & $DP46)),\"\"),\"\"),\"\")","v":""},null,null,null,null,"","","","","","","","","","","","",null,"","","","","","","","","",null,"","","","","","","","","",null,{"$f":"MIN(IF(WP!$C$12:$C$53=$C46,ROW(WP!$C$12:$C$53),\"\"))","v":20},{"$f":"MAX(IF(WP!$C$12:$C$53=$C46,ROW(WP!$C$12:$C$53),\"\"))","v":41}]
[null,"RF Rx test cases","36.521-1 Rx",{"$f":"getProgress(AX47,CH47,\"%\",1,1)","v":"100%\n(+100%)"},{"$f":"getProgress(AY47,CI47,,,1)","v":""},{"$f":"getProgress(AZ47,CJ47,,,1)","v":""},null,{"$f":"getProgress(BA47,CK47,\"%\",1,1,WpAreaA_Sub1_exist)","v":"100%\n(+100%)"},{"$f":"getProgress(BB47,CL47,,,1,WpAreaA_Sub1_exist)","v":""},{"$f":"getProgress(BC47,CM47,,,1,WpAreaA_Sub1_exist)","v":""},{"$f":"getProgress(BD47,CN47,\"%\",1,1,WpAreaA_Sub2_exist)","v":""},{"$f":"getProgress(BE47,CO47,,,1,WpAreaA_Sub2_exist)","v":""},{"$f":"getProgress(BF47,CP47,,,1,WpAreaA_Sub2_exist)","v":""},{"$f":"getProgress(BG47,CQ47,\"%\",1,1,WpAreaA_Sub3_exist)","v":""},{"$f":"getProgress(BH47,CR47,,,1,WpAreaA_Sub3_exist)","v":""},{"$f":"getProgress(BI47,CS47,,,1,WpAreaA_Sub3_exist)","v":""},null,{"$f":"getProgress(BK47,CU47,\"%\",1,1,WpAreaB_Sub1_exist)","v":""},{"$f":"getProgress(BL47,CV47,,,1,WpAreaB_Sub1_exist)","v":""},{"$f":"getProgress(BM47,CW47,,,1,WpAreaB_Sub1_exist)","v":""},{"$f":"getProgress(BN47,CX47,\"%\",1,1,WpAreaB_Sub2_exist)","v":""},{"$f":"getProgress(BO47,CY47,,,1,WpAreaB_Sub2_exist)","v":""},{"$f":"getProgress(BP47,CZ47,,,1,WpAreaB_Sub2_exist)","v":""},{"$f":"getProgress(BQ47,DA47,\"%\",1,1,WpAreaB_Sub3_exist)","v":""},{"$f":"getProgress(BR47,DB47,,,1,WpAreaB_Sub3_exist)","v":""},{"$f":"getProgress(BS47,DC47,,,1,WpAreaB_Sub3_exist)","v":""},null,{"$f":"getProgress(BU47,DE47,\"%\",1,1,WpAreaC_Sub1_exist)","v":""},{"$f":"getProgress(BV47,DF47,,,1,WpAreaC_Sub1_exist)","v":""},{"$f":"getProgress(BW47,DG47,,,1,WpAreaC_Sub1_exist)","v":""},{"$f":"getProgress(BX47,DH47,\"%\",1,1,WpAreaC_Sub2_exist)","v":""},{"$f":"getProgress(BY47,DI47,,,1,WpAreaC_Sub2_exist)","v":""},{"$f":"getProgress(BZ47,DJ47,,,1,WpAreaC_Sub2_exist)","v":""},{"$f":"getProgress(CA47,DK47,\"%\",1,1,WpAreaC_Sub3_exist)","v":""},{"$f":"getProgress(CB47,DL47,,,1,WpAreaC_Sub3_exist)","v":""},{"$f":"getProgress(CC47,DM47,,,1,WpAreaC_Sub3_exist)","v":""},null,null,null,null,null,null,null,null,null,null,null,null,null,{"$f":"IFERROR((IF(WpAreaA_exist,IF(BA47<>\"\",BA47*WP!$AB$9,0)+IF(BD47<>\"\",BD47*WP!$AC$9,0)+IF(BG47<>\"\",BG47*WP!$AD$9,0),0)+IF(WpAreaB_exist,IF(BK47<>\"\",BK47*WP!$AE$10)+IF(BN47<>\"\",BN47*WP!$AF$10,0)+IF(BQ47<>\"\",BQ47*WP!$AG$10,0),0)+IF(WpAreaC_exist,IF(BU47<>\"\",BU47*WP!$AH$10)+IF(BX47<>\"\",BX47*WP!$AI$10,0)+IF(CA47<>\"\",CA47*WP!$AJ$10,0),0))/(IF(WpAreaA_exist,IF(BA47<>\"\",WP!$AB$9,0)+IF(BD47<>\"\",WP!$AC$9,0)+IF(BG47<>\"\",WP!$AD$9,0),0)+IF(WpAreaB_exist,IF(BK47<>\"\",WP!$AE$10,0)+IF(BN47<>\"\",WP!$AF$10,0)+IF(BQ47<>\"\",WP!$AG$10,0),0)+ IF(WpAreaC_exist,IF(BU47<>\"\",WP!$AH$10,0)+IF(BX47<>\"\",WP!$AI$10,0)+IF(CA47<>\"\",WP!$AJ$10,0),0)),\"\")","v":1},{"$f":"IFERROR(IF(SUMPRODUCT(--(INDIRECT(\"WP!$C$\" & $DO47 & \":$C$\" & $DP47)=$C47),--(INDIRECT(\"WP!$B$\" & $DO47 & \":$B$\" & $DP47)=\"Y\"),--(INDIRECT(\"WP!$\" & $AX$41 & \"$\" & $DO47 & \":$\" & $AX$41 & \"$\" & $DP47)=1),--(INDIRECT(\"WP!$K$\" & $DO47 & \":$K$\" & $DP47)>0))<>0,SUMPRODUCT(--(INDIRECT(\"WP!$C$\" & $DO47 & \":$C$\" & $DP47)=$C47),--(INDIRECT(\"WP!$B$\" & $DO47 & \":$B$\" & $DP47)=\"Y\"),--(INDIRECT(\"WP!$\" & $AX$41 & \"$\" & $DO47 & \":$\" & $AX$41 & \"$\" & $DP47)=1),INDIRECT(\"WP!$K$\" & $DO47 & \":$K$\" & $DP47)),IF(AZ47<>\"\",0,\"\")),\"\")","v":""},{"$f":"IFERROR(IF(SUMPRODUCT(--(INDIRECT(\"WP!$C$\" & $DO47 & \":$C$\" & $DP47)=$C47),--(INDIRECT(\"WP!$B\" & $DO47 & \":$B\" & $DP47)=\"Y\"),--(INDIRECT(\"WP!$\" & $AX$41 & \"$\" & $DO47 & \":$\" & $AX$41 & \"$\" & $DP47)<>\"\"),--(INDIRECT(\"WP!$K\" & $DO47 & \":$K\" & $DP47)>0))<>0,SUMPRODUCT(--(INDIRECT(\"WP!$C$\" & $DO47 & \":$C$\" & $DP47)=$C47),--(INDIRECT(\"WP!$B\" & $DO47 & \":$B\" & $DP47)=\"Y\"),--(INDIRECT(\"WP!$\" & $AX$41 & \"$\" &  $DO47 & \":$\" & $AX$41 & \"$\" & $DP47)<>\"\"),INDIRECT(\"WP!$K\" & $DO47 & \":$K\" & $DP47)),\"\"),\"\")","v":""},{"$f":"IFERROR(IF(WpAreaA_Sub1_exist,IF(SUMPRODUCT(--(INDIRECT(\"WP!$C$\" & $DO47 & \":$C$\" & $DP47) =$C47),--(INDIRECT(\"WP!$\" & $BA$41 & \"$\" & $DO47 & \":$\" & $BA$41 & \"$\" & $DP47) <>\"\"),--(INDIRECT(\"WP!$K$\" & $DO47 & \":$K$\" & $DP47)>0))>0,SUMPRODUCT(--(INDIRECT(\"WP!$C$\" & $DO47 & \":$C$\" & $DP47) =$C47),--(INDIRECT(\"WP!$\" & $BA$41 & \"$\" & $DO47 & \":$\" & $BA$41 & \"$\" & $DP47) <>\"\"),INDIRECT(\"WP!$K$\" & $DO47 & \":$K$\" & $DP47),INDIRECT(\"WP!$\" & $BA$41 & \"$\" & $DO47 & \":$\" & $BA$41 & \"$\" & $DP47))/SUMPRODUCT(--(INDIRECT(\"WP!$C$\" & $DO47 & \":$C$\" & $DP47) =$C47),--(INDIRECT(\"WP!$\" & $BA$41 & \"$\" & $DO47 & \":$\" & $BA$41 & \"$\" & $DP47) <>\"\"),INDIRECT(\"WP!$K$\" & $DO47 & \":$K$\" & $DP47)),\"\"),\"\"),\"\")","v":1},{"$f":"IFERROR(IF(WpAreaA_Sub1_exist,IF(SUMPRODUCT(--(INDIRECT(\"WP!$C$\" & $DO47 & \":$C$\" & $DP47)=$C47),--(INDIRECT(\"WP!$B$\" & $DO47 & \":$B$\" & $DP47)=\"Y\"),--(INDIRECT(\"WP!$\" & $BA$41 & \"$\" & $DO47 & \":$\" & $BA$41 & \"$\" & $DP47)=1),--(INDIRECT(\"WP!$K$\" & $DO47 & \":$K$\" & $DP47)>0))<>0,SUMPRODUCT(--(INDIRECT(\"WP!$C$\" & $DO47 & \":$C$\" & $DP47)=$C47),--(INDIRECT(\"WP!$B$\" & $DO47 & \":$B$\" & $DP47)=\"Y\"),--(INDIRECT(\"WP!$\" & $BA$41 & \"$\" & $DO47 & \":$\" & $BA$41 & \"$\" & $DP47)=1),INDIRECT(\"WP!$K$\" & $DO47 & \":$K$\" & $DP47)),IF(BC47<>\"\",0,\"\")),\"\"),\"\")","v":""},{"$f":"IFERROR(IF(WpAreaA_Sub1_exist,IF(SUMPRODUCT(--(INDIRECT(\"WP!$C$\" & $DO47 & \":$C$\" & $DP47)=$C47),--(INDIRECT(\"WP!$B\" & $DO47 & \":$B\" & $DP47)=\"Y\"),--(INDIRECT(\"WP!$\" & $BA$41 & \"$\" & $DO47 & \":$\" & $BA$41 & \"$\" & $DP47)<>\"\"),--(INDIRECT(\"WP!$K\" & $DO47 & \":$K\" & $DP47)>0))<>0,SUMPRODUCT(--(INDIRECT(\"WP!$C$\" & $DO47 & \":$C$\" & $DP47)=$C47),--(INDIRECT(\"WP!$B\" & $DO47 & \":$B\" & $DP47)=\"Y\"),--(INDIRECT(\"WP!$\" & $BA$41 & \"$\" &  $DO47 & \":$\" & $BA$41 & \"$\" & $DP47)<>\"\"),INDIRECT(\"WP!$K\" & $DO47 & \":$K\" & $DP47)),\"\"),\"\"),\"\")","v":""},{"$f":"IFERROR(IF(WpAreaA_Sub2_exist,IF(SUMPRODUCT(--(INDIRECT(\"WP!$C$\" & $DO47 & \":$C$\" & $DP47) =$C47),--(INDIRECT(\"WP!$\" & $BD$41 & \"$\" & $DO47 & \":$\" & $BD$41 & \"$\" & $DP47) <>\"\"),--(INDIRECT(\"WP!$K$\" & $DO47 & \":$K$\" & $DP47)>0))>0,SUMPRODUCT(--(INDIRECT(\"WP!$C$\" & $DO47 & \":$C$\" & $DP47) =$C47),--(INDIRECT(\"WP!$\" & $BD$41 & \"$\" & $DO47 & \":$\" & $BD$41 & \"$\" & $DP47) <>\"\"),INDIRECT(\"WP!$K\" & $DO47 & \":$K\" & $DP47),INDIRECT(\"WP!$\" & $BD$41 & \"$\" & $DO47 & \":$\" & $BD$41 & \"$\" & $DP47))/SUMPRODUCT(--(INDIRECT(\"WP!$C$\" & $DO47 & \":$C$\" & $DP47) =$C47),--(INDIRECT(\"WP!$\" & $BD$41 & \"$\" & $DO47 & \":$\" & $BD$41 & \"$\" & $DP47) <>\"\"),INDIRECT(\"WP!$K\" & $DO47 & \":$K\" & $DP47)),\"\"),\"\"),\"\")","v":""},{"$f":"IFERROR(IF(WpAreaA_Sub2_exist,IF(SUMPRODUCT(--(INDIRECT(\"WP!$C$\" & $DO47 & \":$C$\" & $DP47)=$C47),--(INDIRECT(\"WP!$B\" & $DO47 & \":$B\" & $DP47)=\"Y\"),--(INDIRECT(\"WP!$\" & $BD$41 & \"$\" & $DO47 & \":$\" & $BD$41 & \"$\" & $DP47)=1),--(INDIRECT(\"WP!$K\" & $DO47 & \":$K\" & $DP47)>0))<>0,SUMPRODUCT(--(INDIRECT(\"WP!$C$\" & $DO47 & \":$C$\" & $DP47)=$C47),--(INDIRECT(\"WP!$B\" & $DO47 & \":$B\" & $DP47)=\"Y\"),--(INDIRECT(\"WP!$\" & $BD$41 & \"$\" & $DO47 & \":$\" & $BD$41 & \"$\" & $DP47)=1),INDIRECT(\"WP!$K\" & $DO47 & \":$K\" & $DP47)),IF(BF47<>\"\",0,\"\")),\"\"),\"\")","v":""},{"$f":"IFERROR(IF(WpAreaA_Sub2_exist,IF(SUMPRODUCT(--(INDIRECT(\"WP!$C$\" & $DO47 & \":$C$\" & $DP47)=$C47),--(INDIRECT(\"WP!$B\" & $DO47 & \":$B\" & $DP47)=\"Y\"),--(INDIRECT(\"WP!$\" & $BD$41 & \"$\" & $DO47 & \":$\" & $BD$41 & \"$\" & $DP47)<>\"\"),--(INDIRECT(\"WP!$K\" & $DO47 & \":$K\" & $DP47)>0))<>0,SUMPRODUCT(--(INDIRECT(\"WP!$C$\" & $DO47 & \":$C$\" & $DP47)=$C47),--(INDIRECT(\"WP!$B\" & $DO47 & \":$B\" & $DP47)=\"Y\"),--(INDIRECT(\"WP!$\" & $BD$41 & \"$\" & $DO47 & \":$\" & $BD$41 & \"$\" & $DP47)<>\"\"),INDIRECT(\"WP!$K\" & $DO47 & \":$K\" & $DP47)),\"\"),\"\"),\"\")","v":""},{"$f":"IFERROR(IF(WpAreaA_Sub3_exist,IF(SUMPRODUCT(--(INDIRECT(\"WP!$C$\" & $DO47 & \":$C$\" & $DP47) =$C47),--(INDIRECT(\"WP!$\" & $BG$41 & \"$\" & $DO47 & \":$\" & $BG$41 & \"$\" & $DP47) <>\"\"),--(INDIRECT(\"WP!$K$\" & $DO47 & \":$K$\" & $DP47)>0))>0,SUMPRODUCT(--(INDIRECT(\"WP!$C$\" & $DO47 & \":$C$\" & $DP47) =$C47),--(INDIRECT(\"WP!$\" & $BG$41 & \"$\" & $DO47 & \":$\" & $BG$41 & \"$\" & $DP47) <>\"\"),INDIRECT(\"WP!$K\" & $DO47 & \":$K\" & $DP47),INDIRECT(\"WP!$\" & $BG$41 & \"$\" & $DO47 & \":$\" & $BG$41 & \"$\" & $DP47))/SUMPRODUCT(--(INDIRECT(\"WP!$C$\" & $DO47 & \":$C$\" & $DP47) =$C47),--(INDIRECT(\"WP!$\" & $BG$41 & \"$\" & $DO47 & \":$\" & $BG$41 & \"$\" & $DP47) <>\"\"),INDIRECT(\"WP!$K\" & $DO47 & \":$K\" & $DP47)),\"\"),\"\"),\"\")","v":""},{"$f":"IFERROR(IF(WpAreaA_Sub3_exist,IF(SUMPRODUCT(--(INDIRECT(\"WP!$C$\" & $DO47 & \":$C$\" & $DP47)=$C47),--(INDIRECT(\"WP!$B\" & $DO47 & \":$B\" & $DP47)=\"Y\"),--(INDIRECT(\"WP!$\" & $BG$41 & \"$\" & $DO47 & \":$\" & $BG$41 & \"$\" & $DP47)=1),--(INDIRECT(\"WP!$K\" & $DO47 & \":$K\" & $DP47)>0))<>0,SUMPRODUCT(--(INDIRECT(\"WP!$C$\" & $DO47 & \":$C$\" & $DP47)=$C47),--(INDIRECT(\"WP!$B\" & $DO47 & \":$B\" & $DP47)=\"Y\"),--(INDIRECT(\"WP!$\" & $BG$41 & \"$\" & $DO47 & \":$\" & $BG$41 & \"$\" & $DP47)=1),INDIRECT(\"WP!$K\" & $DO47 & \":$K\" & $DP47)),IF(BI47<>\"\",0,\"\")),\"\"),\"\")","v":""},{"$f":"IFERROR(IF(WpAreaA_Sub3_exist,IF(SUMPRODUCT(--(INDIRECT(\"WP!$C$\" & $DO47 & \":$C$\" & $DP47)=$C47),--(INDIRECT(\"WP!$B\" & $DO47 & \":$B\" & $DP47)=\"Y\"),--(INDIRECT(\"WP!$\" & $BG$41 & \"$\" & $DO47 & \":$\" & $BG$41 & \"$\" & $DP47)<>\"\"),--(INDIRECT(\"WP!$K\" & $DO47 & \":$K\" & $DP47)>0))<>0,SUMPRODUCT(--(INDIRECT(\"WP!$C$\" & $DO47 & \":$C$\" & $DP47)=$C47),--(INDIRECT(\"WP!$B\" & $DO47 & \":$B\" & $DP47)=\"Y\"),--(INDIRECT(\"WP!$\" & $BG$41 & \"$\" & $DO47 & \":$\" & $BG$41 & \"$\" & $DP47)<>\"\"),INDIRECT(\"WP!$K\" & $DO47 & \":$K\" & $DP47)),\"\"),\"\"),\"\")","v":""},null,{"$f":"IFERROR(IF(WpAreaB_Sub1_exist,IF(SUMPRODUCT(--(INDIRECT(\"WP!$C$\" & $DO47 & \":$C$\" & $DP47) =$C47),--(INDIRECT(\"WP!$\" & $BK$41 & \"$\" & $DO47 & \":$\" & $BK$41 & \"$\" & $DP47) <>\"\"),--(INDIRECT(\"WP!$K$\" & $DO47 & \":$K$\" & $DP47)>0))>0,SUMPRODUCT(--(INDIRECT(\"WP!$C$\" & $DO47 & \":$C$\" & $DP47) =$C47),--(INDIRECT(\"WP!$\" & $BK$41 & \"$\" & $DO47 & \":$\" & $BK$41 & \"$\" & $DP47) <>\"\"),INDIRECT(\"WP!$K\" & $DO47 & \":$K\" & $DP47),INDIRECT(\"WP!$\" & $BK$41 & \"$\" & $DO47 & \":$\" & $BK$41 & \"$\" & $DP47))/SUMPRODUCT(--(INDIRECT(\"WP!$C$\" & $DO47 & \":$C$\" & $DP47) =$C47),--(INDIRECT(\"WP!$\" & $BK$41 & \"$\" & $DO47 & \":$\" & $BK$41 & \"$\" & $DP47) <>\"\"),INDIRECT(\"WP!$K\" & $DO47 & \":$K\" & $DP47)),\"\"),\"\"),\"\")","v":""},{"$f":"IFERROR(IF(WpAreaB_Sub1_exist,IF(SUMPRODUCT(--(INDIRECT(\"WP!$C$\" & $DO47 & \":$C$\" & $DP47)=$C47),--(INDIRECT(\"WP!$B\" & $DO47 & \":$B\" & $DP47)=\"Y\"),--(INDIRECT(\"WP!$\" & $BK$41 & \"$\" & $DO47 & \":$\" & $BK$41 & \"$\" & $DP47)=1),--(INDIRECT(\"WP!$K\" & $DO47 & \":$K\" & $DP47)>0))<>0,SUMPRODUCT(--(INDIRECT(\"WP!$C$\" & $DO47 & \":$C$\" & $DP47)=$C47),--(INDIRECT(\"WP!$B\" & $DO47 & \":$B\" & $DP47)=\"Y\"),--(INDIRECT(\"WP!$\" & $BK$41 & \"$\" & $DO47 & \":$\" & $BK$41 & \"$\" & $DP47)=1),INDIRECT(\"WP!$K\" & $DO47 & \":$K\" & $DP47)),IF(BM47<>\"\",0,\"\")),\"\"),\"\")","v":""},{"$f":"IFERROR(IF(WpAreaB_Sub1_exist,IF(SUMPRODUCT(--(INDIRECT(\"WP!$C$\" & $DO47 & \":$C$\" & $DP47)=$C47),--(INDIRECT(\"WP!$B\" & $DO47 & \":$B\" & $DP47)=\"Y\"),--(INDIRECT(\"WP!$\" & $BK$41 & \"$\" & $DO47 & \":$\" & $BK$41 & \"$\" & $DP47)<>\"\"),--(INDIRECT(\"WP!$K\" & $DO47 & \":$K\" & $DP47)>0))<>0,SUMPRODUCT(--(INDIRECT(\"WP!$C$\" & $DO47 & \":$C$\" & $DP47)=$C47),--(INDIRECT(\"WP!$B\" & $DO47 & \":$B\" & $DP47)=\"Y\"),--(INDIRECT(\"WP!$\" & $BK$41 & \"$\" & $DO47 & \":$\" & $BK$41 & \"$\" & $DP47)<>\"\"),INDIRECT(\"WP!$K\" & $DO47 & \":$K\" & $DP47)),\"\"),\"\"),\"\")","v":""},{"$f":"IFERROR(IF(WpAreaB_Sub2_exist,IF(SUMPRODUCT(--(INDIRECT(\"WP!$C$\" & $DO47 & \":$C$\" & $DP47) =$C47),--(INDIRECT(\"WP!$\" & $BN$41 & \"$\" & $DO47 & \":$\" & $BN$41 & \"$\" & $DP47) <>\"\"),--(INDIRECT(\"WP!$K$\" & $DO47 & \":$K$\" & $DP47)>0))>0,SUMPRODUCT(--(INDIRECT(\"WP!$C$\" & $DO47 & \":$C$\" & $DP47) =$C47),--(INDIRECT(\"WP!$\" & $BN$41 & \"$\" & $DO47 & \":$\" & $BN$41 & \"$\" & $DP47) <>\"\"),INDIRECT(\"WP!$K\" & $DO47 & \":$K\" & $DP47),INDIRECT(\"WP!$\" & $BN$41 & \"$\" & $DO47 & \":$\" & $BN$41 & \"$\" & $DP47))/SUMPRODUCT(--(INDIRECT(\"WP!$C$\" & $DO47 & \":$C$\" & $DP47) =$C47),--(INDIRECT(\"WP!$\" & $BN$41 & \"$\" & $DO47 & \":$\" & $BN$41 & \"$\" & $DP47) <>\"\"),INDIRECT(\"WP!$K\" & $DO47 & \":$K\" & $DP47)),\"\"),\"\"),\"\")","v":""},{"$f":"IFERROR(IF(WpAreaB_Sub2_exist,IF(SUMPRODUCT(--(INDIRECT(\"WP!$C$\" & $DO47 & \":$C$\" & $DP47)=$C47),--(INDIRECT(\"WP!$B\" & $DO47 & \":$B\" & $DP47)=\"Y\"),--(INDIRECT(\"WP!$\" & $BN$41 & \"$\" & $DO47 & \":$\" & $BN$41 & \"$\" & $DP47)=1),--(INDIRECT(\"WP!$K\" & $DO47 & \":$K\" & $DP47)>0))<>0,SUMPRODUCT(--(INDIRECT(\"WP!$C$\" & $DO47 & \":$C$\" & $DP47)=$C47),--(INDIRECT(\"WP!$B\" & $DO47 & \":$B\" & $DP47)=\"Y\"),--(INDIRECT(\"WP!$\" & $BN$41 & \"$\" & $DO47 & \":$\" & $BN$41 & \"$\" & $DP47)=1),INDIRECT(\"WP!$K\" & $DO47 & \":$K\" & $DP47)),IF(BP47<>\"\",0,\"\")),\"\"),\"\")","v":""},{"$f":"IFERROR(IF(WpAreaB_Sub2_exist,IF(SUMPRODUCT(--(INDIRECT(\"WP!$C$\" & $DO47 & \":$C$\" & $DP47)=$C47),--(INDIRECT(\"WP!$B\" & $DO47 & \":$B\" & $DP47)=\"Y\"),--(INDIRECT(\"WP!$\" & $BN$41 & \"$\" & $DO47 & \":$\" & $BN$41 & \"$\" & $DP47)<>\"\"),--(INDIRECT(\"WP!$K\" & $DO47 & \":$K\" & $DP47)>0))<>0,SUMPRODUCT(--(INDIRECT(\"WP!$C$\" & $DO47 & \":$C$\" & $DP47)=$C47),--(INDIRECT(\"WP!$B\" & $DO47 & \":$B\" & $DP47)=\"Y\"),--(INDIRECT(\"WP!$\" & $BN$41 & \"$\" & $DO47 & \":$\" & $BN$41 & \"$\" & $DP47)<>\"\"),INDIRECT(\"WP!$K\" & $DO47 & \":$K\" & $DP47)),\"\"),\"\"),\"\")","v":""},{"$f":"IFERROR(IF(WpAreaB_Sub3_exist,IF(SUMPRODUCT(--(INDIRECT(\"WP!$C$\" & $DO47 & \":$C$\" & $DP47) =$C47),--(INDIRECT(\"WP!$\" & $BQ$41 & \"$\" & $DO47 & \":$\" & $BQ$41 & \"$\" & $DP47) <>\"\"),--(INDIRECT(\"WP!$K$\" & $DO47 & \":$K$\" & $DP47)>0))>0,SUMPRODUCT(--(INDIRECT(\"WP!$C$\" & $DO47 & \":$C$\" & $DP47) =$C47),--(INDIRECT(\"WP!$\" & $BQ$41 & \"$\" & $DO47 & \":$\" & $BQ$41 & \"$\" & $DP47) <>\"\"),INDIRECT(\"WP!$K\" & $DO47 & \":$K\" & $DP47),INDIRECT(\"WP!$\" & $BQ$41 & \"$\" & $DO47 & \":$\" & $BQ$41 & \"$\" & $DP47))/SUMPRODUCT(--(INDIRECT(\"WP!$C$\" & $DO47 & \":$C$\" & $DP47) =$C47),--(INDIRECT(\"WP!$\" & $BQ$41 & \"$\" & $DO47 & \":$\" & $BQ$41 & \"$\" & $DP47) <>\"\"),INDIRECT(\"WP!$K\" & $DO47 & \":$K\" & $DP47)),\"\"),\"\"),\"\")","v":""},{"$f":"IFERROR(IF(WpAreaB_Sub3_exist,IF(SUMPRODUCT(--(INDIRECT(\"WP!$C$\" & $DO47 & \":$C$\" & $DP47)=$C47),--(INDIRECT(\"WP!$B\" & $DO47 & \":$B\" & $DP47)=\"Y\"),--(INDIRECT(\"WP!$\" & $BQ$41 & \"$\" & $DO47 & \":$\" & $BQ$41 & \"$\" & $DP47)=1),--(INDIRECT(\"WP!$K\" & $DO47 & \":$K\" & $DP47)>0))<>0,SUMPRODUCT(--(INDIRECT(\"WP!$C$\" & $DO47 & \":$C$\" & $DP47)=$C47),--(INDIRECT(\"WP!$B\" & $DO47 & \":$B\" & $DP47)=\"Y\"),--(INDIRECT(\"WP!$\" & $BQ$41 & \"$\" & $DO47 & \":$\" & $BQ$41 & \"$\" & $DP47)=1),INDIRECT(\"WP!$K\" & $DO47 & \":$K\" & $DP47)),IF(BS47<>\"\",0,\"\")),\"\"),\"\")","v":""},{"$f":"IFERROR(IF(WpAreaB_Sub3_exist,IF(SUMPRODUCT(--(INDIRECT(\"WP!$C$\" & $DO47 & \":$C$\" & $DP47)=$C47),--(INDIRECT(\"WP!$B\" & $DO47 & \":$B\" & $DP47)=\"Y\"),--(INDIRECT(\"WP!$\" & $BQ$41 & \"$\" & $DO47 & \":$\" & $BQ$41 & \"$\" & $DP47)<>\"\"),--(INDIRECT(\"WP!$K\" & $DO47 & \":$K\" & $DP47)>0))<>0,SUMPRODUCT(--(INDIRECT(\"WP!$C$\" & $DO47 & \":$C$\" & $DP47)=$C47),--(INDIRECT(\"WP!$B\" & $DO47 & \":$B\" & $DP47)=\"Y\"),--(INDIRECT(\"WP!$\" & $BQ$41 & \"$\" & $DO47 & \":$\" & $BQ$41 & \"$\" & $DP47)<>\"\"),INDIRECT(\"WP!$K\" & $DO47 & \":$K\" & $DP47)),\"\"),\"\"),\"\")","v":""},null,{"$f":"IFERROR(IF(WpAreaC_Sub1_exist,IF(SUMPRODUCT(--(INDIRECT(\"WP!$C$\" & $DO47 & \":$C$\" & $DP47) =$C47),--(INDIRECT(\"WP!$\" & $BU$41 & \"$\" & $DO47 & \":$\" & $BU$41 & \"$\" & $DP47) <>\"\"),--(INDIRECT(\"WP!$K$\" & $DO47 & \":$K$\" & $DP47)>0))>0,SUMPRODUCT(--(INDIRECT(\"WP!$C$\" & $DO47 & \":$C$\" & $DP47) =$C47),--(INDIRECT(\"WP!$\" & $BU$41 & \"$\" & $DO47 & \":$\" & $BU$41 & \"$\" & $DP47) <>\"\"),INDIRECT(\"WP!$K\" & $DO47 & \":$K\" & $DP47),INDIRECT(\"WP!$\" & $BU$41 & \"$\" & $DO47 & \":$\" & $BU$41 & \"$\" & $DP47))/SUMPRODUCT(--(INDIRECT(\"WP!$C$\" & $DO47 & \":$C$\" & $DP47) =$C47),--(INDIRECT(\"WP!$\" & $BU$41 & \"$\" & $DO47 & \":$\" & $BU$41 & \"$\" & $DP47) <>\"\"),INDIRECT(\"WP!$K\" & $DO47 & \":$K\" & $DP47)),\"\"),\"\"),\"\")","v":""},{"$f":"IFERROR(IF(WpAreaC_Sub1_exist,IF(SUMPRODUCT(--(INDIRECT(\"WP!$C$\" & $DO47 & \":$C$\" & $DP47)=$C47),--(INDIRECT(\"WP!$B\" & $DO47 & \":$B\" & $DP47)=\"Y\"),--(INDIRECT(\"WP!$\" & $BU$41 & \"$\" & $DO47 & \":$\" & $BU$41 & \"$\" & $DP47)=1),--(INDIRECT(\"WP!$K\" & $DO47 & \":$K\" & $DP47)>0))<>0,SUMPRODUCT(--(INDIRECT(\"WP!$C$\" & $DO47 & \":$C$\" & $DP47)=$C47),--(INDIRECT(\"WP!$B\" & $DO47 & \":$B\" & $DP47)=\"Y\"),--(INDIRECT(\"WP!$\" & $BU$41 & \"$\" & $DO47 & \":$\" & $BU$41 & \"$\" & $DP47)=1),INDIRECT(\"WP!$K\" & $DO47 & \":$K\" & $DP47)),IF(BW47<>\"\",0,\"\")),\"\"),\"\")","v":""},{"$f":"IFERROR(IF(WpAreaC_Sub1_exist,IF(SUMPRODUCT(--(INDIRECT(\"WP!$C$\" & $DO47 & \":$C$\" & $DP47)=$C47),--(INDIRECT(\"WP!$B\" & $DO47 & \":$B\" & $DP47)=\"Y\"),--(INDIRECT(\"WP!$\" & $BU$41 & \"$\" & $DO47 & \":$\" & $BU$41 & \"$\" & $DP47)<>\"\"),--(INDIRECT(\"WP!$K\" & $DO47 & \":$K\" & $DP47)>0))<>0,SUMPRODUCT(--(INDIRECT(\"WP!$C$\" & $DO47 & \":$C$\" & $DP47)=$C47),--(INDIRECT(\"WP!$B\" & $DO47 & \":$B\" & $DP47)=\"Y\"),--(INDIRECT(\"WP!$\" & $BU$41 & \"$\" & $DO47 & \":$\" & $BU$41 & \"$\" & $DP47)<>\"\"),INDIRECT(\"WP!$K\" & $DO47 & \":$K\" & $DP47)),\"\"),\"\"),\"\")","v":""},{"$f":"IFERROR(IF(WpAreaC_Sub2_exist,IF(SUMPRODUCT(--(INDIRECT(\"WP!$C$\" & $DO47 & \":$C$\" & $DP47) =$C47),--(INDIRECT(\"WP!$\" & $BX$41 & \"$\" & $DO47 & \":$\" & $BX$41 & \"$\" & $DP47) <>\"\"),--(INDIRECT(\"WP!$K$\" & $DO47 & \":$K$\" & $DP47)>0))>0,SUMPRODUCT(--(INDIRECT(\"WP!$C$\" & $DO47 & \":$C$\" & $DP47) =$C47),--(INDIRECT(\"WP!$\" & $BX$41 & \"$\" & $DO47 & \":$\" & $BX$41 & \"$\" & $DP47) <>\"\"),INDIRECT(\"WP!$K\" & $DO47 & \":$K\" & $DP47),INDIRECT(\"WP!$\" & $BX$41 & \"$\" & $DO47 & \":$\" & $BX$41 & \"$\" & $DP47))/SUMPRODUCT(--(INDIRECT(\"WP!$C$\" & $DO47 & \":$C$\" & $DP47) =$C47),--(INDIRECT(\"WP!$\" & $BX$41 & \"$\" & $DO47 & \":$\" & $BX$41 & \"$\" & $DP47) <>\"\"),INDIRECT(\"WP!$K\" & $DO47 & \":$K\" & $DP47)),\"\"),\"\"),\"\")","v":""},{"$f":"IFERROR(IF(WpAreaC_Sub2_exist,IF(SUMPRODUCT(--(INDIRECT(\"WP!$C$\" & $DO47 & \":$C$\" & $DP47)=$C47),--(INDIRECT(\"WP!$B\" & $DO47 & \":$B\" & $DP47)=\"Y\"),--(INDIRECT(\"WP!$\" & $BX$41 & \"$\" & $DO47 & \":$\" & $BX$41 & \"$\" & $DP47)=1),--(INDIRECT(\"WP!$K\" & $DO47 & \":$K\" & $DP47)>0))<>0,SUMPRODUCT(--(INDIRECT(\"WP!$C$\" & $DO47 & \":$C$\" & $DP47)=$C47),--(INDIRECT(\"WP!$B\" & $DO47 & \":$B\" & $DP47)=\"Y\"),--(INDIRECT(\"WP!$\" & $BX$41 & \"$\" & $DO47 & \":$\" & $BX$41 & \"$\" & $DP47)=1),INDIRECT(\"WP!$K\" & $DO47 & \":$K\" & $DP47)),IF(BZ47<>\"\",0,\"\")),\"\"),\"\")","v":""},{"$f":"IFERROR(IF(WpAreaC_Sub2_exist,IF(SUMPRODUCT(--(INDIRECT(\"WP!$C$\" & $DO47 & \":$C$\" & $DP47)=$C47),--(INDIRECT(\"WP!$B\" & $DO47 & \":$B\" & $DP47)=\"Y\"),--(INDIRECT(\"WP!$\" & $BX$41 & \"$\" & $DO47 & \":$\" & $BX$41 & \"$\" & $DP47)<>\"\"),--(INDIRECT(\"WP!$K\" & $DO47 & \":$K\" & $DP47)>0))<>0,SUMPRODUCT(--(INDIRECT(\"WP!$C$\" & $DO47 & \":$C$\" & $DP47)=$C47),--(INDIRECT(\"WP!$B\" & $DO47 & \":$B\" & $DP47)=\"Y\"),--(INDIRECT(\"WP!$\" & $BX$41 & \"$\" & $DO47 & \":$\" & $BX$41 & \"$\" & $DP47)<>\"\"),INDIRECT(\"WP!$K\" & $DO47 & \":$K\" & $DP47)),\"\"),\"\"),\"\")","v":""},{"$f":"IFERROR(IF(WpAreaC_Sub3_exist,F(SUMPRODUCT(--(INDIRECT(\"WP!$C$\" & $DO47 & \":$C$\" & $DP47) =$C47),--(INDIRECT(\"WP!$\" & $CA$41 & \"$\" & $DO47 & \":$\" & $CA$41 & \"$\" & $DP47) <>\"\"),--(INDIRECT(\"WP!$K$\" & $DO47 & \":$K$\" & $DP47)>0))>0,SUMPRODUCT(--(INDIRECT(\"WP!$C$\" & $DO47 & \":$C$\" & $DP47) =$C47),--(INDIRECT(\"WP!$\" & $CA$41 & \"$\" & $DO47 & \":$\" & $CA$41 & \"$\" & $DP47) <>\"\"),INDIRECT(\"WP!$K\" & $DO47 & \":$K\" & $DP47),INDIRECT(\"WP!$\" & $CA$41 & \"$\" & $DO47 & \":$\" & $CA$41 & \"$\" & $DP47))/SUMPRODUCT(--(INDIRECT(\"WP!$C$\" & $DO47 & \":$C$\" & $DP47) =$C47),--(INDIRECT(\"WP!$\" & $CA$41 & \"$\" & $DO47 & \":$\" & $CA$41 & \"$\" & $DP47) <>\"\"),INDIRECT(\"WP!$K\" & $DO47 & \":$K\" & $DP47)),\"\"),\"\"),\"\")","v":""},{"$f":"IFERROR(IF(WpAreaC_Sub3_exist,IF(SUMPRODUCT(--(INDIRECT(\"WP!$C$\" & $DO47 & \":$C$\" & $DP47)=$C47),--(INDIRECT(\"WP!$B\" & $DO47 & \":$B\" & $DP47)=\"Y\"),--(INDIRECT(\"WP!$\" & $CA$41 & \"$\" & $DO47 & \":$\" & $CA$41 & \"$\" & $DP47)=1),--(INDIRECT(\"WP!$K\" & $DO47 & \":$K\" & $DP47)>0))<>0,SUMPRODUCT(--(INDIRECT(\"WP!$C$\" & $DO47 & \":$C$\" & $DP47)=$C47),--(INDIRECT(\"WP!$B\" & $DO47 & \":$B\" & $DP47)=\"Y\"),--(INDIRECT(\"WP!$\" & $CA$41 & \"$\" & $DO47 & \":$\" & $CA$41 & \"$\" & $DP47)=1),INDIRECT(\"WP!$K\" & $DO47 & \":$K\" & $DP47)),IF(CC47<>\"\",0,\"\")),\"\"),\"\")","v":""},{"$f":"IFERROR(IF(WpAreaC_Sub3_exist,IF(SUMPRODUCT(--(INDIRECT(\"WP!$C$\" & $DO47 & \":$C$\" & $DP47)=$C47),--(INDIRECT(\"WP!$B\" & $DO47 & \":$B\" & $DP47)=\"Y\"),--(INDIRECT(\"WP!$\" & $CA$41 & \"$\" & $DO47 & \":$\" & $CA$41 & \"$\" & $DP47)<>\"\"),--(INDIRECT(\"WP!$K\" & $DO47 & \":$K\" & $DP47)>0))<>0,SUMPRODUCT(--(INDIRECT(\"WP!$C$\" & $DO47 & \":$C$\" & $DP47)=$C47),--(INDIRECT(\"WP!$B\" & $DO47 & \":$B\" & $DP47)=\"Y\"),--(INDIRECT(\"WP!$\" & $CA$41 & \"$\" & $DO47 & \":$\" & $CA$41 & \"$\" & $DP47)<>\"\"),INDIRECT(\"WP!$K\" & $DO47 & \":$K\" & $DP47)),\"\"),\"\"),\"\")","v":""},null,null,null,null,"","","","","","","","","","","","",null,"","","","","","","","","",null,"","","","","","","","","",null,{"$f":"MIN(IF(WP!$C$12:$C$53=$C47,ROW(WP!$C$12:$C$53),\"\"))","v":43},{"$f":"MAX(IF(WP!$C$12:$C$53=$C47,ROW(WP!$C$12:$C$53),\"\"))","v":44}]
[null,"RF Tx test cases","36.521-1 Tx",{"$f":"getProgress(AX48,CH48,\"%\",1,1)","v":"28%\n(+28%)"},{"$f":"getProgress(AY48,CI48,,,1)","v":""},{"$f":"getProgress(AZ48,CJ48,,,1)","v":""},null,{"$f":"getProgress(BA48,CK48,\"%\",1,1,WpAreaA_Sub1_exist)","v":"28%\n(+28%)"},{"$f":"getProgress(BB48,CL48,,,1,WpAreaA_Sub1_exist)","v":""},{"$f":"getProgress(BC48,CM48,,,1,WpAreaA_Sub1_exist)","v":""},{"$f":"getProgress(BD48,CN48,\"%\",1,1,WpAreaA_Sub2_exist)","v":""},{"$f":"getProgress(BE48,CO48,,,1,WpAreaA_Sub2_exist)","v":""},{"$f":"getProgress(BF48,CP48,,,1,WpAreaA_Sub2_exist)","v":""},{"$f":"getProgress(BG48,CQ48,\"%\",1,1,WpAreaA_Sub3_exist)","v":""},{"$f":"getProgress(BH48,CR48,,,1,WpAreaA_Sub3_exist)","v":""},{"$f":"getProgress(BI48,CS48,,,1,WpAreaA_Sub3_exist)","v":""},null,{"$f":"getProgress(BK48,CU48,\"%\",1,1,WpAreaB_Sub1_exist)","v":""},{"$f":"getProgress(BL48,CV48,,,1,WpAreaB_Sub1_exist)","v":""},{"$f":"getProgress(BM48,CW48,,,1,WpAreaB_Sub1_exist)","v":""},{"$f":"getProgress(BN48,CX48,\"%\",1,1,WpAreaB_Sub2_exist)","v":""},{"$f":"getProgress(BO48,CY48,,,1,WpAreaB_Sub2_exist)","v":""},{"$f":"getProgress(BP48,CZ48,,,1,WpAreaB_Sub2_exist)","v":""},{"$f":"getProgress(BQ48,DA48,\"%\",1,1,WpAreaB_Sub3_exist)","v":""},{"$f":"getProgress(BR48,DB48,,,1,WpAreaB_Sub3_exist)","v":""},{"$f":"getProgress(BS48,DC48,,,1,WpAreaB_Sub3_exist)","v":""},null,{"$f":"getProgress(BU48,DE48,\"%\",1,1,WpAreaC_Sub1_exist)","v":""},{"$f":"getProgress(BV48,DF48,,,1,WpAreaC_Sub1_exist)","v":""},{"$f":"getProgress(BW48,DG48,,,1,WpAreaC_Sub1_exist)","v":""},{"$f":"getProgress(BX48,DH48,\"%\",1,1,WpAreaC_Sub2_exist)","v":""},{"$f":"getProgress(BY48,DI48,,,1,WpAreaC_Sub2_exist)","v":""},{"$f":"getProgress(BZ48,DJ48,,,1,WpAreaC_Sub2_exist)","v":""},{"$f":"getProgress(CA48,DK48,\"%\",1,1,WpAreaC_Sub3_exist)","v":""},{"$f":"getProgress(CB48,DL48,,,1,WpAreaC_Sub3_exist)","v":""},{"$f":"getProgress(CC48,DM48,,,1,WpAreaC_Sub3_exist)","v":""},null,null,null,null,null,null,null,null,null,null,null,null,null,{"$f":"IFERROR((IF(WpAreaA_exist,IF(BA48<>\"\",BA48*WP!$AB$9,0)+IF(BD48<>\"\",BD48*WP!$AC$9,0)+IF(BG48<>\"\",BG48*WP!$AD$9,0),0)+IF(WpAreaB_exist,IF(BK48<>\"\",BK48*WP!$AE$10)+IF(BN48<>\"\",BN48*WP!$AF$10,0)+IF(BQ48<>\"\",BQ48*WP!$AG$10,0),0)+IF(WpAreaC_exist,IF(BU48<>\"\",BU48*WP!$AH$10)+IF(BX48<>\"\",BX48*WP!$AI$10,0)+IF(CA48<>\"\",CA48*WP!$AJ$10,0),0))/(IF(WpAreaA_exist,IF(BA48<>\"\",WP!$AB$9,0)+IF(BD48<>\"\",WP!$AC$9,0)+IF(BG48<>\"\",WP!$AD$9,0),0)+IF(WpAreaB_exist,IF(BK48<>\"\",WP!$AE$10,0)+IF(BN48<>\"\",WP!$AF$10,0)+IF(BQ48<>\"\",WP!$AG$10,0),0)+ IF(WpAreaC_exist,IF(BU48<>\"\",WP!$AH$10,0)+IF(BX48<>\"\",WP!$AI$10,0)+IF(CA48<>\"\",WP!$AJ$10,0),0)),\"\")","v":0.28030303030303033},{"$f":"IFERROR(IF(SUMPRODUCT(--(INDIRECT(\"WP!$C$\" & $DO48 & \":$C$\" & $DP48)=$C48),--(INDIRECT(\"WP!$B$\" & $DO48 & \":$B$\" & $DP48)=\"Y\"),--(INDIRECT(\"WP!$\" & $AX$41 & \"$\" & $DO48 & \":$\" & $AX$41 & \"$\" & $DP48)=1),--(INDIRECT(\"WP!$K$\" & $DO48 & \":$K$\" & $DP48)>0))<>0,SUMPRODUCT(--(INDIRECT(\"WP!$C$\" & $DO48 & \":$C$\" & $DP48)=$C48),--(INDIRECT(\"WP!$B$\" & $DO48 & \":$B$\" & $DP48)=\"Y\"),--(INDIRECT(\"WP!$\" & $AX$41 & \"$\" & $DO48 & \":$\" & $AX$41 & \"$\" & $DP48)=1),INDIRECT(\"WP!$K$\" & $DO48 & \":$K$\" & $DP48)),IF(AZ48<>\"\",0,\"\")),\"\")","v":""},{"$f":"IFERROR(IF(SUMPRODUCT(--(INDIRECT(\"WP!$C$\" & $DO48 & \":$C$\" & $DP48)=$C48),--(INDIRECT(\"WP!$B\" & $DO48 & \":$B\" & $DP48)=\"Y\"),--(INDIRECT(\"WP!$\" & $AX$41 & \"$\" & $DO48 & \":$\" & $AX$41 & \"$\" & $DP48)<>\"\"),--(INDIRECT(\"WP!$K\" & $DO48 & \":$K\" & $DP48)>0))<>0,SUMPRODUCT(--(INDIRECT(\"WP!$C$\" & $DO48 & \":$C$\" & $DP48)=$C48),--(INDIRECT(\"WP!$B\" & $DO48 & \":$B\" & $DP48)=\"Y\"),--(INDIRECT(\"WP!$\" & $AX$41 & \"$\" &  $DO48 & \":$\" & $AX$41 & \"$\" & $DP48)<>\"\"),INDIRECT(\"WP!$K\" & $DO48 & \":$K\" & $DP48)),\"\"),\"\")","v":""},{"$f":"IFERROR(IF(WpAreaA_Sub1_exist,IF(SUMPRODUCT(--(INDIRECT(\"WP!$C$\" & $DO48 & \":$C$\" & $DP48) =$C48),--(INDIRECT(\"WP!$\" & $BA$41 & \"$\" & $DO48 & \":$\" & $BA$41 & \"$\" & $DP48) <>\"\"),--(INDIRECT(\"WP!$K$\" & $DO48 & \":$K$\" & $DP48)>0))>0,SUMPRODUCT(--(INDIRECT(\"WP!$C$\" & $DO48 & \":$C$\" & $DP48) =$C48),--(INDIRECT(\"WP!$\" & $BA$41 & \"$\" & $DO48 & \":$\" & $BA$41 & \"$\" & $DP48) <>\"\"),INDIRECT(\"WP!$K$\" & $DO48 & \":$K$\" & $DP48),INDIRECT(\"WP!$\" & $BA$41 & \"$\" & $DO48 & \":$\" & $BA$41 & \"$\" & $DP48))/SUMPRODUCT(--(INDIRECT(\"WP!$C$\" & $DO48 & \":$C$\" & $DP48) =$C48),--(INDIRECT(\"WP!$\" & $BA$41 & \"$\" & $DO48 & \":$\" & $BA$41 & \"$\" & $DP48) <>\"\"),INDIRECT(\"WP!$K$\" & $DO48 & \":$K$\" & $DP48)),\"\"),\"\"),\"\")","v":0.28030303030303033},{"$f":"IFERROR(IF(WpAreaA_Sub1_exist,IF(SUMPRODUCT(--(INDIRECT(\"WP!$C$\" & $DO48 & \":$C$\" & $DP48)=$C48),--(INDIRECT(\"WP!$B$\" & $DO48 & \":$B$\" & $DP48)=\"Y\"),--(INDIRECT(\"WP!$\" & $BA$41 & \"$\" & $DO48 & \":$\" & $BA$41 & \"$\" & $DP48)=1),--(INDIRECT(\"WP!$K$\" & $DO48 & \":$K$\" & $DP48)>0))<>0,SUMPRODUCT(--(INDIRECT(\"WP!$C$\" & $DO48 & \":$C$\" & $DP48)=$C48),--(INDIRECT(\"WP!$B$\" & $DO48 & \":$B$\" & $DP48)=\"Y\"),--(INDIRECT(\"WP!$\" & $BA$41 & \"$\" & $DO48 & \":$\" & $BA$41 & \"$\" & $DP48)=1),INDIRECT(\"WP!$K$\" & $DO48 & \":$K$\" & $DP48)),IF(BC48<>\"\",0,\"\")),\"\"),\"\")","v":""},{"$f":"IFERROR(IF(WpAreaA_Sub1_exist,IF(SUMPRODUCT(--(INDIRECT(\"WP!$C$\" & $DO48 & \":$C$\" & $DP48)=$C48),--(INDIRECT(\"WP!$B\" & $DO48 & \":$B\" & $DP48)=\"Y\"),--(INDIRECT(\"WP!$\" & $BA$41 & \"$\" & $DO48 & \":$\" & $BA$41 & \"$\" & $DP48)<>\"\"),--(INDIRECT(\"WP!$K\" & $DO48 & \":$K\" & $DP48)>0))<>0,SUMPRODUCT(--(INDIRECT(\"WP!$C$\" & $DO48 & \":$C$\" & $DP48)=$C48),--(INDIRECT(\"WP!$B\" & $DO48 & \":$B\" & $DP48)=\"Y\"),--(INDIRECT(\"WP!$\" & $BA$41 & \"$\" &  $DO48 & \":$\" & $BA$41 & \"$\" & $DP48)<>\"\"),INDIRECT(\"WP!$K\" & $DO48 & \":$K\" & $DP48)),\"\"),\"\"),\"\")","v":""},{"$f":"IFERROR(IF(WpAreaA_Sub2_exist,IF(SUMPRODUCT(--(INDIRECT(\"WP!$C$\" & $DO48 & \":$C$\" & $DP48) =$C48),--(INDIRECT(\"WP!$\" & $BD$41 & \"$\" & $DO48 & \":$\" & $BD$41 & \"$\" & $DP48) <>\"\"),--(INDIRECT(\"WP!$K$\" & $DO48 & \":$K$\" & $DP48)>0))>0,SUMPRODUCT(--(INDIRECT(\"WP!$C$\" & $DO48 & \":$C$\" & $DP48) =$C48),--(INDIRECT(\"WP!$\" & $BD$41 & \"$\" & $DO48 & \":$\" & $BD$41 & \"$\" & $DP48) <>\"\"),INDIRECT(\"WP!$K\" & $DO48 & \":$K\" & $DP48),INDIRECT(\"WP!$\" & $BD$41 & \"$\" & $DO48 & \":$\" & $BD$41 & \"$\" & $DP48))/SUMPRODUCT(--(INDIRECT(\"WP!$C$\" & $DO48 & \":$C$\" & $DP48) =$C48),--(INDIRECT(\"WP!$\" & $BD$41 & \"$\" & $DO48 & \":$\" & $BD$41 & \"$\" & $DP48) <>\"\"),INDIRECT(\"WP!$K\" & $DO48 & \":$K\" & $DP48)),\"\"),\"\"),\"\")","v":""},{"$f":"IFERROR(IF(WpAreaA_Sub2_exist,IF(SUMPRODUCT(--(INDIRECT(\"WP!$C$\" & $DO48 & \":$C$\" & $DP48)=$C48),--(INDIRECT(\"WP!$B\" & $DO48 & \":$B\" & $DP48)=\"Y\"),--(INDIRECT(\"WP!$\" & $BD$41 & \"$\" & $DO48 & \":$\" & $BD$41 & \"$\" & $DP48)=1),--(INDIRECT(\"WP!$K\" & $DO48 & \":$K\" & $DP48)>0))<>0,SUMPRODUCT(--(INDIRECT(\"WP!$C$\" & $DO48 & \":$C$\" & $DP48)=$C48),--(INDIRECT(\"WP!$B\" & $DO48 & \":$B\" & $DP48)=\"Y\"),--(INDIRECT(\"WP!$\" & $BD$41 & \"$\" & $DO48 & \":$\" & $BD$41 & \"$\" & $DP48)=1),INDIRECT(\"WP!$K\" & $DO48 & \":$K\" & $DP48)),IF(BF48<>\"\",0,\"\")),\"\"),\"\")","v":""},{"$f":"IFERROR(IF(WpAreaA_Sub2_exist,IF(SUMPRODUCT(--(INDIRECT(\"WP!$C$\" & $DO48 & \":$C$\" & $DP48)=$C48),--(INDIRECT(\"WP!$B\" & $DO48 & \":$B\" & $DP48)=\"Y\"),--(INDIRECT(\"WP!$\" & $BD$41 & \"$\" & $DO48 & \":$\" & $BD$41 & \"$\" & $DP48)<>\"\"),--(INDIRECT(\"WP!$K\" & $DO48 & \":$K\" & $DP48)>0))<>0,SUMPRODUCT(--(INDIRECT(\"WP!$C$\" & $DO48 & \":$C$\" & $DP48)=$C48),--(INDIRECT(\"WP!$B\" & $DO48 & \":$B\" & $DP48)=\"Y\"),--(INDIRECT(\"WP!$\" & $BD$41 & \"$\" & $DO48 & \":$\" & $BD$41 & \"$\" & $DP48)<>\"\"),INDIRECT(\"WP!$K\" & $DO48 & \":$K\" & $DP48)),\"\"),\"\"),\"\")","v":""},{"$f":"IFERROR(IF(WpAreaA_Sub3_exist,IF(SUMPRODUCT(--(INDIRECT(\"WP!$C$\" & $DO48 & \":$C$\" & $DP48) =$C48),--(INDIRECT(\"WP!$\" & $BG$41 & \"$\" & $DO48 & \":$\" & $BG$41 & \"$\" & $DP48) <>\"\"),--(INDIRECT(\"WP!$K$\" & $DO48 & \":$K$\" & $DP48)>0))>0,SUMPRODUCT(--(INDIRECT(\"WP!$C$\" & $DO48 & \":$C$\" & $DP48) =$C48),--(INDIRECT(\"WP!$\" & $BG$41 & \"$\" & $DO48 & \":$\" & $BG$41 & \"$\" & $DP48) <>\"\"),INDIRECT(\"WP!$K\" & $DO48 & \":$K\" & $DP48),INDIRECT(\"WP!$\" & $BG$41 & \"$\" & $DO48 & \":$\" & $BG$41 & \"$\" & $DP48))/SUMPRODUCT(--(INDIRECT(\"WP!$C$\" & $DO48 & \":$C$\" & $DP48) =$C48),--(INDIRECT(\"WP!$\" & $BG$41 & \"$\" & $DO48 & \":$\" & $BG$41 & \"$\" & $DP48) <>\"\"),INDIRECT(\"WP!$K\" & $DO48 & \":$K\" & $DP48)),\"\"),\"\"),\"\")","v":""},{"$f":"IFERROR(IF(WpAreaA_Sub3_exist,IF(SUMPRODUCT(--(INDIRECT(\"WP!$C$\" & $DO48 & \":$C$\" & $DP48)=$C48),--(INDIRECT(\"WP!$B\" & $DO48 & \":$B\" & $DP48)=\"Y\"),--(INDIRECT(\"WP!$\" & $BG$41 & \"$\" & $DO48 & \":$\" & $BG$41 & \"$\" & $DP48)=1),--(INDIRECT(\"WP!$K\" & $DO48 & \":$K\" & $DP48)>0))<>0,SUMPRODUCT(--(INDIRECT(\"WP!$C$\" & $DO48 & \":$C$\" & $DP48)=$C48),--(INDIRECT(\"WP!$B\" & $DO48 & \":$B\" & $DP48)=\"Y\"),--(INDIRECT(\"WP!$\" & $BG$41 & \"$\" & $DO48 & \":$\" & $BG$41 & \"$\" & $DP48)=1),INDIRECT(\"WP!$K\" & $DO48 & \":$K\" & $DP48)),IF(BI48<>\"\",0,\"\")),\"\"),\"\")","v":""},{"$f":"IFERROR(IF(WpAreaA_Sub3_exist,IF(SUMPRODUCT(--(INDIRECT(\"WP!$C$\" & $DO48 & \":$C$\" & $DP48)=$C48),--(INDIRECT(\"WP!$B\" & $DO48 & \":$B\" & $DP48)=\"Y\"),--(INDIRECT(\"WP!$\" & $BG$41 & \"$\" & $DO48 & \":$\" & $BG$41 & \"$\" & $DP48)<>\"\"),--(INDIRECT(\"WP!$K\" & $DO48 & \":$K\" & $DP48)>0))<>0,SUMPRODUCT(--(INDIRECT(\"WP!$C$\" & $DO48 & \":$C$\" & $DP48)=$C48),--(INDIRECT(\"WP!$B\" & $DO48 & \":$B\" & $DP48)=\"Y\"),--(INDIRECT(\"WP!$\" & $BG$41 & \"$\" & $DO48 & \":$\" & $BG$41 & \"$\" & $DP48)<>\"\"),INDIRECT(\"WP!$K\" & $DO48 & \":$K\" & $DP48)),\"\"),\"\"),\"\")","v":""},null,{"$f":"IFERROR(IF(WpAreaB_Sub1_exist,IF(SUMPRODUCT(--(INDIRECT(\"WP!$C$\" & $DO48 & \":$C$\" & $DP48) =$C48),--(INDIRECT(\"WP!$\" & $BK$41 & \"$\" & $DO48 & \":$\" & $BK$41 & \"$\" & $DP48) <>\"\"),--(INDIRECT(\"WP!$K$\" & $DO48 & \":$K$\" & $DP48)>0))>0,SUMPRODUCT(--(INDIRECT(\"WP!$C$\" & $DO48 & \":$C$\" & $DP48) =$C48),--(INDIRECT(\"WP!$\" & $BK$41 & \"$\" & $DO48 & \":$\" & $BK$41 & \"$\" & $DP48) <>\"\"),INDIRECT(\"WP!$K\" & $DO48 & \":$K\" & $DP48),INDIRECT(\"WP!$\" & $BK$41 & \"$\" & $DO48 & \":$\" & $BK$41 & \"$\" & $DP48))/SUMPRODUCT(--(INDIRECT(\"WP!$C$\" & $DO48 & \":$C$\" & $DP48) =$C48),--(INDIRECT(\"WP!$\" & $BK$41 & \"$\" & $DO48 & \":$\" & $BK$41 & \"$\" & $DP48) <>\"\"),INDIRECT(\"WP!$K\" & $DO48 & \":$K\" & $DP48)),\"\"),\"\"),\"\")","v":""},{"$f":"IFERROR(IF(WpAreaB_Sub1_exist,IF(SUMPRODUCT(--(INDIRECT(\"WP!$C$\" & $DO48 & \":$C$\" & $DP48)=$C48),--(INDIRECT(\"WP!$B\" & $DO48 & \":$B\" & $DP48)=\"Y\"),--(INDIRECT(\"WP!$\" & $BK$41 & \"$\" & $DO48 & \":$\" & $BK$41 & \"$\" & $DP48)=1),--(INDIRECT(\"WP!$K\" & $DO48 & \":$K\" & $DP48)>0))<>0,SUMPRODUCT(--(INDIRECT(\"WP!$C$\" & $DO48 & \":$C$\" & $DP48)=$C48),--(INDIRECT(\"WP!$B\" & $DO48 & \":$B\" & $DP48)=\"Y\"),--(INDIRECT(\"WP!$\" & $BK$41 & \"$\" & $DO48 & \":$\" & $BK$41 & \"$\" & $DP48)=1),INDIRECT(\"WP!$K\" & $DO48 & \":$K\" & $DP48)),IF(BM48<>\"\",0,\"\")),\"\"),\"\")","v":""},{"$f":"IFERROR(IF(WpAreaB_Sub1_exist,IF(SUMPRODUCT(--(INDIRECT(\"WP!$C$\" & $DO48 & \":$C$\" & $DP48)=$C48),--(INDIRECT(\"WP!$B\" & $DO48 & \":$B\" & $DP48)=\"Y\"),--(INDIRECT(\"WP!$\" & $BK$41 & \"$\" & $DO48 & \":$\" & $BK$41 & \"$\" & $DP48)<>\"\"),--(INDIRECT(\"WP!$K\" & $DO48 & \":$K\" & $DP48)>0))<>0,SUMPRODUCT(--(INDIRECT(\"WP!$C$\" & $DO48 & \":$C$\" & $DP48)=$C48),--(INDIRECT(\"WP!$B\" & $DO48 & \":$B\" & $DP48)=\"Y\"),--(INDIRECT(\"WP!$\" & $BK$41 & \"$\" & $DO48 & \":$\" & $BK$41 & \"$\" & $DP48)<>\"\"),INDIRECT(\"WP!$K\" & $DO48 & \":$K\" & $DP48)),\"\"),\"\"),\"\")","v":""},{"$f":"IFERROR(IF(WpAreaB_Sub2_exist,IF(SUMPRODUCT(--(INDIRECT(\"WP!$C$\" & $DO48 & \":$C$\" & $DP48) =$C48),--(INDIRECT(\"WP!$\" & $BN$41 & \"$\" & $DO48 & \":$\" & $BN$41 & \"$\" & $DP48) <>\"\"),--(INDIRECT(\"WP!$K$\" & $DO48 & \":$K$\" & $DP48)>0))>0,SUMPRODUCT(--(INDIRECT(\"WP!$C$\" & $DO48 & \":$C$\" & $DP48) =$C48),--(INDIRECT(\"WP!$\" & $BN$41 & \"$\" & $DO48 & \":$\" & $BN$41 & \"$\" & $DP48) <>\"\"),INDIRECT(\"WP!$K\" & $DO48 & \":$K\" & $DP48),INDIRECT(\"WP!$\" & $BN$41 & \"$\" & $DO48 & \":$\" & $BN$41 & \"$\" & $DP48))/SUMPRODUCT(--(INDIRECT(\"WP!$C$\" & $DO48 & \":$C$\" & $DP48) =$C48),--(INDIRECT(\"WP!$\" & $BN$41 & \"$\" & $DO48 & \":$\" & $BN$41 & \"$\" & $DP48) <>\"\"),INDIRECT(\"WP!$K\" & $DO48 & \":$K\" & $DP48)),\"\"),\"\"),\"\")","v":""},{"$f":"IFERROR(IF(WpAreaB_Sub2_exist,IF(SUMPRODUCT(--(INDIRECT(\"WP!$C$\" & $DO48 & \":$C$\" & $DP48)=$C48),--(INDIRECT(\"WP!$B\" & $DO48 & \":$B\" & $DP48)=\"Y\"),--(INDIRECT(\"WP!$\" & $BN$41 & \"$\" & $DO48 & \":$\" & $BN$41 & \"$\" & $DP48)=1),--(INDIRECT(\"WP!$K\" & $DO48 & \":$K\" & $DP48)>0))<>0,SUMPRODUCT(--(INDIRECT(\"WP!$C$\" & $DO48 & \":$C$\" & $DP48)=$C48),--(INDIRECT(\"WP!$B\" & $DO48 & \":$B\" & $DP48)=\"Y\"),--(INDIRECT(\"WP!$\" & $BN$41 & \"$\" & $DO48 & \":$\" & $BN$41 & \"$\" & $DP48)=1),INDIRECT(\"WP!$K\" & $DO48 & \":$K\" & $DP48)),IF(BP48<>\"\",0,\"\")),\"\"),\"\")","v":""},{"$f":"IFERROR(IF(WpAreaB_Sub2_exist,IF(SUMPRODUCT(--(INDIRECT(\"WP!$C$\" & $DO48 & \":$C$\" & $DP48)=$C48),--(INDIRECT(\"WP!$B\" & $DO48 & \":$B\" & $DP48)=\"Y\"),--(INDIRECT(\"WP!$\" & $BN$41 & \"$\" & $DO48 & \":$\" & $BN$41 & \"$\" & $DP48)<>\"\"),--(INDIRECT(\"WP!$K\" & $DO48 & \":$K\" & $DP48)>0))<>0,SUMPRODUCT(--(INDIRECT(\"WP!$C$\" & $DO48 & \":$C$\" & $DP48)=$C48),--(INDIRECT(\"WP!$B\" & $DO48 & \":$B\" & $DP48)=\"Y\"),--(INDIRECT(\"WP!$\" & $BN$41 & \"$\" & $DO48 & \":$\" & $BN$41 & \"$\" & $DP48)<>\"\"),INDIRECT(\"WP!$K\" & $DO48 & \":$K\" & $DP48)),\"\"),\"\"),\"\")","v":""},{"$f":"IFERROR(IF(WpAreaB_Sub3_exist,IF(SUMPRODUCT(--(INDIRECT(\"WP!$C$\" & $DO48 & \":$C$\" & $DP48) =$C48),--(INDIRECT(\"WP!$\" & $BQ$41 & \"$\" & $DO48 & \":$\" & $BQ$41 & \"$\" & $DP48) <>\"\"),--(INDIRECT(\"WP!$K$\" & $DO48 & \":$K$\" & $DP48)>0))>0,SUMPRODUCT(--(INDIRECT(\"WP!$C$\" & $DO48 & \":$C$\" & $DP48) =$C48),--(INDIRECT(\"WP!$\" & $BQ$41 & \"$\" & $DO48 & \":$\" & $BQ$41 & \"$\" & $DP48) <>\"\"),INDIRECT(\"WP!$K\" & $DO48 & \":$K\" & $DP48),INDIRECT(\"WP!$\" & $BQ$41 & \"$\" & $DO48 & \":$\" & $BQ$41 & \"$\" & $DP48))/SUMPRODUCT(--(INDIRECT(\"WP!$C$\" & $DO48 & \":$C$\" & $DP48) =$C48),--(INDIRECT(\"WP!$\" & $BQ$41 & \"$\" & $DO48 & \":$\" & $BQ$41 & \"$\" & $DP48) <>\"\"),INDIRECT(\"WP!$K\" & $DO48 & \":$K\" & $DP48)),\"\"),\"\"),\"\")","v":""},{"$f":"IFERROR(IF(WpAreaB_Sub3_exist,IF(SUMPRODUCT(--(INDIRECT(\"WP!$C$\" & $DO48 & \":$C$\" & $DP48)=$C48),--(INDIRECT(\"WP!$B\" & $DO48 & \":$B\" & $DP48)=\"Y\"),--(INDIRECT(\"WP!$\" & $BQ$41 & \"$\" & $DO48 & \":$\" & $BQ$41 & \"$\" & $DP48)=1),--(INDIRECT(\"WP!$K\" & $DO48 & \":$K\" & $DP48)>0))<>0,SUMPRODUCT(--(INDIRECT(\"WP!$C$\" & $DO48 & \":$C$\" & $DP48)=$C48),--(INDIRECT(\"WP!$B\" & $DO48 & \":$B\" & $DP48)=\"Y\"),--(INDIRECT(\"WP!$\" & $BQ$41 & \"$\" & $DO48 & \":$\" & $BQ$41 & \"$\" & $DP48)=1),INDIRECT(\"WP!$K\" & $DO48 & \":$K\" & $DP48)),IF(BS48<>\"\",0,\"\")),\"\"),\"\")","v":""},{"$f":"IFERROR(IF(WpAreaB_Sub3_exist,IF(SUMPRODUCT(--(INDIRECT(\"WP!$C$\" & $DO48 & \":$C$\" & $DP48)=$C48),--(INDIRECT(\"WP!$B\" & $DO48 & \":$B\" & $DP48)=\"Y\"),--(INDIRECT(\"WP!$\" & $BQ$41 & \"$\" & $DO48 & \":$\" & $BQ$41 & \"$\" & $DP48)<>\"\"),--(INDIRECT(\"WP!$K\" & $DO48 & \":$K\" & $DP48)>0))<>0,SUMPRODUCT(--(INDIRECT(\"WP!$C$\" & $DO48 & \":$C$\" & $DP48)=$C48),--(INDIRECT(\"WP!$B\" & $DO48 & \":$B\" & $DP48)=\"Y\"),--(INDIRECT(\"WP!$\" & $BQ$41 & \"$\" & $DO48 & \":$\" & $BQ$41 & \"$\" & $DP48)<>\"\"),INDIRECT(\"WP!$K\" & $DO48 & \":$K\" & $DP48)),\"\"),\"\"),\"\")","v":""},null,{"$f":"IFERROR(IF(WpAreaC_Sub1_exist,IF(SUMPRODUCT(--(INDIRECT(\"WP!$C$\" & $DO48 & \":$C$\" & $DP48) =$C48),--(INDIRECT(\"WP!$\" & $BU$41 & \"$\" & $DO48 & \":$\" & $BU$41 & \"$\" & $DP48) <>\"\"),--(INDIRECT(\"WP!$K$\" & $DO48 & \":$K$\" & $DP48)>0))>0,SUMPRODUCT(--(INDIRECT(\"WP!$C$\" & $DO48 & \":$C$\" & $DP48) =$C48),--(INDIRECT(\"WP!$\" & $BU$41 & \"$\" & $DO48 & \":$\" & $BU$41 & \"$\" & $DP48) <>\"\"),INDIRECT(\"WP!$K\" & $DO48 & \":$K\" & $DP48),INDIRECT(\"WP!$\" & $BU$41 & \"$\" & $DO48 & \":$\" & $BU$41 & \"$\" & $DP48))/SUMPRODUCT(--(INDIRECT(\"WP!$C$\" & $DO48 & \":$C$\" & $DP48) =$C48),--(INDIRECT(\"WP!$\" & $BU$41 & \"$\" & $DO48 & \":$\" & $BU$41 & \"$\" & $DP48) <>\"\"),INDIRECT(\"WP!$K\" & $DO48 & \":$K\" & $DP48)),\"\"),\"\"),\"\")","v":""},{"$f":"IFERROR(IF(WpAreaC_Sub1_exist,IF(SUMPRODUCT(--(INDIRECT(\"WP!$C$\" & $DO48 & \":$C$\" & $DP48)=$C48),--(INDIRECT(\"WP!$B\" & $DO48 & \":$B\" & $DP48)=\"Y\"),--(INDIRECT(\"WP!$\" & $BU$41 & \"$\" & $DO48 & \":$\" & $BU$41 & \"$\" & $DP48)=1),--(INDIRECT(\"WP!$K\" & $DO48 & \":$K\" & $DP48)>0))<>0,SUMPRODUCT(--(INDIRECT(\"WP!$C$\" & $DO48 & \":$C$\" & $DP48)=$C48),--(INDIRECT(\"WP!$B\" & $DO48 & \":$B\" & $DP48)=\"Y\"),--(INDIRECT(\"WP!$\" & $BU$41 & \"$\" & $DO48 & \":$\" & $BU$41 & \"$\" & $DP48)=1),INDIRECT(\"WP!$K\" & $DO48 & \":$K\" & $DP48)),IF(BW48<>\"\",0,\"\")),\"\"),\"\")","v":""},{"$f":"IFERROR(IF(WpAreaC_Sub1_exist,IF(SUMPRODUCT(--(INDIRECT(\"WP!$C$\" & $DO48 & \":$C$\" & $DP48)=$C48),--(INDIRECT(\"WP!$B\" & $DO48 & \":$B\" & $DP48)=\"Y\"),--(INDIRECT(\"WP!$\" & $BU$41 & \"$\" & $DO48 & \":$\" & $BU$41 & \"$\" & $DP48)<>\"\"),--(INDIRECT(\"WP!$K\" & $DO48 & \":$K\" & $DP48)>0))<>0,SUMPRODUCT(--(INDIRECT(\"WP!$C$\" & $DO48 & \":$C$\" & $DP48)=$C48),--(INDIRECT(\"WP!$B\" & $DO48 & \":$B\" & $DP48)=\"Y\"),--(INDIRECT(\"WP!$\" & $BU$41 & \"$\" & $DO48 & \":$\" & $BU$41 & \"$\" & $DP48)<>\"\"),INDIRECT(\"WP!$K\" & $DO48 & \":$K\" & $DP48)),\"\"),\"\"),\"\")","v":""},{"$f":"IFERROR(IF(WpAreaC_Sub2_exist,IF(SUMPRODUCT(--(INDIRECT(\"WP!$C$\" & $DO48 & \":$C$\" & $DP48) =$C48),--(INDIRECT(\"WP!$\" & $BX$41 & \"$\" & $DO48 & \":$\" & $BX$41 & \"$\" & $DP48) <>\"\"),--(INDIRECT(\"WP!$K$\" & $DO48 & \":$K$\" & $DP48)>0))>0,SUMPRODUCT(--(INDIRECT(\"WP!$C$\" & $DO48 & \":$C$\" & $DP48) =$C48),--(INDIRECT(\"WP!$\" & $BX$41 & \"$\" & $DO48 & \":$\" & $BX$41 & \"$\" & $DP48) <>\"\"),INDIRECT(\"WP!$K\" & $DO48 & \":$K\" & $DP48),INDIRECT(\"WP!$\" & $BX$41 & \"$\" & $DO48 & \":$\" & $BX$41 & \"$\" & $DP48))/SUMPRODUCT(--(INDIRECT(\"WP!$C$\" & $DO48 & \":$C$\" & $DP48) =$C48),--(INDIRECT(\"WP!$\" & $BX$41 & \"$\" & $DO48 & \":$\" & $BX$41 & \"$\" & $DP48) <>\"\"),INDIRECT(\"WP!$K\" & $DO48 & \":$K\" & $DP48)),\"\"),\"\"),\"\")","v":""},{"$f":"IFERROR(IF(WpAreaC_Sub2_exist,IF(SUMPRODUCT(--(INDIRECT(\"WP!$C$\" & $DO48 & \":$C$\" & $DP48)=$C48),--(INDIRECT(\"WP!$B\" & $DO48 & \":$B\" & $DP48)=\"Y\"),--(INDIRECT(\"WP!$\" & $BX$41 & \"$\" & $DO48 & \":$\" & $BX$41 & \"$\" & $DP48)=1),--(INDIRECT(\"WP!$K\" & $DO48 & \":$K\" & $DP48)>0))<>0,SUMPRODUCT(--(INDIRECT(\"WP!$C$\" & $DO48 & \":$C$\" & $DP48)=$C48),--(INDIRECT(\"WP!$B\" & $DO48 & \":$B\" & $DP48)=\"Y\"),--(INDIRECT(\"WP!$\" & $BX$41 & \"$\" & $DO48 & \":$\" & $BX$41 & \"$\" & $DP48)=1),INDIRECT(\"WP!$K\" & $DO48 & \":$K\" & $DP48)),IF(BZ48<>\"\",0,\"\")),\"\"),\"\")","v":""},{"$f":"IFERROR(IF(WpAreaC_Sub2_exist,IF(SUMPRODUCT(--(INDIRECT(\"WP!$C$\" & $DO48 & \":$C$\" & $DP48)=$C48),--(INDIRECT(\"WP!$B\" & $DO48 & \":$B\" & $DP48)=\"Y\"),--(INDIRECT(\"WP!$\" & $BX$41 & \"$\" & $DO48 & \":$\" & $BX$41 & \"$\" & $DP48)<>\"\"),--(INDIRECT(\"WP!$K\" & $DO48 & \":$K\" & $DP48)>0))<>0,SUMPRODUCT(--(INDIRECT(\"WP!$C$\" & $DO48 & \":$C$\" & $DP48)=$C48),--(INDIRECT(\"WP!$B\" & $DO48 & \":$B\" & $DP48)=\"Y\"),--(INDIRECT(\"WP!$\" & $BX$41 & \"$\" & $DO48 & \":$\" & $BX$41 & \"$\" & $DP48)<>\"\"),INDIRECT(\"WP!$K\" & $DO48 & \":$K\" & $DP48)),\"\"),\"\"),\"\")","v":""},{"$f":"IFERROR(IF(WpAreaC_Sub3_exist,F(SUMPRODUCT(--(INDIRECT(\"WP!$C$\" & $DO48 & \":$C$\" & $DP48) =$C48),--(INDIRECT(\"WP!$\" & $CA$41 & \"$\" & $DO48 & \":$\" & $CA$41 & \"$\" & $DP48) <>\"\"),--(INDIRECT(\"WP!$K$\" & $DO48 & \":$K$\" & $DP48)>0))>0,SUMPRODUCT(--(INDIRECT(\"WP!$C$\" & $DO48 & \":$C$\" & $DP48) =$C48),--(INDIRECT(\"WP!$\" & $CA$41 & \"$\" & $DO48 & \":$\" & $CA$41 & \"$\" & $DP48) <>\"\"),INDIRECT(\"WP!$K\" & $DO48 & \":$K\" & $DP48),INDIRECT(\"WP!$\" & $CA$41 & \"$\" & $DO48 & \":$\" & $CA$41 & \"$\" & $DP48))/SUMPRODUCT(--(INDIRECT(\"WP!$C$\" & $DO48 & \":$C$\" & $DP48) =$C48),--(INDIRECT(\"WP!$\" & $CA$41 & \"$\" & $DO48 & \":$\" & $CA$41 & \"$\" & $DP48) <>\"\"),INDIRECT(\"WP!$K\" & $DO48 & \":$K\" & $DP48)),\"\"),\"\"),\"\")","v":""},{"$f":"IFERROR(IF(WpAreaC_Sub3_exist,IF(SUMPRODUCT(--(INDIRECT(\"WP!$C$\" & $DO48 & \":$C$\" & $DP48)=$C48),--(INDIRECT(\"WP!$B\" & $DO48 & \":$B\" & $DP48)=\"Y\"),--(INDIRECT(\"WP!$\" & $CA$41 & \"$\" & $DO48 & \":$\" & $CA$41 & \"$\" & $DP48)=1),--(INDIRECT(\"WP!$K\" & $DO48 & \":$K\" & $DP48)>0))<>0,SUMPRODUCT(--(INDIRECT(\"WP!$C$\" & $DO48 & \":$C$\" & $DP48)=$C48),--(INDIRECT(\"WP!$B\" & $DO48 & \":$B\" & $DP48)=\"Y\"),--(INDIRECT(\"WP!$\" & $CA$41 & \"$\" & $DO48 & \":$\" & $CA$41 & \"$\" & $DP48)=1),INDIRECT(\"WP!$K\" & $DO48 & \":$K\" & $DP48)),IF(CC48<>\"\",0,\"\")),\"\"),\"\")","v":""},{"$f":"IFERROR(IF(WpAreaC_Sub3_exist,IF(SUMPRODUCT(--(INDIRECT(\"WP!$C$\" & $DO48 & \":$C$\" & $DP48)=$C48),--(INDIRECT(\"WP!$B\" & $DO48 & \":$B\" & $DP48)=\"Y\"),--(INDIRECT(\"WP!$\" & $CA$41 & \"$\" & $DO48 & \":$\" & $CA$41 & \"$\" & $DP48)<>\"\"),--(INDIRECT(\"WP!$K\" & $DO48 & \":$K\" & $DP48)>0))<>0,SUMPRODUCT(--(INDIRECT(\"WP!$C$\" & $DO48 & \":$C$\" & $DP48)=$C48),--(INDIRECT(\"WP!$B\" & $DO48 & \":$B\" & $DP48)=\"Y\"),--(INDIRECT(\"WP!$\" & $CA$41 & \"$\" & $DO48 & \":$\" & $CA$41 & \"$\" & $DP48)<>\"\"),INDIRECT(\"WP!$K\" & $DO48 & \":$K\" & $DP48)),\"\"),\"\"),\"\")","v":""},null,null,null,null,"","","","","","","","","","","","",null,"","","","","","","","","",null,"","","","","","","","","",null,{"$f":"MIN(IF(WP!$C$12:$C$53=$C48,ROW(WP!$C$12:$C$53),\"\"))","v":23},{"$f":"MAX(IF(WP!$C$12:$C$53=$C48,ROW(WP!$C$12:$C$53),\"\"))","v":35}]
[null,"Test Point analysis receiver and transmitter test cases",36.905000000000001,{"$f":"getProgress(AX49,CH49,\"%\",1,1)","v":"0%"},{"$f":"getProgress(AY49,CI49,,,1)","v":""},{"$f":"getProgress(AZ49,CJ49,,,1)","v":""},null,{"$f":"getProgress(BA49,CK49,\"%\",1,1,WpAreaA_Sub1_exist)","v":"0%"},{"$f":"getProgress(BB49,CL49,,,1,WpAreaA_Sub1_exist)","v":""},{"$f":"getProgress(BC49,CM49,,,1,WpAreaA_Sub1_exist)","v":""},{"$f":"getProgress(BD49,CN49,\"%\",1,1,WpAreaA_Sub2_exist)","v":""},{"$f":"getProgress(BE49,CO49,,,1,WpAreaA_Sub2_exist)","v":""},{"$f":"getProgress(BF49,CP49,,,1,WpAreaA_Sub2_exist)","v":""},{"$f":"getProgress(BG49,CQ49,\"%\",1,1,WpAreaA_Sub3_exist)","v":""},{"$f":"getProgress(BH49,CR49,,,1,WpAreaA_Sub3_exist)","v":""},{"$f":"getProgress(BI49,CS49,,,1,WpAreaA_Sub3_exist)","v":""},null,{"$f":"getProgress(BK49,CU49,\"%\",1,1,WpAreaB_Sub1_exist)","v":""},{"$f":"getProgress(BL49,CV49,,,1,WpAreaB_Sub1_exist)","v":""},{"$f":"getProgress(BM49,CW49,,,1,WpAreaB_Sub1_exist)","v":""},{"$f":"getProgress(BN49,CX49,\"%\",1,1,WpAreaB_Sub2_exist)","v":""},{"$f":"getProgress(BO49,CY49,,,1,WpAreaB_Sub2_exist)","v":""},{"$f":"getProgress(BP49,CZ49,,,1,WpAreaB_Sub2_exist)","v":""},{"$f":"getProgress(BQ49,DA49,\"%\",1,1,WpAreaB_Sub3_exist)","v":""},{"$f":"getProgress(BR49,DB49,,,1,WpAreaB_Sub3_exist)","v":""},{"$f":"getProgress(BS49,DC49,,,1,WpAreaB_Sub3_exist)","v":""},null,{"$f":"getProgress(BU49,DE49,\"%\",1,1,WpAreaC_Sub1_exist)","v":""},{"$f":"getProgress(BV49,DF49,,,1,WpAreaC_Sub1_exist)","v":""},{"$f":"getProgress(BW49,DG49,,,1,WpAreaC_Sub1_exist)","v":""},{"$f":"getProgress(BX49,DH49,\"%\",1,1,WpAreaC_Sub2_exist)","v":""},{"$f":"getProgress(BY49,DI49,,,1,WpAreaC_Sub2_exist)","v":""},{"$f":"getProgress(BZ49,DJ49,,,1,WpAreaC_Sub2_exist)","v":""},{"$f":"getProgress(CA49,DK49,\"%\",1,1,WpAreaC_Sub3_exist)","v":""},{"$f":"getProgress(CB49,DL49,,,1,WpAreaC_Sub3_exist)","v":""},{"$f":"getProgress(CC49,DM49,,,1,WpAreaC_Sub3_exist)","v":""},null,null,null,null,null,null,null,null,null,null,null,null,null,{"$f":"IFERROR((IF(WpAreaA_exist,IF(BA49<>\"\",BA49*WP!$AB$9,0)+IF(BD49<>\"\",BD49*WP!$AC$9,0)+IF(BG49<>\"\",BG49*WP!$AD$9,0),0)+IF(WpAreaB_exist,IF(BK49<>\"\",BK49*WP!$AE$10)+IF(BN49<>\"\",BN49*WP!$AF$10,0)+IF(BQ49<>\"\",BQ49*WP!$AG$10,0),0)+IF(WpAreaC_exist,IF(BU49<>\"\",BU49*WP!$AH$10)+IF(BX49<>\"\",BX49*WP!$AI$10,0)+IF(CA49<>\"\",CA49*WP!$AJ$10,0),0))/(IF(WpAreaA_exist,IF(BA49<>\"\",WP!$AB$9,0)+IF(BD49<>\"\",WP!$AC$9,0)+IF(BG49<>\"\",WP!$AD$9,0),0)+IF(WpAreaB_exist,IF(BK49<>\"\",WP!$AE$10,0)+IF(BN49<>\"\",WP!$AF$10,0)+IF(BQ49<>\"\",WP!$AG$10,0),0)+ IF(WpAreaC_exist,IF(BU49<>\"\",WP!$AH$10,0)+IF(BX49<>\"\",WP!$AI$10,0)+IF(CA49<>\"\",WP!$AJ$10,0),0)),\"\")","v":0},{"$f":"IFERROR(IF(SUMPRODUCT(--(INDIRECT(\"WP!$C$\" & $DO49 & \":$C$\" & $DP49)=$C49),--(INDIRECT(\"WP!$B$\" & $DO49 & \":$B$\" & $DP49)=\"Y\"),--(INDIRECT(\"WP!$\" & $AX$41 & \"$\" & $DO49 & \":$\" & $AX$41 & \"$\" & $DP49)=1),--(INDIRECT(\"WP!$K$\" & $DO49 & \":$K$\" & $DP49)>0))<>0,SUMPRODUCT(--(INDIRECT(\"WP!$C$\" & $DO49 & \":$C$\" & $DP49)=$C49),--(INDIRECT(\"WP!$B$\" & $DO49 & \":$B$\" & $DP49)=\"Y\"),--(INDIRECT(\"WP!$\" & $AX$41 & \"$\" & $DO49 & \":$\" & $AX$41 & \"$\" & $DP49)=1),INDIRECT(\"WP!$K$\" & $DO49 & \":$K$\" & $DP49)),IF(AZ49<>\"\",0,\"\")),\"\")","v":""},{"$f":"IFERROR(IF(SUMPRODUCT(--(INDIRECT(\"WP!$C$\" & $DO49 & \":$C$\" & $DP49)=$C49),--(INDIRECT(\"WP!$B\" & $DO49 & \":$B\" & $DP49)=\"Y\"),--(INDIRECT(\"WP!$\" & $AX$41 & \"$\" & $DO49 & \":$\" & $AX$41 & \"$\" & $DP49)<>\"\"),--(INDIRECT(\"WP!$K\" & $DO49 & \":$K\" & $DP49)>0))<>0,SUMPRODUCT(--(INDIRECT(\"WP!$C$\" & $DO49 & \":$C$\" & $DP49)=$C49),--(INDIRECT(\"WP!$B\" & $DO49 & \":$B\" & $DP49)=\"Y\"),--(INDIRECT(\"WP!$\" & $AX$41 & \"$\" &  $DO49 & \":$\" & $AX$41 & \"$\" & $DP49)<>\"\"),INDIRECT(\"WP!$K\" & $DO49 & \":$K\" & $DP49)),\"\"),\"\")","v":""},{"$f":"IFERROR(IF(WpAreaA_Sub1_exist,IF(SUMPRODUCT(--(INDIRECT(\"WP!$C$\" & $DO49 & \":$C$\" & $DP49) =$C49),--(INDIRECT(\"WP!$\" & $BA$41 & \"$\" & $DO49 & \":$\" & $BA$41 & \"$\" & $DP49) <>\"\"),--(INDIRECT(\"WP!$K$\" & $DO49 & \":$K$\" & $DP49)>0))>0,SUMPRODUCT(--(INDIRECT(\"WP!$C$\" & $DO49 & \":$C$\" & $DP49) =$C49),--(INDIRECT(\"WP!$\" & $BA$41 & \"$\" & $DO49 & \":$\" & $BA$41 & \"$\" & $DP49) <>\"\"),INDIRECT(\"WP!$K$\" & $DO49 & \":$K$\" & $DP49),INDIRECT(\"WP!$\" & $BA$41 & \"$\" & $DO49 & \":$\" & $BA$41 & \"$\" & $DP49))/SUMPRODUCT(--(INDIRECT(\"WP!$C$\" & $DO49 & \":$C$\" & $DP49) =$C49),--(INDIRECT(\"WP!$\" & $BA$41 & \"$\" & $DO49 & \":$\" & $BA$41 & \"$\" & $DP49) <>\"\"),INDIRECT(\"WP!$K$\" & $DO49 & \":$K$\" & $DP49)),\"\"),\"\"),\"\")","v":0},{"$f":"IFERROR(IF(WpAreaA_Sub1_exist,IF(SUMPRODUCT(--(INDIRECT(\"WP!$C$\" & $DO49 & \":$C$\" & $DP49)=$C49),--(INDIRECT(\"WP!$B$\" & $DO49 & \":$B$\" & $DP49)=\"Y\"),--(INDIRECT(\"WP!$\" & $BA$41 & \"$\" & $DO49 & \":$\" & $BA$41 & \"$\" & $DP49)=1),--(INDIRECT(\"WP!$K$\" & $DO49 & \":$K$\" & $DP49)>0))<>0,SUMPRODUCT(--(INDIRECT(\"WP!$C$\" & $DO49 & \":$C$\" & $DP49)=$C49),--(INDIRECT(\"WP!$B$\" & $DO49 & \":$B$\" & $DP49)=\"Y\"),--(INDIRECT(\"WP!$\" & $BA$41 & \"$\" & $DO49 & \":$\" & $BA$41 & \"$\" & $DP49)=1),INDIRECT(\"WP!$K$\" & $DO49 & \":$K$\" & $DP49)),IF(BC49<>\"\",0,\"\")),\"\"),\"\")","v":""},{"$f":"IFERROR(IF(WpAreaA_Sub1_exist,IF(SUMPRODUCT(--(INDIRECT(\"WP!$C$\" & $DO49 & \":$C$\" & $DP49)=$C49),--(INDIRECT(\"WP!$B\" & $DO49 & \":$B\" & $DP49)=\"Y\"),--(INDIRECT(\"WP!$\" & $BA$41 & \"$\" & $DO49 & \":$\" & $BA$41 & \"$\" & $DP49)<>\"\"),--(INDIRECT(\"WP!$K\" & $DO49 & \":$K\" & $DP49)>0))<>0,SUMPRODUCT(--(INDIRECT(\"WP!$C$\" & $DO49 & \":$C$\" & $DP49)=$C49),--(INDIRECT(\"WP!$B\" & $DO49 & \":$B\" & $DP49)=\"Y\"),--(INDIRECT(\"WP!$\" & $BA$41 & \"$\" &  $DO49 & \":$\" & $BA$41 & \"$\" & $DP49)<>\"\"),INDIRECT(\"WP!$K\" & $DO49 & \":$K\" & $DP49)),\"\"),\"\"),\"\")","v":""},{"$f":"IFERROR(IF(WpAreaA_Sub2_exist,IF(SUMPRODUCT(--(INDIRECT(\"WP!$C$\" & $DO49 & \":$C$\" & $DP49) =$C49),--(INDIRECT(\"WP!$\" & $BD$41 & \"$\" & $DO49 & \":$\" & $BD$41 & \"$\" & $DP49) <>\"\"),--(INDIRECT(\"WP!$K$\" & $DO49 & \":$K$\" & $DP49)>0))>0,SUMPRODUCT(--(INDIRECT(\"WP!$C$\" & $DO49 & \":$C$\" & $DP49) =$C49),--(INDIRECT(\"WP!$\" & $BD$41 & \"$\" & $DO49 & \":$\" & $BD$41 & \"$\" & $DP49) <>\"\"),INDIRECT(\"WP!$K\" & $DO49 & \":$K\" & $DP49),INDIRECT(\"WP!$\" & $BD$41 & \"$\" & $DO49 & \":$\" & $BD$41 & \"$\" & $DP49))/SUMPRODUCT(--(INDIRECT(\"WP!$C$\" & $DO49 & \":$C$\" & $DP49) =$C49),--(INDIRECT(\"WP!$\" & $BD$41 & \"$\" & $DO49 & \":$\" & $BD$41 & \"$\" & $DP49) <>\"\"),INDIRECT(\"WP!$K\" & $DO49 & \":$K\" & $DP49)),\"\"),\"\"),\"\")","v":""},{"$f":"IFERROR(IF(WpAreaA_Sub2_exist,IF(SUMPRODUCT(--(INDIRECT(\"WP!$C$\" & $DO49 & \":$C$\" & $DP49)=$C49),--(INDIRECT(\"WP!$B\" & $DO49 & \":$B\" & $DP49)=\"Y\"),--(INDIRECT(\"WP!$\" & $BD$41 & \"$\" & $DO49 & \":$\" & $BD$41 & \"$\" & $DP49)=1),--(INDIRECT(\"WP!$K\" & $DO49 & \":$K\" & $DP49)>0))<>0,SUMPRODUCT(--(INDIRECT(\"WP!$C$\" & $DO49 & \":$C$\" & $DP49)=$C49),--(INDIRECT(\"WP!$B\" & $DO49 & \":$B\" & $DP49)=\"Y\"),--(INDIRECT(\"WP!$\" & $BD$41 & \"$\" & $DO49 & \":$\" & $BD$41 & \"$\" & $DP49)=1),INDIRECT(\"WP!$K\" & $DO49 & \":$K\" & $DP49)),IF(BF49<>\"\",0,\"\")),\"\"),\"\")","v":""},{"$f":"IFERROR(IF(WpAreaA_Sub2_exist,IF(SUMPRODUCT(--(INDIRECT(\"WP!$C$\" & $DO49 & \":$C$\" & $DP49)=$C49),--(INDIRECT(\"WP!$B\" & $DO49 & \":$B\" & $DP49)=\"Y\"),--(INDIRECT(\"WP!$\" & $BD$41 & \"$\" & $DO49 & \":$\" & $BD$41 & \"$\" & $DP49)<>\"\"),--(INDIRECT(\"WP!$K\" & $DO49 & \":$K\" & $DP49)>0))<>0,SUMPRODUCT(--(INDIRECT(\"WP!$C$\" & $DO49 & \":$C$\" & $DP49)=$C49),--(INDIRECT(\"WP!$B\" & $DO49 & \":$B\" & $DP49)=\"Y\"),--(INDIRECT(\"WP!$\" & $BD$41 & \"$\" & $DO49 & \":$\" & $BD$41 & \"$\" & $DP49)<>\"\"),INDIRECT(\"WP!$K\" & $DO49 & \":$K\" & $DP49)),\"\"),\"\"),\"\")","v":""},{"$f":"IFERROR(IF(WpAreaA_Sub3_exist,IF(SUMPRODUCT(--(INDIRECT(\"WP!$C$\" & $DO49 & \":$C$\" & $DP49) =$C49),--(INDIRECT(\"WP!$\" & $BG$41 & \"$\" & $DO49 & \":$\" & $BG$41 & \"$\" & $DP49) <>\"\"),--(INDIRECT(\"WP!$K$\" & $DO49 & \":$K$\" & $DP49)>0))>0,SUMPRODUCT(--(INDIRECT(\"WP!$C$\" & $DO49 & \":$C$\" & $DP49) =$C49),--(INDIRECT(\"WP!$\" & $BG$41 & \"$\" & $DO49 & \":$\" & $BG$41 & \"$\" & $DP49) <>\"\"),INDIRECT(\"WP!$K\" & $DO49 & \":$K\" & $DP49),INDIRECT(\"WP!$\" & $BG$41 & \"$\" & $DO49 & \":$\" & $BG$41 & \"$\" & $DP49))/SUMPRODUCT(--(INDIRECT(\"WP!$C$\" & $DO49 & \":$C$\" & $DP49) =$C49),--(INDIRECT(\"WP!$\" & $BG$41 & \"$\" & $DO49 & \":$\" & $BG$41 & \"$\" & $DP49) <>\"\"),INDIRECT(\"WP!$K\" & $DO49 & \":$K\" & $DP49)),\"\"),\"\"),\"\")","v":""},{"$f":"IFERROR(IF(WpAreaA_Sub3_exist,IF(SUMPRODUCT(--(INDIRECT(\"WP!$C$\" & $DO49 & \":$C$\" & $DP49)=$C49),--(INDIRECT(\"WP!$B\" & $DO49 & \":$B\" & $DP49)=\"Y\"),--(INDIRECT(\"WP!$\" & $BG$41 & \"$\" & $DO49 & \":$\" & $BG$41 & \"$\" & $DP49)=1),--(INDIRECT(\"WP!$K\" & $DO49 & \":$K\" & $DP49)>0))<>0,SUMPRODUCT(--(INDIRECT(\"WP!$C$\" & $DO49 & \":$C$\" & $DP49)=$C49),--(INDIRECT(\"WP!$B\" & $DO49 & \":$B\" & $DP49)=\"Y\"),--(INDIRECT(\"WP!$\" & $BG$41 & \"$\" & $DO49 & \":$\" & $BG$41 & \"$\" & $DP49)=1),INDIRECT(\"WP!$K\" & $DO49 & \":$K\" & $DP49)),IF(BI49<>\"\",0,\"\")),\"\"),\"\")","v":""},{"$f":"IFERROR(IF(WpAreaA_Sub3_exist,IF(SUMPRODUCT(--(INDIRECT(\"WP!$C$\" & $DO49 & \":$C$\" & $DP49)=$C49),--(INDIRECT(\"WP!$B\" & $DO49 & \":$B\" & $DP49)=\"Y\"),--(INDIRECT(\"WP!$\" & $BG$41 & \"$\" & $DO49 & \":$\" & $BG$41 & \"$\" & $DP49)<>\"\"),--(INDIRECT(\"WP!$K\" & $DO49 & \":$K\" & $DP49)>0))<>0,SUMPRODUCT(--(INDIRECT(\"WP!$C$\" & $DO49 & \":$C$\" & $DP49)=$C49),--(INDIRECT(\"WP!$B\" & $DO49 & \":$B\" & $DP49)=\"Y\"),--(INDIRECT(\"WP!$\" & $BG$41 & \"$\" & $DO49 & \":$\" & $BG$41 & \"$\" & $DP49)<>\"\"),INDIRECT(\"WP!$K\" & $DO49 & \":$K\" & $DP49)),\"\"),\"\"),\"\")","v":""},null,{"$f":"IFERROR(IF(WpAreaB_Sub1_exist,IF(SUMPRODUCT(--(INDIRECT(\"WP!$C$\" & $DO49 & \":$C$\" & $DP49) =$C49),--(INDIRECT(\"WP!$\" & $BK$41 & \"$\" & $DO49 & \":$\" & $BK$41 & \"$\" & $DP49) <>\"\"),--(INDIRECT(\"WP!$K$\" & $DO49 & \":$K$\" & $DP49)>0))>0,SUMPRODUCT(--(INDIRECT(\"WP!$C$\" & $DO49 & \":$C$\" & $DP49) =$C49),--(INDIRECT(\"WP!$\" & $BK$41 & \"$\" & $DO49 & \":$\" & $BK$41 & \"$\" & $DP49) <>\"\"),INDIRECT(\"WP!$K\" & $DO49 & \":$K\" & $DP49),INDIRECT(\"WP!$\" & $BK$41 & \"$\" & $DO49 & \":$\" & $BK$41 & \"$\" & $DP49))/SUMPRODUCT(--(INDIRECT(\"WP!$C$\" & $DO49 & \":$C$\" & $DP49) =$C49),--(INDIRECT(\"WP!$\" & $BK$41 & \"$\" & $DO49 & \":$\" & $BK$41 & \"$\" & $DP49) <>\"\"),INDIRECT(\"WP!$K\" & $DO49 & \":$K\" & $DP49)),\"\"),\"\"),\"\")","v":""},{"$f":"IFERROR(IF(WpAreaB_Sub1_exist,IF(SUMPRODUCT(--(INDIRECT(\"WP!$C$\" & $DO49 & \":$C$\" & $DP49)=$C49),--(INDIRECT(\"WP!$B\" & $DO49 & \":$B\" & $DP49)=\"Y\"),--(INDIRECT(\"WP!$\" & $BK$41 & \"$\" & $DO49 & \":$\" & $BK$41 & \"$\" & $DP49)=1),--(INDIRECT(\"WP!$K\" & $DO49 & \":$K\" & $DP49)>0))<>0,SUMPRODUCT(--(INDIRECT(\"WP!$C$\" & $DO49 & \":$C$\" & $DP49)=$C49),--(INDIRECT(\"WP!$B\" & $DO49 & \":$B\" & $DP49)=\"Y\"),--(INDIRECT(\"WP!$\" & $BK$41 & \"$\" & $DO49 & \":$\" & $BK$41 & \"$\" & $DP49)=1),INDIRECT(\"WP!$K\" & $DO49 & \":$K\" & $DP49)),IF(BM49<>\"\",0,\"\")),\"\"),\"\")","v":""},{"$f":"IFERROR(IF(WpAreaB_Sub1_exist,IF(SUMPRODUCT(--(INDIRECT(\"WP!$C$\" & $DO49 & \":$C$\" & $DP49)=$C49),--(INDIRECT(\"WP!$B\" & $DO49 & \":$B\" & $DP49)=\"Y\"),--(INDIRECT(\"WP!$\" & $BK$41 & \"$\" & $DO49 & \":$\" & $BK$41 & \"$\" & $DP49)<>\"\"),--(INDIRECT(\"WP!$K\" & $DO49 & \":$K\" & $DP49)>0))<>0,SUMPRODUCT(--(INDIRECT(\"WP!$C$\" & $DO49 & \":$C$\" & $DP49)=$C49),--(INDIRECT(\"WP!$B\" & $DO49 & \":$B\" & $DP49)=\"Y\"),--(INDIRECT(\"WP!$\" & $BK$41 & \"$\" & $DO49 & \":$\" & $BK$41 & \"$\" & $DP49)<>\"\"),INDIRECT(\"WP!$K\" & $DO49 & \":$K\" & $DP49)),\"\"),\"\"),\"\")","v":""},{"$f":"IFERROR(IF(WpAreaB_Sub2_exist,IF(SUMPRODUCT(--(INDIRECT(\"WP!$C$\" & $DO49 & \":$C$\" & $DP49) =$C49),--(INDIRECT(\"WP!$\" & $BN$41 & \"$\" & $DO49 & \":$\" & $BN$41 & \"$\" & $DP49) <>\"\"),--(INDIRECT(\"WP!$K$\" & $DO49 & \":$K$\" & $DP49)>0))>0,SUMPRODUCT(--(INDIRECT(\"WP!$C$\" & $DO49 & \":$C$\" & $DP49) =$C49),--(INDIRECT(\"WP!$\" & $BN$41 & \"$\" & $DO49 & \":$\" & $BN$41 & \"$\" & $DP49) <>\"\"),INDIRECT(\"WP!$K\" & $DO49 & \":$K\" & $DP49),INDIRECT(\"WP!$\" & $BN$41 & \"$\" & $DO49 & \":$\" & $BN$41 & \"$\" & $DP49))/SUMPRODUCT(--(INDIRECT(\"WP!$C$\" & $DO49 & \":$C$\" & $DP49) =$C49),--(INDIRECT(\"WP!$\" & $BN$41 & \"$\" & $DO49 & \":$\" & $BN$41 & \"$\" & $DP49) <>\"\"),INDIRECT(\"WP!$K\" & $DO49 & \":$K\" & $DP49)),\"\"),\"\"),\"\")","v":""},{"$f":"IFERROR(IF(WpAreaB_Sub2_exist,IF(SUMPRODUCT(--(INDIRECT(\"WP!$C$\" & $DO49 & \":$C$\" & $DP49)=$C49),--(INDIRECT(\"WP!$B\" & $DO49 & \":$B\" & $DP49)=\"Y\"),--(INDIRECT(\"WP!$\" & $BN$41 & \"$\" & $DO49 & \":$\" & $BN$41 & \"$\" & $DP49)=1),--(INDIRECT(\"WP!$K\" & $DO49 & \":$K\" & $DP49)>0))<>0,SUMPRODUCT(--(INDIRECT(\"WP!$C$\" & $DO49 & \":$C$\" & $DP49)=$C49),--(INDIRECT(\"WP!$B\" & $DO49 & \":$B\" & $DP49)=\"Y\"),--(INDIRECT(\"WP!$\" & $BN$41 & \"$\" & $DO49 & \":$\" & $BN$41 & \"$\" & $DP49)=1),INDIRECT(\"WP!$K\" & $DO49 & \":$K\" & $DP49)),IF(BP49<>\"\",0,\"\")),\"\"),\"\")","v":""},{"$f":"IFERROR(IF(WpAreaB_Sub2_exist,IF(SUMPRODUCT(--(INDIRECT(\"WP!$C$\" & $DO49 & \":$C$\" & $DP49)=$C49),--(INDIRECT(\"WP!$B\" & $DO49 & \":$B\" & $DP49)=\"Y\"),--(INDIRECT(\"WP!$\" & $BN$41 & \"$\" & $DO49 & \":$\" & $BN$41 & \"$\" & $DP49)<>\"\"),--(INDIRECT(\"WP!$K\" & $DO49 & \":$K\" & $DP49)>0))<>0,SUMPRODUCT(--(INDIRECT(\"WP!$C$\" & $DO49 & \":$C$\" & $DP49)=$C49),--(INDIRECT(\"WP!$B\" & $DO49 & \":$B\" & $DP49)=\"Y\"),--(INDIRECT(\"WP!$\" & $BN$41 & \"$\" & $DO49 & \":$\" & $BN$41 & \"$\" & $DP49)<>\"\"),INDIRECT(\"WP!$K\" & $DO49 & \":$K\" & $DP49)),\"\"),\"\"),\"\")","v":""},{"$f":"IFERROR(IF(WpAreaB_Sub3_exist,IF(SUMPRODUCT(--(INDIRECT(\"WP!$C$\" & $DO49 & \":$C$\" & $DP49) =$C49),--(INDIRECT(\"WP!$\" & $BQ$41 & \"$\" & $DO49 & \":$\" & $BQ$41 & \"$\" & $DP49) <>\"\"),--(INDIRECT(\"WP!$K$\" & $DO49 & \":$K$\" & $DP49)>0))>0,SUMPRODUCT(--(INDIRECT(\"WP!$C$\" & $DO49 & \":$C$\" & $DP49) =$C49),--(INDIRECT(\"WP!$\" & $BQ$41 & \"$\" & $DO49 & \":$\" & $BQ$41 & \"$\" & $DP49) <>\"\"),INDIRECT(\"WP!$K\" & $DO49 & \":$K\" & $DP49),INDIRECT(\"WP!$\" & $BQ$41 & \"$\" & $DO49 & \":$\" & $BQ$41 & \"$\" & $DP49))/SUMPRODUCT(--(INDIRECT(\"WP!$C$\" & $DO49 & \":$C$\" & $DP49) =$C49),--(INDIRECT(\"WP!$\" & $BQ$41 & \"$\" & $DO49 & \":$\" & $BQ$41 & \"$\" & $DP49) <>\"\"),INDIRECT(\"WP!$K\" & $DO49 & \":$K\" & $DP49)),\"\"),\"\"),\"\")","v":""},{"$f":"IFERROR(IF(WpAreaB_Sub3_exist,IF(SUMPRODUCT(--(INDIRECT(\"WP!$C$\" & $DO49 & \":$C$\" & $DP49)=$C49),--(INDIRECT(\"WP!$B\" & $DO49 & \":$B\" & $DP49)=\"Y\"),--(INDIRECT(\"WP!$\" & $BQ$41 & \"$\" & $DO49 & \":$\" & $BQ$41 & \"$\" & $DP49)=1),--(INDIRECT(\"WP!$K\" & $DO49 & \":$K\" & $DP49)>0))<>0,SUMPRODUCT(--(INDIRECT(\"WP!$C$\" & $DO49 & \":$C$\" & $DP49)=$C49),--(INDIRECT(\"WP!$B\" & $DO49 & \":$B\" & $DP49)=\"Y\"),--(INDIRECT(\"WP!$\" & $BQ$41 & \"$\" & $DO49 & \":$\" & $BQ$41 & \"$\" & $DP49)=1),INDIRECT(\"WP!$K\" & $DO49 & \":$K\" & $DP49)),IF(BS49<>\"\",0,\"\")),\"\"),\"\")","v":""},{"$f":"IFERROR(IF(WpAreaB_Sub3_exist,IF(SUMPRODUCT(--(INDIRECT(\"WP!$C$\" & $DO49 & \":$C$\" & $DP49)=$C49),--(INDIRECT(\"WP!$B\" & $DO49 & \":$B\" & $DP49)=\"Y\"),--(INDIRECT(\"WP!$\" & $BQ$41 & \"$\" & $DO49 & \":$\" & $BQ$41 & \"$\" & $DP49)<>\"\"),--(INDIRECT(\"WP!$K\" & $DO49 & \":$K\" & $DP49)>0))<>0,SUMPRODUCT(--(INDIRECT(\"WP!$C$\" & $DO49 & \":$C$\" & $DP49)=$C49),--(INDIRECT(\"WP!$B\" & $DO49 & \":$B\" & $DP49)=\"Y\"),--(INDIRECT(\"WP!$\" & $BQ$41 & \"$\" & $DO49 & \":$\" & $BQ$41 & \"$\" & $DP49)<>\"\"),INDIRECT(\"WP!$K\" & $DO49 & \":$K\" & $DP49)),\"\"),\"\"),\"\")","v":""},null,{"$f":"IFERROR(IF(WpAreaC_Sub1_exist,IF(SUMPRODUCT(--(INDIRECT(\"WP!$C$\" & $DO49 & \":$C$\" & $DP49) =$C49),--(INDIRECT(\"WP!$\" & $BU$41 & \"$\" & $DO49 & \":$\" & $BU$41 & \"$\" & $DP49) <>\"\"),--(INDIRECT(\"WP!$K$\" & $DO49 & \":$K$\" & $DP49)>0))>0,SUMPRODUCT(--(INDIRECT(\"WP!$C$\" & $DO49 & \":$C$\" & $DP49) =$C49),--(INDIRECT(\"WP!$\" & $BU$41 & \"$\" & $DO49 & \":$\" & $BU$41 & \"$\" & $DP49) <>\"\"),INDIRECT(\"WP!$K\" & $DO49 & \":$K\" & $DP49),INDIRECT(\"WP!$\" & $BU$41 & \"$\" & $DO49 & \":$\" & $BU$41 & \"$\" & $DP49))/SUMPRODUCT(--(INDIRECT(\"WP!$C$\" & $DO49 & \":$C$\" & $DP49) =$C49),--(INDIRECT(\"WP!$\" & $BU$41 & \"$\" & $DO49 & \":$\" & $BU$41 & \"$\" & $DP49) <>\"\"),INDIRECT(\"WP!$K\" & $DO49 & \":$K\" & $DP49)),\"\"),\"\"),\"\")","v":""},{"$f":"IFERROR(IF(WpAreaC_Sub1_exist,IF(SUMPRODUCT(--(INDIRECT(\"WP!$C$\" & $DO49 & \":$C$\" & $DP49)=$C49),--(INDIRECT(\"WP!$B\" & $DO49 & \":$B\" & $DP49)=\"Y\"),--(INDIRECT(\"WP!$\" & $BU$41 & \"$\" & $DO49 & \":$\" & $BU$41 & \"$\" & $DP49)=1),--(INDIRECT(\"WP!$K\" & $DO49 & \":$K\" & $DP49)>0))<>0,SUMPRODUCT(--(INDIRECT(\"WP!$C$\" & $DO49 & \":$C$\" & $DP49)=$C49),--(INDIRECT(\"WP!$B\" & $DO49 & \":$B\" & $DP49)=\"Y\"),--(INDIRECT(\"WP!$\" & $BU$41 & \"$\" & $DO49 & \":$\" & $BU$41 & \"$\" & $DP49)=1),INDIRECT(\"WP!$K\" & $DO49 & \":$K\" & $DP49)),IF(BW49<>\"\",0,\"\")),\"\"),\"\")","v":""},{"$f":"IFERROR(IF(WpAreaC_Sub1_exist,IF(SUMPRODUCT(--(INDIRECT(\"WP!$C$\" & $DO49 & \":$C$\" & $DP49)=$C49),--(INDIRECT(\"WP!$B\" & $DO49 & \":$B\" & $DP49)=\"Y\"),--(INDIRECT(\"WP!$\" & $BU$41 & \"$\" & $DO49 & \":$\" & $BU$41 & \"$\" & $DP49)<>\"\"),--(INDIRECT(\"WP!$K\" & $DO49 & \":$K\" & $DP49)>0))<>0,SUMPRODUCT(--(INDIRECT(\"WP!$C$\" & $DO49 & \":$C$\" & $DP49)=$C49),--(INDIRECT(\"WP!$B\" & $DO49 & \":$B\" & $DP49)=\"Y\"),--(INDIRECT(\"WP!$\" & $BU$41 & \"$\" & $DO49 & \":$\" & $BU$41 & \"$\" & $DP49)<>\"\"),INDIRECT(\"WP!$K\" & $DO49 & \":$K\" & $DP49)),\"\"),\"\"),\"\")","v":""},{"$f":"IFERROR(IF(WpAreaC_Sub2_exist,IF(SUMPRODUCT(--(INDIRECT(\"WP!$C$\" & $DO49 & \":$C$\" & $DP49) =$C49),--(INDIRECT(\"WP!$\" & $BX$41 & \"$\" & $DO49 & \":$\" & $BX$41 & \"$\" & $DP49) <>\"\"),--(INDIRECT(\"WP!$K$\" & $DO49 & \":$K$\" & $DP49)>0))>0,SUMPRODUCT(--(INDIRECT(\"WP!$C$\" & $DO49 & \":$C$\" & $DP49) =$C49),--(INDIRECT(\"WP!$\" & $BX$41 & \"$\" & $DO49 & \":$\" & $BX$41 & \"$\" & $DP49) <>\"\"),INDIRECT(\"WP!$K\" & $DO49 & \":$K\" & $DP49),INDIRECT(\"WP!$\" & $BX$41 & \"$\" & $DO49 & \":$\" & $BX$41 & \"$\" & $DP49))/SUMPRODUCT(--(INDIRECT(\"WP!$C$\" & $DO49 & \":$C$\" & $DP49) =$C49),--(INDIRECT(\"WP!$\" & $BX$41 & \"$\" & $DO49 & \":$\" & $BX$41 & \"$\" & $DP49) <>\"\"),INDIRECT(\"WP!$K\" & $DO49 & \":$K\" & $DP49)),\"\"),\"\"),\"\")","v":""},{"$f":"IFERROR(IF(WpAreaC_Sub2_exist,IF(SUMPRODUCT(--(INDIRECT(\"WP!$C$\" & $DO49 & \":$C$\" & $DP49)=$C49),--(INDIRECT(\"WP!$B\" & $DO49 & \":$B\" & $DP49)=\"Y\"),--(INDIRECT(\"WP!$\" & $BX$41 & \"$\" & $DO49 & \":$\" & $BX$41 & \"$\" & $DP49)=1),--(INDIRECT(\"WP!$K\" & $DO49 & \":$K\" & $DP49)>0))<>0,SUMPRODUCT(--(INDIRECT(\"WP!$C$\" & $DO49 & \":$C$\" & $DP49)=$C49),--(INDIRECT(\"WP!$B\" & $DO49 & \":$B\" & $DP49)=\"Y\"),--(INDIRECT(\"WP!$\" & $BX$41 & \"$\" & $DO49 & \":$\" & $BX$41 & \"$\" & $DP49)=1),INDIRECT(\"WP!$K\" & $DO49 & \":$K\" & $DP49)),IF(BZ49<>\"\",0,\"\")),\"\"),\"\")","v":""},{"$f":"IFERROR(IF(WpAreaC_Sub2_exist,IF(SUMPRODUCT(--(INDIRECT(\"WP!$C$\" & $DO49 & \":$C$\" & $DP49)=$C49),--(INDIRECT(\"WP!$B\" & $DO49 & \":$B\" & $DP49)=\"Y\"),--(INDIRECT(\"WP!$\" & $BX$41 & \"$\" & $DO49 & \":$\" & $BX$41 & \"$\" & $DP49)<>\"\"),--(INDIRECT(\"WP!$K\" & $DO49 & \":$K\" & $DP49)>0))<>0,SUMPRODUCT(--(INDIRECT(\"WP!$C$\" & $DO49 & \":$C$\" & $DP49)=$C49),--(INDIRECT(\"WP!$B\" & $DO49 & \":$B\" & $DP49)=\"Y\"),--(INDIRECT(\"WP!$\" & $BX$41 & \"$\" & $DO49 & \":$\" & $BX$41 & \"$\" & $DP49)<>\"\"),INDIRECT(\"WP!$K\" & $DO49 & \":$K\" & $DP49)),\"\"),\"\"),\"\")","v":""},{"$f":"IFERROR(IF(WpAreaC_Sub3_exist,F(SUMPRODUCT(--(INDIRECT(\"WP!$C$\" & $DO49 & \":$C$\" & $DP49) =$C49),--(INDIRECT(\"WP!$\" & $CA$41 & \"$\" & $DO49 & \":$\" & $CA$41 & \"$\" & $DP49) <>\"\"),--(INDIRECT(\"WP!$K$\" & $DO49 & \":$K$\" & $DP49)>0))>0,SUMPRODUCT(--(INDIRECT(\"WP!$C$\" & $DO49 & \":$C$\" & $DP49) =$C49),--(INDIRECT(\"WP!$\" & $CA$41 & \"$\" & $DO49 & \":$\" & $CA$41 & \"$\" & $DP49) <>\"\"),INDIRECT(\"WP!$K\" & $DO49 & \":$K\" & $DP49),INDIRECT(\"WP!$\" & $CA$41 & \"$\" & $DO49 & \":$\" & $CA$41 & \"$\" & $DP49))/SUMPRODUCT(--(INDIRECT(\"WP!$C$\" & $DO49 & \":$C$\" & $DP49) =$C49),--(INDIRECT(\"WP!$\" & $CA$41 & \"$\" & $DO49 & \":$\" & $CA$41 & \"$\" & $DP49) <>\"\"),INDIRECT(\"WP!$K\" & $DO49 & \":$K\" & $DP49)),\"\"),\"\"),\"\")","v":""},{"$f":"IFERROR(IF(WpAreaC_Sub3_exist,IF(SUMPRODUCT(--(INDIRECT(\"WP!$C$\" & $DO49 & \":$C$\" & $DP49)=$C49),--(INDIRECT(\"WP!$B\" & $DO49 & \":$B\" & $DP49)=\"Y\"),--(INDIRECT(\"WP!$\" & $CA$41 & \"$\" & $DO49 & \":$\" & $CA$41 & \"$\" & $DP49)=1),--(INDIRECT(\"WP!$K\" & $DO49 & \":$K\" & $DP49)>0))<>0,SUMPRODUCT(--(INDIRECT(\"WP!$C$\" & $DO49 & \":$C$\" & $DP49)=$C49),--(INDIRECT(\"WP!$B\" & $DO49 & \":$B\" & $DP49)=\"Y\"),--(INDIRECT(\"WP!$\" & $CA$41 & \"$\" & $DO49 & \":$\" & $CA$41 & \"$\" & $DP49)=1),INDIRECT(\"WP!$K\" & $DO49 & \":$K\" & $DP49)),IF(CC49<>\"\",0,\"\")),\"\"),\"\")","v":""},{"$f":"IFERROR(IF(WpAreaC_Sub3_exist,IF(SUMPRODUCT(--(INDIRECT(\"WP!$C$\" & $DO49 & \":$C$\" & $DP49)=$C49),--(INDIRECT(\"WP!$B\" & $DO49 & \":$B\" & $DP49)=\"Y\"),--(INDIRECT(\"WP!$\" & $CA$41 & \"$\" & $DO49 & \":$\" & $CA$41 & \"$\" & $DP49)<>\"\"),--(INDIRECT(\"WP!$K\" & $DO49 & \":$K\" & $DP49)>0))<>0,SUMPRODUCT(--(INDIRECT(\"WP!$C$\" & $DO49 & \":$C$\" & $DP49)=$C49),--(INDIRECT(\"WP!$B\" & $DO49 & \":$B\" & $DP49)=\"Y\"),--(INDIRECT(\"WP!$\" & $CA$41 & \"$\" & $DO49 & \":$\" & $CA$41 & \"$\" & $DP49)<>\"\"),INDIRECT(\"WP!$K\" & $DO49 & \":$K\" & $DP49)),\"\"),\"\"),\"\")","v":""},null,null,null,null,"","","","","","","","","","","","",null,"","","","","","","","","",null,"","","","","","","","","",null,{"$f":"MIN(IF(WP!$C$12:$C$53=$C49,ROW(WP!$C$12:$C$53),\"\"))","v":46},{"$f":"MAX(IF(WP!$C$12:$C$53=$C49,ROW(WP!$C$12:$C$53),\"\"))","v":46}]
[null,"LTE RAN and CN protocols"]
[null,"Protocol Test Cases","36.523-1",{"$f":"getProgress(AX51,CH51,\"%\",1,1)","v":"0%"},{"$f":"getProgress(AY51,CI51,,,1)","v":""},{"$f":"getProgress(AZ51,CJ51,,,1)","v":""},null,{"$f":"getProgress(BA51,CK51,\"%\",1,1,WpAreaA_Sub1_exist)","v":"0%"},{"$f":"getProgress(BB51,CL51,,,1,WpAreaA_Sub1_exist)","v":""},{"$f":"getProgress(BC51,CM51,,,1,WpAreaA_Sub1_exist)","v":""},{"$f":"getProgress(BD51,CN51,\"%\",1,1,WpAreaA_Sub2_exist)","v":""},{"$f":"getProgress(BE51,CO51,,,1,WpAreaA_Sub2_exist)","v":""},{"$f":"getProgress(BF51,CP51,,,1,WpAreaA_Sub2_exist)","v":""},{"$f":"getProgress(BG51,CQ51,\"%\",1,1,WpAreaA_Sub3_exist)","v":""},{"$f":"getProgress(BH51,CR51,,,1,WpAreaA_Sub3_exist)","v":""},{"$f":"getProgress(BI51,CS51,,,1,WpAreaA_Sub3_exist)","v":""},null,{"$f":"getProgress(BK51,CU51,\"%\",1,1,WpAreaB_Sub1_exist)","v":""},{"$f":"getProgress(BL51,CV51,,,1,WpAreaB_Sub1_exist)","v":""},{"$f":"getProgress(BM51,CW51,,,1,WpAreaB_Sub1_exist)","v":""},{"$f":"getProgress(BN51,CX51,\"%\",1,1,WpAreaB_Sub2_exist)","v":""},{"$f":"getProgress(BO51,CY51,,,1,WpAreaB_Sub2_exist)","v":""},{"$f":"getProgress(BP51,CZ51,,,1,WpAreaB_Sub2_exist)","v":""},{"$f":"getProgress(BQ51,DA51,\"%\",1,1,WpAreaB_Sub3_exist)","v":""},{"$f":"getProgress(BR51,DB51,,,1,WpAreaB_Sub3_exist)","v":""},{"$f":"getProgress(BS51,DC51,,,1,WpAreaB_Sub3_exist)","v":""},null,{"$f":"getProgress(BU51,DE51,\"%\",1,1,WpAreaC_Sub1_exist)","v":""},{"$f":"getProgress(BV51,DF51,,,1,WpAreaC_Sub1_exist)","v":""},{"$f":"getProgress(BW51,DG51,,,1,WpAreaC_Sub1_exist)","v":""},{"$f":"getProgress(BX51,DH51,\"%\",1,1,WpAreaC_Sub2_exist)","v":""},{"$f":"getProgress(BY51,DI51,,,1,WpAreaC_Sub2_exist)","v":""},{"$f":"getProgress(BZ51,DJ51,,,1,WpAreaC_Sub2_exist)","v":""},{"$f":"getProgress(CA51,DK51,\"%\",1,1,WpAreaC_Sub3_exist)","v":""},{"$f":"getProgress(CB51,DL51,,,1,WpAreaC_Sub3_exist)","v":""},{"$f":"getProgress(CC51,DM51,,,1,WpAreaC_Sub3_exist)","v":""},null,null,null,null,null,null,null,null,null,null,null,null,null,{"$f":"IFERROR((IF(WpAreaA_exist,IF(BA51<>\"\",BA51*WP!$AB$9,0)+IF(BD51<>\"\",BD51*WP!$AC$9,0)+IF(BG51<>\"\",BG51*WP!$AD$9,0),0)+IF(WpAreaB_exist,IF(BK51<>\"\",BK51*WP!$AE$10)+IF(BN51<>\"\",BN51*WP!$AF$10,0)+IF(BQ51<>\"\",BQ51*WP!$AG$10,0),0)+IF(WpAreaC_exist,IF(BU51<>\"\",BU51*WP!$AH$10)+IF(BX51<>\"\",BX51*WP!$AI$10,0)+IF(CA51<>\"\",CA51*WP!$AJ$10,0),0))/(IF(WpAreaA_exist,IF(BA51<>\"\",WP!$AB$9,0)+IF(BD51<>\"\",WP!$AC$9,0)+IF(BG51<>\"\",WP!$AD$9,0),0)+IF(WpAreaB_exist,IF(BK51<>\"\",WP!$AE$10,0)+IF(BN51<>\"\",WP!$AF$10,0)+IF(BQ51<>\"\",WP!$AG$10,0),0)+ IF(WpAreaC_exist,IF(BU51<>\"\",WP!$AH$10,0)+IF(BX51<>\"\",WP!$AI$10,0)+IF(CA51<>\"\",WP!$AJ$10,0),0)),\"\")","v":0},{"$f":"IFERROR(IF(SUMPRODUCT(--(INDIRECT(\"WP!$C$\" & $DO51 & \":$C$\" & $DP51)=$C51),--(INDIRECT(\"WP!$B$\" & $DO51 & \":$B$\" & $DP51)=\"Y\"),--(INDIRECT(\"WP!$\" & $AX$41 & \"$\" & $DO51 & \":$\" & $AX$41 & \"$\" & $DP51)=1),--(INDIRECT(\"WP!$K$\" & $DO51 & \":$K$\" & $DP51)>0))<>0,SUMPRODUCT(--(INDIRECT(\"WP!$C$\" & $DO51 & \":$C$\" & $DP51)=$C51),--(INDIRECT(\"WP!$B$\" & $DO51 & \":$B$\" & $DP51)=\"Y\"),--(INDIRECT(\"WP!$\" & $AX$41 & \"$\" & $DO51 & \":$\" & $AX$41 & \"$\" & $DP51)=1),INDIRECT(\"WP!$K$\" & $DO51 & \":$K$\" & $DP51)),IF(AZ51<>\"\",0,\"\")),\"\")","v":""},{"$f":"IFERROR(IF(SUMPRODUCT(--(INDIRECT(\"WP!$C$\" & $DO51 & \":$C$\" & $DP51)=$C51),--(INDIRECT(\"WP!$B\" & $DO51 & \":$B\" & $DP51)=\"Y\"),--(INDIRECT(\"WP!$\" & $AX$41 & \"$\" & $DO51 & \":$\" & $AX$41 & \"$\" & $DP51)<>\"\"),--(INDIRECT(\"WP!$K\" & $DO51 & \":$K\" & $DP51)>0))<>0,SUMPRODUCT(--(INDIRECT(\"WP!$C$\" & $DO51 & \":$C$\" & $DP51)=$C51),--(INDIRECT(\"WP!$B\" & $DO51 & \":$B\" & $DP51)=\"Y\"),--(INDIRECT(\"WP!$\" & $AX$41 & \"$\" &  $DO51 & \":$\" & $AX$41 & \"$\" & $DP51)<>\"\"),INDIRECT(\"WP!$K\" & $DO51 & \":$K\" & $DP51)),\"\"),\"\")","v":""},{"$f":"IFERROR(IF(WpAreaA_Sub1_exist,IF(SUMPRODUCT(--(INDIRECT(\"WP!$C$\" & $DO51 & \":$C$\" & $DP51) =$C51),--(INDIRECT(\"WP!$\" & $BA$41 & \"$\" & $DO51 & \":$\" & $BA$41 & \"$\" & $DP51) <>\"\"),--(INDIRECT(\"WP!$K$\" & $DO51 & \":$K$\" & $DP51)>0))>0,SUMPRODUCT(--(INDIRECT(\"WP!$C$\" & $DO51 & \":$C$\" & $DP51) =$C51),--(INDIRECT(\"WP!$\" & $BA$41 & \"$\" & $DO51 & \":$\" & $BA$41 & \"$\" & $DP51) <>\"\"),INDIRECT(\"WP!$K$\" & $DO51 & \":$K$\" & $DP51),INDIRECT(\"WP!$\" & $BA$41 & \"$\" & $DO51 & \":$\" & $BA$41 & \"$\" & $DP51))/SUMPRODUCT(--(INDIRECT(\"WP!$C$\" & $DO51 & \":$C$\" & $DP51) =$C51),--(INDIRECT(\"WP!$\" & $BA$41 & \"$\" & $DO51 & \":$\" & $BA$41 & \"$\" & $DP51) <>\"\"),INDIRECT(\"WP!$K$\" & $DO51 & \":$K$\" & $DP51)),\"\"),\"\"),\"\")","v":0},{"$f":"IFERROR(IF(WpAreaA_Sub1_exist,IF(SUMPRODUCT(--(INDIRECT(\"WP!$C$\" & $DO51 & \":$C$\" & $DP51)=$C51),--(INDIRECT(\"WP!$B$\" & $DO51 & \":$B$\" & $DP51)=\"Y\"),--(INDIRECT(\"WP!$\" & $BA$41 & \"$\" & $DO51 & \":$\" & $BA$41 & \"$\" & $DP51)=1),--(INDIRECT(\"WP!$K$\" & $DO51 & \":$K$\" & $DP51)>0))<>0,SUMPRODUCT(--(INDIRECT(\"WP!$C$\" & $DO51 & \":$C$\" & $DP51)=$C51),--(INDIRECT(\"WP!$B$\" & $DO51 & \":$B$\" & $DP51)=\"Y\"),--(INDIRECT(\"WP!$\" & $BA$41 & \"$\" & $DO51 & \":$\" & $BA$41 & \"$\" & $DP51)=1),INDIRECT(\"WP!$K$\" & $DO51 & \":$K$\" & $DP51)),IF(BC51<>\"\",0,\"\")),\"\"),\"\")","v":""},{"$f":"IFERROR(IF(WpAreaA_Sub1_exist,IF(SUMPRODUCT(--(INDIRECT(\"WP!$C$\" & $DO51 & \":$C$\" & $DP51)=$C51),--(INDIRECT(\"WP!$B\" & $DO51 & \":$B\" & $DP51)=\"Y\"),--(INDIRECT(\"WP!$\" & $BA$41 & \"$\" & $DO51 & \":$\" & $BA$41 & \"$\" & $DP51)<>\"\"),--(INDIRECT(\"WP!$K\" & $DO51 & \":$K\" & $DP51)>0))<>0,SUMPRODUCT(--(INDIRECT(\"WP!$C$\" & $DO51 & \":$C$\" & $DP51)=$C51),--(INDIRECT(\"WP!$B\" & $DO51 & \":$B\" & $DP51)=\"Y\"),--(INDIRECT(\"WP!$\" & $BA$41 & \"$\" &  $DO51 & \":$\" & $BA$41 & \"$\" & $DP51)<>\"\"),INDIRECT(\"WP!$K\" & $DO51 & \":$K\" & $DP51)),\"\"),\"\"),\"\")","v":""},{"$f":"IFERROR(IF(WpAreaA_Sub2_exist,IF(SUMPRODUCT(--(INDIRECT(\"WP!$C$\" & $DO51 & \":$C$\" & $DP51) =$C51),--(INDIRECT(\"WP!$\" & $BD$41 & \"$\" & $DO51 & \":$\" & $BD$41 & \"$\" & $DP51) <>\"\"),--(INDIRECT(\"WP!$K$\" & $DO51 & \":$K$\" & $DP51)>0))>0,SUMPRODUCT(--(INDIRECT(\"WP!$C$\" & $DO51 & \":$C$\" & $DP51) =$C51),--(INDIRECT(\"WP!$\" & $BD$41 & \"$\" & $DO51 & \":$\" & $BD$41 & \"$\" & $DP51) <>\"\"),INDIRECT(\"WP!$K\" & $DO51 & \":$K\" & $DP51),INDIRECT(\"WP!$\" & $BD$41 & \"$\" & $DO51 & \":$\" & $BD$41 & \"$\" & $DP51))/SUMPRODUCT(--(INDIRECT(\"WP!$C$\" & $DO51 & \":$C$\" & $DP51) =$C51),--(INDIRECT(\"WP!$\" & $BD$41 & \"$\" & $DO51 & \":$\" & $BD$41 & \"$\" & $DP51) <>\"\"),INDIRECT(\"WP!$K\" & $DO51 & \":$K\" & $DP51)),\"\"),\"\"),\"\")","v":""},{"$f":"IFERROR(IF(WpAreaA_Sub2_exist,IF(SUMPRODUCT(--(INDIRECT(\"WP!$C$\" & $DO51 & \":$C$\" & $DP51)=$C51),--(INDIRECT(\"WP!$B\" & $DO51 & \":$B\" & $DP51)=\"Y\"),--(INDIRECT(\"WP!$\" & $BD$41 & \"$\" & $DO51 & \":$\" & $BD$41 & \"$\" & $DP51)=1),--(INDIRECT(\"WP!$K\" & $DO51 & \":$K\" & $DP51)>0))<>0,SUMPRODUCT(--(INDIRECT(\"WP!$C$\" & $DO51 & \":$C$\" & $DP51)=$C51),--(INDIRECT(\"WP!$B\" & $DO51 & \":$B\" & $DP51)=\"Y\"),--(INDIRECT(\"WP!$\" & $BD$41 & \"$\" & $DO51 & \":$\" & $BD$41 & \"$\" & $DP51)=1),INDIRECT(\"WP!$K\" & $DO51 & \":$K\" & $DP51)),IF(BF51<>\"\",0,\"\")),\"\"),\"\")","v":""},{"$f":"IFERROR(IF(WpAreaA_Sub2_exist,IF(SUMPRODUCT(--(INDIRECT(\"WP!$C$\" & $DO51 & \":$C$\" & $DP51)=$C51),--(INDIRECT(\"WP!$B\" & $DO51 & \":$B\" & $DP51)=\"Y\"),--(INDIRECT(\"WP!$\" & $BD$41 & \"$\" & $DO51 & \":$\" & $BD$41 & \"$\" & $DP51)<>\"\"),--(INDIRECT(\"WP!$K\" & $DO51 & \":$K\" & $DP51)>0))<>0,SUMPRODUCT(--(INDIRECT(\"WP!$C$\" & $DO51 & \":$C$\" & $DP51)=$C51),--(INDIRECT(\"WP!$B\" & $DO51 & \":$B\" & $DP51)=\"Y\"),--(INDIRECT(\"WP!$\" & $BD$41 & \"$\" & $DO51 & \":$\" & $BD$41 & \"$\" & $DP51)<>\"\"),INDIRECT(\"WP!$K\" & $DO51 & \":$K\" & $DP51)),\"\"),\"\"),\"\")","v":""},{"$f":"IFERROR(IF(WpAreaA_Sub3_exist,IF(SUMPRODUCT(--(INDIRECT(\"WP!$C$\" & $DO51 & \":$C$\" & $DP51) =$C51),--(INDIRECT(\"WP!$\" & $BG$41 & \"$\" & $DO51 & \":$\" & $BG$41 & \"$\" & $DP51) <>\"\"),--(INDIRECT(\"WP!$K$\" & $DO51 & \":$K$\" & $DP51)>0))>0,SUMPRODUCT(--(INDIRECT(\"WP!$C$\" & $DO51 & \":$C$\" & $DP51) =$C51),--(INDIRECT(\"WP!$\" & $BG$41 & \"$\" & $DO51 & \":$\" & $BG$41 & \"$\" & $DP51) <>\"\"),INDIRECT(\"WP!$K\" & $DO51 & \":$K\" & $DP51),INDIRECT(\"WP!$\" & $BG$41 & \"$\" & $DO51 & \":$\" & $BG$41 & \"$\" & $DP51))/SUMPRODUCT(--(INDIRECT(\"WP!$C$\" & $DO51 & \":$C$\" & $DP51) =$C51),--(INDIRECT(\"WP!$\" & $BG$41 & \"$\" & $DO51 & \":$\" & $BG$41 & \"$\" & $DP51) <>\"\"),INDIRECT(\"WP!$K\" & $DO51 & \":$K\" & $DP51)),\"\"),\"\"),\"\")","v":""},{"$f":"IFERROR(IF(WpAreaA_Sub3_exist,IF(SUMPRODUCT(--(INDIRECT(\"WP!$C$\" & $DO51 & \":$C$\" & $DP51)=$C51),--(INDIRECT(\"WP!$B\" & $DO51 & \":$B\" & $DP51)=\"Y\"),--(INDIRECT(\"WP!$\" & $BG$41 & \"$\" & $DO51 & \":$\" & $BG$41 & \"$\" & $DP51)=1),--(INDIRECT(\"WP!$K\" & $DO51 & \":$K\" & $DP51)>0))<>0,SUMPRODUCT(--(INDIRECT(\"WP!$C$\" & $DO51 & \":$C$\" & $DP51)=$C51),--(INDIRECT(\"WP!$B\" & $DO51 & \":$B\" & $DP51)=\"Y\"),--(INDIRECT(\"WP!$\" & $BG$41 & \"$\" & $DO51 & \":$\" & $BG$41 & \"$\" & $DP51)=1),INDIRECT(\"WP!$K\" & $DO51 & \":$K\" & $DP51)),IF(BI51<>\"\",0,\"\")),\"\"),\"\")","v":""},{"$f":"IFERROR(IF(WpAreaA_Sub3_exist,IF(SUMPRODUCT(--(INDIRECT(\"WP!$C$\" & $DO51 & \":$C$\" & $DP51)=$C51),--(INDIRECT(\"WP!$B\" & $DO51 & \":$B\" & $DP51)=\"Y\"),--(INDIRECT(\"WP!$\" & $BG$41 & \"$\" & $DO51 & \":$\" & $BG$41 & \"$\" & $DP51)<>\"\"),--(INDIRECT(\"WP!$K\" & $DO51 & \":$K\" & $DP51)>0))<>0,SUMPRODUCT(--(INDIRECT(\"WP!$C$\" & $DO51 & \":$C$\" & $DP51)=$C51),--(INDIRECT(\"WP!$B\" & $DO51 & \":$B\" & $DP51)=\"Y\"),--(INDIRECT(\"WP!$\" & $BG$41 & \"$\" & $DO51 & \":$\" & $BG$41 & \"$\" & $DP51)<>\"\"),INDIRECT(\"WP!$K\" & $DO51 & \":$K\" & $DP51)),\"\"),\"\"),\"\")","v":""},null,{"$f":"IFERROR(IF(WpAreaB_Sub1_exist,IF(SUMPRODUCT(--(INDIRECT(\"WP!$C$\" & $DO51 & \":$C$\" & $DP51) =$C51),--(INDIRECT(\"WP!$\" & $BK$41 & \"$\" & $DO51 & \":$\" & $BK$41 & \"$\" & $DP51) <>\"\"),--(INDIRECT(\"WP!$K$\" & $DO51 & \":$K$\" & $DP51)>0))>0,SUMPRODUCT(--(INDIRECT(\"WP!$C$\" & $DO51 & \":$C$\" & $DP51) =$C51),--(INDIRECT(\"WP!$\" & $BK$41 & \"$\" & $DO51 & \":$\" & $BK$41 & \"$\" & $DP51) <>\"\"),INDIRECT(\"WP!$K\" & $DO51 & \":$K\" & $DP51),INDIRECT(\"WP!$\" & $BK$41 & \"$\" & $DO51 & \":$\" & $BK$41 & \"$\" & $DP51))/SUMPRODUCT(--(INDIRECT(\"WP!$C$\" & $DO51 & \":$C$\" & $DP51) =$C51),--(INDIRECT(\"WP!$\" & $BK$41 & \"$\" & $DO51 & \":$\" & $BK$41 & \"$\" & $DP51) <>\"\"),INDIRECT(\"WP!$K\" & $DO51 & \":$K\" & $DP51)),\"\"),\"\"),\"\")","v":""},{"$f":"IFERROR(IF(WpAreaB_Sub1_exist,IF(SUMPRODUCT(--(INDIRECT(\"WP!$C$\" & $DO51 & \":$C$\" & $DP51)=$C51),--(INDIRECT(\"WP!$B\" & $DO51 & \":$B\" & $DP51)=\"Y\"),--(INDIRECT(\"WP!$\" & $BK$41 & \"$\" & $DO51 & \":$\" & $BK$41 & \"$\" & $DP51)=1),--(INDIRECT(\"WP!$K\" & $DO51 & \":$K\" & $DP51)>0))<>0,SUMPRODUCT(--(INDIRECT(\"WP!$C$\" & $DO51 & \":$C$\" & $DP51)=$C51),--(INDIRECT(\"WP!$B\" & $DO51 & \":$B\" & $DP51)=\"Y\"),--(INDIRECT(\"WP!$\" & $BK$41 & \"$\" & $DO51 & \":$\" & $BK$41 & \"$\" & $DP51)=1),INDIRECT(\"WP!$K\" & $DO51 & \":$K\" & $DP51)),IF(BM51<>\"\",0,\"\")),\"\"),\"\")","v":""},{"$f":"IFERROR(IF(WpAreaB_Sub1_exist,IF(SUMPRODUCT(--(INDIRECT(\"WP!$C$\" & $DO51 & \":$C$\" & $DP51)=$C51),--(INDIRECT(\"WP!$B\" & $DO51 & \":$B\" & $DP51)=\"Y\"),--(INDIRECT(\"WP!$\" & $BK$41 & \"$\" & $DO51 & \":$\" & $BK$41 & \"$\" & $DP51)<>\"\"),--(INDIRECT(\"WP!$K\" & $DO51 & \":$K\" & $DP51)>0))<>0,SUMPRODUCT(--(INDIRECT(\"WP!$C$\" & $DO51 & \":$C$\" & $DP51)=$C51),--(INDIRECT(\"WP!$B\" & $DO51 & \":$B\" & $DP51)=\"Y\"),--(INDIRECT(\"WP!$\" & $BK$41 & \"$\" & $DO51 & \":$\" & $BK$41 & \"$\" & $DP51)<>\"\"),INDIRECT(\"WP!$K\" & $DO51 & \":$K\" & $DP51)),\"\"),\"\"),\"\")","v":""},{"$f":"IFERROR(IF(WpAreaB_Sub2_exist,IF(SUMPRODUCT(--(INDIRECT(\"WP!$C$\" & $DO51 & \":$C$\" & $DP51) =$C51),--(INDIRECT(\"WP!$\" & $BN$41 & \"$\" & $DO51 & \":$\" & $BN$41 & \"$\" & $DP51) <>\"\"),--(INDIRECT(\"WP!$K$\" & $DO51 & \":$K$\" & $DP51)>0))>0,SUMPRODUCT(--(INDIRECT(\"WP!$C$\" & $DO51 & \":$C$\" & $DP51) =$C51),--(INDIRECT(\"WP!$\" & $BN$41 & \"$\" & $DO51 & \":$\" & $BN$41 & \"$\" & $DP51) <>\"\"),INDIRECT(\"WP!$K\" & $DO51 & \":$K\" & $DP51),INDIRECT(\"WP!$\" & $BN$41 & \"$\" & $DO51 & \":$\" & $BN$41 & \"$\" & $DP51))/SUMPRODUCT(--(INDIRECT(\"WP!$C$\" & $DO51 & \":$C$\" & $DP51) =$C51),--(INDIRECT(\"WP!$\" & $BN$41 & \"$\" & $DO51 & \":$\" & $BN$41 & \"$\" & $DP51) <>\"\"),INDIRECT(\"WP!$K\" & $DO51 & \":$K\" & $DP51)),\"\"),\"\"),\"\")","v":""},{"$f":"IFERROR(IF(WpAreaB_Sub2_exist,IF(SUMPRODUCT(--(INDIRECT(\"WP!$C$\" & $DO51 & \":$C$\" & $DP51)=$C51),--(INDIRECT(\"WP!$B\" & $DO51 & \":$B\" & $DP51)=\"Y\"),--(INDIRECT(\"WP!$\" & $BN$41 & \"$\" & $DO51 & \":$\" & $BN$41 & \"$\" & $DP51)=1),--(INDIRECT(\"WP!$K\" & $DO51 & \":$K\" & $DP51)>0))<>0,SUMPRODUCT(--(INDIRECT(\"WP!$C$\" & $DO51 & \":$C$\" & $DP51)=$C51),--(INDIRECT(\"WP!$B\" & $DO51 & \":$B\" & $DP51)=\"Y\"),--(INDIRECT(\"WP!$\" & $BN$41 & \"$\" & $DO51 & \":$\" & $BN$41 & \"$\" & $DP51)=1),INDIRECT(\"WP!$K\" & $DO51 & \":$K\" & $DP51)),IF(BP51<>\"\",0,\"\")),\"\"),\"\")","v":""},{"$f":"IFERROR(IF(WpAreaB_Sub2_exist,IF(SUMPRODUCT(--(INDIRECT(\"WP!$C$\" & $DO51 & \":$C$\" & $DP51)=$C51),--(INDIRECT(\"WP!$B\" & $DO51 & \":$B\" & $DP51)=\"Y\"),--(INDIRECT(\"WP!$\" & $BN$41 & \"$\" & $DO51 & \":$\" & $BN$41 & \"$\" & $DP51)<>\"\"),--(INDIRECT(\"WP!$K\" & $DO51 & \":$K\" & $DP51)>0))<>0,SUMPRODUCT(--(INDIRECT(\"WP!$C$\" & $DO51 & \":$C$\" & $DP51)=$C51),--(INDIRECT(\"WP!$B\" & $DO51 & \":$B\" & $DP51)=\"Y\"),--(INDIRECT(\"WP!$\" & $BN$41 & \"$\" & $DO51 & \":$\" & $BN$41 & \"$\" & $DP51)<>\"\"),INDIRECT(\"WP!$K\" & $DO51 & \":$K\" & $DP51)),\"\"),\"\"),\"\")","v":""},{"$f":"IFERROR(IF(WpAreaB_Sub3_exist,IF(SUMPRODUCT(--(INDIRECT(\"WP!$C$\" & $DO51 & \":$C$\" & $DP51) =$C51),--(INDIRECT(\"WP!$\" & $BQ$41 & \"$\" & $DO51 & \":$\" & $BQ$41 & \"$\" & $DP51) <>\"\"),--(INDIRECT(\"WP!$K$\" & $DO51 & \":$K$\" & $DP51)>0))>0,SUMPRODUCT(--(INDIRECT(\"WP!$C$\" & $DO51 & \":$C$\" & $DP51) =$C51),--(INDIRECT(\"WP!$\" & $BQ$41 & \"$\" & $DO51 & \":$\" & $BQ$41 & \"$\" & $DP51) <>\"\"),INDIRECT(\"WP!$K\" & $DO51 & \":$K\" & $DP51),INDIRECT(\"WP!$\" & $BQ$41 & \"$\" & $DO51 & \":$\" & $BQ$41 & \"$\" & $DP51))/SUMPRODUCT(--(INDIRECT(\"WP!$C$\" & $DO51 & \":$C$\" & $DP51) =$C51),--(INDIRECT(\"WP!$\" & $BQ$41 & \"$\" & $DO51 & \":$\" & $BQ$41 & \"$\" & $DP51) <>\"\"),INDIRECT(\"WP!$K\" & $DO51 & \":$K\" & $DP51)),\"\"),\"\"),\"\")","v":""},{"$f":"IFERROR(IF(WpAreaB_Sub3_exist,IF(SUMPRODUCT(--(INDIRECT(\"WP!$C$\" & $DO51 & \":$C$\" & $DP51)=$C51),--(INDIRECT(\"WP!$B\" & $DO51 & \":$B\" & $DP51)=\"Y\"),--(INDIRECT(\"WP!$\" & $BQ$41 & \"$\" & $DO51 & \":$\" & $BQ$41 & \"$\" & $DP51)=1),--(INDIRECT(\"WP!$K\" & $DO51 & \":$K\" & $DP51)>0))<>0,SUMPRODUCT(--(INDIRECT(\"WP!$C$\" & $DO51 & \":$C$\" & $DP51)=$C51),--(INDIRECT(\"WP!$B\" & $DO51 & \":$B\" & $DP51)=\"Y\"),--(INDIRECT(\"WP!$\" & $BQ$41 & \"$\" & $DO51 & \":$\" & $BQ$41 & \"$\" & $DP51)=1),INDIRECT(\"WP!$K\" & $DO51 & \":$K\" & $DP51)),IF(BS51<>\"\",0,\"\")),\"\"),\"\")","v":""},{"$f":"IFERROR(IF(WpAreaB_Sub3_exist,IF(SUMPRODUCT(--(INDIRECT(\"WP!$C$\" & $DO51 & \":$C$\" & $DP51)=$C51),--(INDIRECT(\"WP!$B\" & $DO51 & \":$B\" & $DP51)=\"Y\"),--(INDIRECT(\"WP!$\" & $BQ$41 & \"$\" & $DO51 & \":$\" & $BQ$41 & \"$\" & $DP51)<>\"\"),--(INDIRECT(\"WP!$K\" & $DO51 & \":$K\" & $DP51)>0))<>0,SUMPRODUCT(--(INDIRECT(\"WP!$C$\" & $DO51 & \":$C$\" & $DP51)=$C51),--(INDIRECT(\"WP!$B\" & $DO51 & \":$B\" & $DP51)=\"Y\"),--(INDIRECT(\"WP!$\" & $BQ$41 & \"$\" & $DO51 & \":$\" & $BQ$41 & \"$\" & $DP51)<>\"\"),INDIRECT(\"WP!$K\" & $DO51 & \":$K\" & $DP51)),\"\"),\"\"),\"\")","v":""},null,{"$f":"IFERROR(IF(WpAreaC_Sub1_exist,IF(SUMPRODUCT(--(INDIRECT(\"WP!$C$\" & $DO51 & \":$C$\" & $DP51) =$C51),--(INDIRECT(\"WP!$\" & $BU$41 & \"$\" & $DO51 & \":$\" & $BU$41 & \"$\" & $DP51) <>\"\"),--(INDIRECT(\"WP!$K$\" & $DO51 & \":$K$\" & $DP51)>0))>0,SUMPRODUCT(--(INDIRECT(\"WP!$C$\" & $DO51 & \":$C$\" & $DP51) =$C51),--(INDIRECT(\"WP!$\" & $BU$41 & \"$\" & $DO51 & \":$\" & $BU$41 & \"$\" & $DP51) <>\"\"),INDIRECT(\"WP!$K\" & $DO51 & \":$K\" & $DP51),INDIRECT(\"WP!$\" & $BU$41 & \"$\" & $DO51 & \":$\" & $BU$41 & \"$\" & $DP51))/SUMPRODUCT(--(INDIRECT(\"WP!$C$\" & $DO51 & \":$C$\" & $DP51) =$C51),--(INDIRECT(\"WP!$\" & $BU$41 & \"$\" & $DO51 & \":$\" & $BU$41 & \"$\" & $DP51) <>\"\"),INDIRECT(\"WP!$K\" & $DO51 & \":$K\" & $DP51)),\"\"),\"\"),\"\")","v":""},{"$f":"IFERROR(IF(WpAreaC_Sub1_exist,IF(SUMPRODUCT(--(INDIRECT(\"WP!$C$\" & $DO51 & \":$C$\" & $DP51)=$C51),--(INDIRECT(\"WP!$B\" & $DO51 & \":$B\" & $DP51)=\"Y\"),--(INDIRECT(\"WP!$\" & $BU$41 & \"$\" & $DO51 & \":$\" & $BU$41 & \"$\" & $DP51)=1),--(INDIRECT(\"WP!$K\" & $DO51 & \":$K\" & $DP51)>0))<>0,SUMPRODUCT(--(INDIRECT(\"WP!$C$\" & $DO51 & \":$C$\" & $DP51)=$C51),--(INDIRECT(\"WP!$B\" & $DO51 & \":$B\" & $DP51)=\"Y\"),--(INDIRECT(\"WP!$\" & $BU$41 & \"$\" & $DO51 & \":$\" & $BU$41 & \"$\" & $DP51)=1),INDIRECT(\"WP!$K\" & $DO51 & \":$K\" & $DP51)),IF(BW51<>\"\",0,\"\")),\"\"),\"\")","v":""},{"$f":"IFERROR(IF(WpAreaC_Sub1_exist,IF(SUMPRODUCT(--(INDIRECT(\"WP!$C$\" & $DO51 & \":$C$\" & $DP51)=$C51),--(INDIRECT(\"WP!$B\" & $DO51 & \":$B\" & $DP51)=\"Y\"),--(INDIRECT(\"WP!$\" & $BU$41 & \"$\" & $DO51 & \":$\" & $BU$41 & \"$\" & $DP51)<>\"\"),--(INDIRECT(\"WP!$K\" & $DO51 & \":$K\" & $DP51)>0))<>0,SUMPRODUCT(--(INDIRECT(\"WP!$C$\" & $DO51 & \":$C$\" & $DP51)=$C51),--(INDIRECT(\"WP!$B\" & $DO51 & \":$B\" & $DP51)=\"Y\"),--(INDIRECT(\"WP!$\" & $BU$41 & \"$\" & $DO51 & \":$\" & $BU$41 & \"$\" & $DP51)<>\"\"),INDIRECT(\"WP!$K\" & $DO51 & \":$K\" & $DP51)),\"\"),\"\"),\"\")","v":""},{"$f":"IFERROR(IF(WpAreaC_Sub2_exist,IF(SUMPRODUCT(--(INDIRECT(\"WP!$C$\" & $DO51 & \":$C$\" & $DP51) =$C51),--(INDIRECT(\"WP!$\" & $BX$41 & \"$\" & $DO51 & \":$\" & $BX$41 & \"$\" & $DP51) <>\"\"),--(INDIRECT(\"WP!$K$\" & $DO51 & \":$K$\" & $DP51)>0))>0,SUMPRODUCT(--(INDIRECT(\"WP!$C$\" & $DO51 & \":$C$\" & $DP51) =$C51),--(INDIRECT(\"WP!$\" & $BX$41 & \"$\" & $DO51 & \":$\" & $BX$41 & \"$\" & $DP51) <>\"\"),INDIRECT(\"WP!$K\" & $DO51 & \":$K\" & $DP51),INDIRECT(\"WP!$\" & $BX$41 & \"$\" & $DO51 & \":$\" & $BX$41 & \"$\" & $DP51))/SUMPRODUCT(--(INDIRECT(\"WP!$C$\" & $DO51 & \":$C$\" & $DP51) =$C51),--(INDIRECT(\"WP!$\" & $BX$41 & \"$\" & $DO51 & \":$\" & $BX$41 & \"$\" & $DP51) <>\"\"),INDIRECT(\"WP!$K\" & $DO51 & \":$K\" & $DP51)),\"\"),\"\"),\"\")","v":""},{"$f":"IFERROR(IF(WpAreaC_Sub2_exist,IF(SUMPRODUCT(--(INDIRECT(\"WP!$C$\" & $DO51 & \":$C$\" & $DP51)=$C51),--(INDIRECT(\"WP!$B\" & $DO51 & \":$B\" & $DP51)=\"Y\"),--(INDIRECT(\"WP!$\" & $BX$41 & \"$\" & $DO51 & \":$\" & $BX$41 & \"$\" & $DP51)=1),--(INDIRECT(\"WP!$K\" & $DO51 & \":$K\" & $DP51)>0))<>0,SUMPRODUCT(--(INDIRECT(\"WP!$C$\" & $DO51 & \":$C$\" & $DP51)=$C51),--(INDIRECT(\"WP!$B\" & $DO51 & \":$B\" & $DP51)=\"Y\"),--(INDIRECT(\"WP!$\" & $BX$41 & \"$\" & $DO51 & \":$\" & $BX$41 & \"$\" & $DP51)=1),INDIRECT(\"WP!$K\" & $DO51 & \":$K\" & $DP51)),IF(BZ51<>\"\",0,\"\")),\"\"),\"\")","v":""},{"$f":"IFERROR(IF(WpAreaC_Sub2_exist,IF(SUMPRODUCT(--(INDIRECT(\"WP!$C$\" & $DO51 & \":$C$\" & $DP51)=$C51),--(INDIRECT(\"WP!$B\" & $DO51 & \":$B\" & $DP51)=\"Y\"),--(INDIRECT(\"WP!$\" & $BX$41 & \"$\" & $DO51 & \":$\" & $BX$41 & \"$\" & $DP51)<>\"\"),--(INDIRECT(\"WP!$K\" & $DO51 & \":$K\" & $DP51)>0))<>0,SUMPRODUCT(--(INDIRECT(\"WP!$C$\" & $DO51 & \":$C$\" & $DP51)=$C51),--(INDIRECT(\"WP!$B\" & $DO51 & \":$B\" & $DP51)=\"Y\"),--(INDIRECT(\"WP!$\" & $BX$41 & \"$\" & $DO51 & \":$\" & $BX$41 & \"$\" & $DP51)<>\"\"),INDIRECT(\"WP!$K\" & $DO51 & \":$K\" & $DP51)),\"\"),\"\"),\"\")","v":""},{"$f":"IFERROR(IF(WpAreaC_Sub3_exist,F(SUMPRODUCT(--(INDIRECT(\"WP!$C$\" & $DO51 & \":$C$\" & $DP51) =$C51),--(INDIRECT(\"WP!$\" & $CA$41 & \"$\" & $DO51 & \":$\" & $CA$41 & \"$\" & $DP51) <>\"\"),--(INDIRECT(\"WP!$K$\" & $DO51 & \":$K$\" & $DP51)>0))>0,SUMPRODUCT(--(INDIRECT(\"WP!$C$\" & $DO51 & \":$C$\" & $DP51) =$C51),--(INDIRECT(\"WP!$\" & $CA$41 & \"$\" & $DO51 & \":$\" & $CA$41 & \"$\" & $DP51) <>\"\"),INDIRECT(\"WP!$K\" & $DO51 & \":$K\" & $DP51),INDIRECT(\"WP!$\" & $CA$41 & \"$\" & $DO51 & \":$\" & $CA$41 & \"$\" & $DP51))/SUMPRODUCT(--(INDIRECT(\"WP!$C$\" & $DO51 & \":$C$\" & $DP51) =$C51),--(INDIRECT(\"WP!$\" & $CA$41 & \"$\" & $DO51 & \":$\" & $CA$41 & \"$\" & $DP51) <>\"\"),INDIRECT(\"WP!$K\" & $DO51 & \":$K\" & $DP51)),\"\"),\"\"),\"\")","v":""},{"$f":"IFERROR(IF(WpAreaC_Sub3_exist,IF(SUMPRODUCT(--(INDIRECT(\"WP!$C$\" & $DO51 & \":$C$\" & $DP51)=$C51),--(INDIRECT(\"WP!$B\" & $DO51 & \":$B\" & $DP51)=\"Y\"),--(INDIRECT(\"WP!$\" & $CA$41 & \"$\" & $DO51 & \":$\" & $CA$41 & \"$\" & $DP51)=1),--(INDIRECT(\"WP!$K\" & $DO51 & \":$K\" & $DP51)>0))<>0,SUMPRODUCT(--(INDIRECT(\"WP!$C$\" & $DO51 & \":$C$\" & $DP51)=$C51),--(INDIRECT(\"WP!$B\" & $DO51 & \":$B\" & $DP51)=\"Y\"),--(INDIRECT(\"WP!$\" & $CA$41 & \"$\" & $DO51 & \":$\" & $CA$41 & \"$\" & $DP51)=1),INDIRECT(\"WP!$K\" & $DO51 & \":$K\" & $DP51)),IF(CC51<>\"\",0,\"\")),\"\"),\"\")","v":""},{"$f":"IFERROR(IF(WpAreaC_Sub3_exist,IF(SUMPRODUCT(--(INDIRECT(\"WP!$C$\" & $DO51 & \":$C$\" & $DP51)=$C51),--(INDIRECT(\"WP!$B\" & $DO51 & \":$B\" & $DP51)=\"Y\"),--(INDIRECT(\"WP!$\" & $CA$41 & \"$\" & $DO51 & \":$\" & $CA$41 & \"$\" & $DP51)<>\"\"),--(INDIRECT(\"WP!$K\" & $DO51 & \":$K\" & $DP51)>0))<>0,SUMPRODUCT(--(INDIRECT(\"WP!$C$\" & $DO51 & \":$C$\" & $DP51)=$C51),--(INDIRECT(\"WP!$B\" & $DO51 & \":$B\" & $DP51)=\"Y\"),--(INDIRECT(\"WP!$\" & $CA$41 & \"$\" & $DO51 & \":$\" & $CA$41 & \"$\" & $DP51)<>\"\"),INDIRECT(\"WP!$K\" & $DO51 & \":$K\" & $DP51)),\"\"),\"\"),\"\")","v":""},null,null,null,null,"","","","","","","","","","","","",null,"","","","","","","","","",null,"","","","","","","","","",null,{"$f":"MIN(IF(WP!$C$12:$C$53=$C51,ROW(WP!$C$12:$C$53),\"\"))","v":49},{"$f":"MAX(IF(WP!$C$12:$C$53=$C51,ROW(WP!$C$12:$C$53),\"\"))","v":49}]
[null,"Test suites (TTCN)","36.523-3",{"$f":"getProgress(AX52,CH52,\"%\",1,1)","v":"100%\n(+100%)"},{"$f":"getProgress(AY52,CI52,,,1)","v":""},{"$f":"getProgress(AZ52,CJ52,,,1)","v":""},null,{"$f":"getProgress(BA52,CK52,\"%\",1,1,WpAreaA_Sub1_exist)","v":"100%\n(+100%)"},{"$f":"getProgress(BB52,CL52,,,1,WpAreaA_Sub1_exist)","v":""},{"$f":"getProgress(BC52,CM52,,,1,WpAreaA_Sub1_exist)","v":""},{"$f":"getProgress(BD52,CN52,\"%\",1,1,WpAreaA_Sub2_exist)","v":""},{"$f":"getProgress(BE52,CO52,,,1,WpAreaA_Sub2_exist)","v":""},{"$f":"getProgress(BF52,CP52,,,1,WpAreaA_Sub2_exist)","v":""},{"$f":"getProgress(BG52,CQ52,\"%\",1,1,WpAreaA_Sub3_exist)","v":""},{"$f":"getProgress(BH52,CR52,,,1,WpAreaA_Sub3_exist)","v":""},{"$f":"getProgress(BI52,CS52,,,1,WpAreaA_Sub3_exist)","v":""},null,{"$f":"getProgress(BK52,CU52,\"%\",1,1,WpAreaB_Sub1_exist)","v":""},{"$f":"getProgress(BL52,CV52,,,1,WpAreaB_Sub1_exist)","v":""},{"$f":"getProgress(BM52,CW52,,,1,WpAreaB_Sub1_exist)","v":""},{"$f":"getProgress(BN52,CX52,\"%\",1,1,WpAreaB_Sub2_exist)","v":""},{"$f":"getProgress(BO52,CY52,,,1,WpAreaB_Sub2_exist)","v":""},{"$f":"getProgress(BP52,CZ52,,,1,WpAreaB_Sub2_exist)","v":""},{"$f":"getProgress(BQ52,DA52,\"%\",1,1,WpAreaB_Sub3_exist)","v":""},{"$f":"getProgress(BR52,DB52,,,1,WpAreaB_Sub3_exist)","v":""},{"$f":"getProgress(BS52,DC52,,,1,WpAreaB_Sub3_exist)","v":""},null,{"$f":"getProgress(BU52,DE52,\"%\",1,1,WpAreaC_Sub1_exist)","v":""},{"$f":"getProgress(BV52,DF52,,,1,WpAreaC_Sub1_exist)","v":""},{"$f":"getProgress(BW52,DG52,,,1,WpAreaC_Sub1_exist)","v":""},{"$f":"getProgress(BX52,DH52,\"%\",1,1,WpAreaC_Sub2_exist)","v":""},{"$f":"getProgress(BY52,DI52,,,1,WpAreaC_Sub2_exist)","v":""},{"$f":"getProgress(BZ52,DJ52,,,1,WpAreaC_Sub2_exist)","v":""},{"$f":"getProgress(CA52,DK52,\"%\",1,1,WpAreaC_Sub3_exist)","v":""},{"$f":"getProgress(CB52,DL52,,,1,WpAreaC_Sub3_exist)","v":""},{"$f":"getProgress(CC52,DM52,,,1,WpAreaC_Sub3_exist)","v":""},null,null,null,null,null,null,null,null,null,null,null,null,null,{"$f":"IFERROR((IF(WpAreaA_exist,IF(BA52<>\"\",BA52*WP!$AB$9,0)+IF(BD52<>\"\",BD52*WP!$AC$9,0)+IF(BG52<>\"\",BG52*WP!$AD$9,0),0)+IF(WpAreaB_exist,IF(BK52<>\"\",BK52*WP!$AE$10)+IF(BN52<>\"\",BN52*WP!$AF$10,0)+IF(BQ52<>\"\",BQ52*WP!$AG$10,0),0)+IF(WpAreaC_exist,IF(BU52<>\"\",BU52*WP!$AH$10)+IF(BX52<>\"\",BX52*WP!$AI$10,0)+IF(CA52<>\"\",CA52*WP!$AJ$10,0),0))/(IF(WpAreaA_exist,IF(BA52<>\"\",WP!$AB$9,0)+IF(BD52<>\"\",WP!$AC$9,0)+IF(BG52<>\"\",WP!$AD$9,0),0)+IF(WpAreaB_exist,IF(BK52<>\"\",WP!$AE$10,0)+IF(BN52<>\"\",WP!$AF$10,0)+IF(BQ52<>\"\",WP!$AG$10,0),0)+ IF(WpAreaC_exist,IF(BU52<>\"\",WP!$AH$10,0)+IF(BX52<>\"\",WP!$AI$10,0)+IF(CA52<>\"\",WP!$AJ$10,0),0)),\"\")","v":1},{"$f":"IFERROR(IF(SUMPRODUCT(--(INDIRECT(\"WP!$C$\" & $DO52 & \":$C$\" & $DP52)=$C52),--(INDIRECT(\"WP!$B$\" & $DO52 & \":$B$\" & $DP52)=\"Y\"),--(INDIRECT(\"WP!$\" & $AX$41 & \"$\" & $DO52 & \":$\" & $AX$41 & \"$\" & $DP52)=1),--(INDIRECT(\"WP!$K$\" & $DO52 & \":$K$\" & $DP52)>0))<>0,SUMPRODUCT(--(INDIRECT(\"WP!$C$\" & $DO52 & \":$C$\" & $DP52)=$C52),--(INDIRECT(\"WP!$B$\" & $DO52 & \":$B$\" & $DP52)=\"Y\"),--(INDIRECT(\"WP!$\" & $AX$41 & \"$\" & $DO52 & \":$\" & $AX$41 & \"$\" & $DP52)=1),INDIRECT(\"WP!$K$\" & $DO52 & \":$K$\" & $DP52)),IF(AZ52<>\"\",0,\"\")),\"\")","v":""},{"$f":"IFERROR(IF(SUMPRODUCT(--(INDIRECT(\"WP!$C$\" & $DO52 & \":$C$\" & $DP52)=$C52),--(INDIRECT(\"WP!$B\" & $DO52 & \":$B\" & $DP52)=\"Y\"),--(INDIRECT(\"WP!$\" & $AX$41 & \"$\" & $DO52 & \":$\" & $AX$41 & \"$\" & $DP52)<>\"\"),--(INDIRECT(\"WP!$K\" & $DO52 & \":$K\" & $DP52)>0))<>0,SUMPRODUCT(--(INDIRECT(\"WP!$C$\" & $DO52 & \":$C$\" & $DP52)=$C52),--(INDIRECT(\"WP!$B\" & $DO52 & \":$B\" & $DP52)=\"Y\"),--(INDIRECT(\"WP!$\" & $AX$41 & \"$\" &  $DO52 & \":$\" & $AX$41 & \"$\" & $DP52)<>\"\"),INDIRECT(\"WP!$K\" & $DO52 & \":$K\" & $DP52)),\"\"),\"\")","v":""},{"$f":"IFERROR(IF(WpAreaA_Sub1_exist,IF(SUMPRODUCT(--(INDIRECT(\"WP!$C$\" & $DO52 & \":$C$\" & $DP52) =$C52),--(INDIRECT(\"WP!$\" & $BA$41 & \"$\" & $DO52 & \":$\" & $BA$41 & \"$\" & $DP52) <>\"\"),--(INDIRECT(\"WP!$K$\" & $DO52 & \":$K$\" & $DP52)>0))>0,SUMPRODUCT(--(INDIRECT(\"WP!$C$\" & $DO52 & \":$C$\" & $DP52) =$C52),--(INDIRECT(\"WP!$\" & $BA$41 & \"$\" & $DO52 & \":$\" & $BA$41 & \"$\" & $DP52) <>\"\"),INDIRECT(\"WP!$K$\" & $DO52 & \":$K$\" & $DP52),INDIRECT(\"WP!$\" & $BA$41 & \"$\" & $DO52 & \":$\" & $BA$41 & \"$\" & $DP52))/SUMPRODUCT(--(INDIRECT(\"WP!$C$\" & $DO52 & \":$C$\" & $DP52) =$C52),--(INDIRECT(\"WP!$\" & $BA$41 & \"$\" & $DO52 & \":$\" & $BA$41 & \"$\" & $DP52) <>\"\"),INDIRECT(\"WP!$K$\" & $DO52 & \":$K$\" & $DP52)),\"\"),\"\"),\"\")","v":1},{"$f":"IFERROR(IF(WpAreaA_Sub1_exist,IF(SUMPRODUCT(--(INDIRECT(\"WP!$C$\" & $DO52 & \":$C$\" & $DP52)=$C52),--(INDIRECT(\"WP!$B$\" & $DO52 & \":$B$\" & $DP52)=\"Y\"),--(INDIRECT(\"WP!$\" & $BA$41 & \"$\" & $DO52 & \":$\" & $BA$41 & \"$\" & $DP52)=1),--(INDIRECT(\"WP!$K$\" & $DO52 & \":$K$\" & $DP52)>0))<>0,SUMPRODUCT(--(INDIRECT(\"WP!$C$\" & $DO52 & \":$C$\" & $DP52)=$C52),--(INDIRECT(\"WP!$B$\" & $DO52 & \":$B$\" & $DP52)=\"Y\"),--(INDIRECT(\"WP!$\" & $BA$41 & \"$\" & $DO52 & \":$\" & $BA$41 & \"$\" & $DP52)=1),INDIRECT(\"WP!$K$\" & $DO52 & \":$K$\" & $DP52)),IF(BC52<>\"\",0,\"\")),\"\"),\"\")","v":""},{"$f":"IFERROR(IF(WpAreaA_Sub1_exist,IF(SUMPRODUCT(--(INDIRECT(\"WP!$C$\" & $DO52 & \":$C$\" & $DP52)=$C52),--(INDIRECT(\"WP!$B\" & $DO52 & \":$B\" & $DP52)=\"Y\"),--(INDIRECT(\"WP!$\" & $BA$41 & \"$\" & $DO52 & \":$\" & $BA$41 & \"$\" & $DP52)<>\"\"),--(INDIRECT(\"WP!$K\" & $DO52 & \":$K\" & $DP52)>0))<>0,SUMPRODUCT(--(INDIRECT(\"WP!$C$\" & $DO52 & \":$C$\" & $DP52)=$C52),--(INDIRECT(\"WP!$B\" & $DO52 & \":$B\" & $DP52)=\"Y\"),--(INDIRECT(\"WP!$\" & $BA$41 & \"$\" &  $DO52 & \":$\" & $BA$41 & \"$\" & $DP52)<>\"\"),INDIRECT(\"WP!$K\" & $DO52 & \":$K\" & $DP52)),\"\"),\"\"),\"\")","v":""},{"$f":"IFERROR(IF(WpAreaA_Sub2_exist,IF(SUMPRODUCT(--(INDIRECT(\"WP!$C$\" & $DO52 & \":$C$\" & $DP52) =$C52),--(INDIRECT(\"WP!$\" & $BD$41 & \"$\" & $DO52 & \":$\" & $BD$41 & \"$\" & $DP52) <>\"\"),--(INDIRECT(\"WP!$K$\" & $DO52 & \":$K$\" & $DP52)>0))>0,SUMPRODUCT(--(INDIRECT(\"WP!$C$\" & $DO52 & \":$C$\" & $DP52) =$C52),--(INDIRECT(\"WP!$\" & $BD$41 & \"$\" & $DO52 & \":$\" & $BD$41 & \"$\" & $DP52) <>\"\"),INDIRECT(\"WP!$K\" & $DO52 & \":$K\" & $DP52),INDIRECT(\"WP!$\" & $BD$41 & \"$\" & $DO52 & \":$\" & $BD$41 & \"$\" & $DP52))/SUMPRODUCT(--(INDIRECT(\"WP!$C$\" & $DO52 & \":$C$\" & $DP52) =$C52),--(INDIRECT(\"WP!$\" & $BD$41 & \"$\" & $DO52 & \":$\" & $BD$41 & \"$\" & $DP52) <>\"\"),INDIRECT(\"WP!$K\" & $DO52 & \":$K\" & $DP52)),\"\"),\"\"),\"\")","v":""},{"$f":"IFERROR(IF(WpAreaA_Sub2_exist,IF(SUMPRODUCT(--(INDIRECT(\"WP!$C$\" & $DO52 & \":$C$\" & $DP52)=$C52),--(INDIRECT(\"WP!$B\" & $DO52 & \":$B\" & $DP52)=\"Y\"),--(INDIRECT(\"WP!$\" & $BD$41 & \"$\" & $DO52 & \":$\" & $BD$41 & \"$\" & $DP52)=1),--(INDIRECT(\"WP!$K\" & $DO52 & \":$K\" & $DP52)>0))<>0,SUMPRODUCT(--(INDIRECT(\"WP!$C$\" & $DO52 & \":$C$\" & $DP52)=$C52),--(INDIRECT(\"WP!$B\" & $DO52 & \":$B\" & $DP52)=\"Y\"),--(INDIRECT(\"WP!$\" & $BD$41 & \"$\" & $DO52 & \":$\" & $BD$41 & \"$\" & $DP52)=1),INDIRECT(\"WP!$K\" & $DO52 & \":$K\" & $DP52)),IF(BF52<>\"\",0,\"\")),\"\"),\"\")","v":""},{"$f":"IFERROR(IF(WpAreaA_Sub2_exist,IF(SUMPRODUCT(--(INDIRECT(\"WP!$C$\" & $DO52 & \":$C$\" & $DP52)=$C52),--(INDIRECT(\"WP!$B\" & $DO52 & \":$B\" & $DP52)=\"Y\"),--(INDIRECT(\"WP!$\" & $BD$41 & \"$\" & $DO52 & \":$\" & $BD$41 & \"$\" & $DP52)<>\"\"),--(INDIRECT(\"WP!$K\" & $DO52 & \":$K\" & $DP52)>0))<>0,SUMPRODUCT(--(INDIRECT(\"WP!$C$\" & $DO52 & \":$C$\" & $DP52)=$C52),--(INDIRECT(\"WP!$B\" & $DO52 & \":$B\" & $DP52)=\"Y\"),--(INDIRECT(\"WP!$\" & $BD$41 & \"$\" & $DO52 & \":$\" & $BD$41 & \"$\" & $DP52)<>\"\"),INDIRECT(\"WP!$K\" & $DO52 & \":$K\" & $DP52)),\"\"),\"\"),\"\")","v":""},{"$f":"IFERROR(IF(WpAreaA_Sub3_exist,IF(SUMPRODUCT(--(INDIRECT(\"WP!$C$\" & $DO52 & \":$C$\" & $DP52) =$C52),--(INDIRECT(\"WP!$\" & $BG$41 & \"$\" & $DO52 & \":$\" & $BG$41 & \"$\" & $DP52) <>\"\"),--(INDIRECT(\"WP!$K$\" & $DO52 & \":$K$\" & $DP52)>0))>0,SUMPRODUCT(--(INDIRECT(\"WP!$C$\" & $DO52 & \":$C$\" & $DP52) =$C52),--(INDIRECT(\"WP!$\" & $BG$41 & \"$\" & $DO52 & \":$\" & $BG$41 & \"$\" & $DP52) <>\"\"),INDIRECT(\"WP!$K\" & $DO52 & \":$K\" & $DP52),INDIRECT(\"WP!$\" & $BG$41 & \"$\" & $DO52 & \":$\" & $BG$41 & \"$\" & $DP52))/SUMPRODUCT(--(INDIRECT(\"WP!$C$\" & $DO52 & \":$C$\" & $DP52) =$C52),--(INDIRECT(\"WP!$\" & $BG$41 & \"$\" & $DO52 & \":$\" & $BG$41 & \"$\" & $DP52) <>\"\"),INDIRECT(\"WP!$K\" & $DO52 & \":$K\" & $DP52)),\"\"),\"\"),\"\")","v":""},{"$f":"IFERROR(IF(WpAreaA_Sub3_exist,IF(SUMPRODUCT(--(INDIRECT(\"WP!$C$\" & $DO52 & \":$C$\" & $DP52)=$C52),--(INDIRECT(\"WP!$B\" & $DO52 & \":$B\" & $DP52)=\"Y\"),--(INDIRECT(\"WP!$\" & $BG$41 & \"$\" & $DO52 & \":$\" & $BG$41 & \"$\" & $DP52)=1),--(INDIRECT(\"WP!$K\" & $DO52 & \":$K\" & $DP52)>0))<>0,SUMPRODUCT(--(INDIRECT(\"WP!$C$\" & $DO52 & \":$C$\" & $DP52)=$C52),--(INDIRECT(\"WP!$B\" & $DO52 & \":$B\" & $DP52)=\"Y\"),--(INDIRECT(\"WP!$\" & $BG$41 & \"$\" & $DO52 & \":$\" & $BG$41 & \"$\" & $DP52)=1),INDIRECT(\"WP!$K\" & $DO52 & \":$K\" & $DP52)),IF(BI52<>\"\",0,\"\")),\"\"),\"\")","v":""},{"$f":"IFERROR(IF(WpAreaA_Sub3_exist,IF(SUMPRODUCT(--(INDIRECT(\"WP!$C$\" & $DO52 & \":$C$\" & $DP52)=$C52),--(INDIRECT(\"WP!$B\" & $DO52 & \":$B\" & $DP52)=\"Y\"),--(INDIRECT(\"WP!$\" & $BG$41 & \"$\" & $DO52 & \":$\" & $BG$41 & \"$\" & $DP52)<>\"\"),--(INDIRECT(\"WP!$K\" & $DO52 & \":$K\" & $DP52)>0))<>0,SUMPRODUCT(--(INDIRECT(\"WP!$C$\" & $DO52 & \":$C$\" & $DP52)=$C52),--(INDIRECT(\"WP!$B\" & $DO52 & \":$B\" & $DP52)=\"Y\"),--(INDIRECT(\"WP!$\" & $BG$41 & \"$\" & $DO52 & \":$\" & $BG$41 & \"$\" & $DP52)<>\"\"),INDIRECT(\"WP!$K\" & $DO52 & \":$K\" & $DP52)),\"\"),\"\"),\"\")","v":""},null,{"$f":"IFERROR(IF(WpAreaB_Sub1_exist,IF(SUMPRODUCT(--(INDIRECT(\"WP!$C$\" & $DO52 & \":$C$\" & $DP52) =$C52),--(INDIRECT(\"WP!$\" & $BK$41 & \"$\" & $DO52 & \":$\" & $BK$41 & \"$\" & $DP52) <>\"\"),--(INDIRECT(\"WP!$K$\" & $DO52 & \":$K$\" & $DP52)>0))>0,SUMPRODUCT(--(INDIRECT(\"WP!$C$\" & $DO52 & \":$C$\" & $DP52) =$C52),--(INDIRECT(\"WP!$\" & $BK$41 & \"$\" & $DO52 & \":$\" & $BK$41 & \"$\" & $DP52) <>\"\"),INDIRECT(\"WP!$K\" & $DO52 & \":$K\" & $DP52),INDIRECT(\"WP!$\" & $BK$41 & \"$\" & $DO52 & \":$\" & $BK$41 & \"$\" & $DP52))/SUMPRODUCT(--(INDIRECT(\"WP!$C$\" & $DO52 & \":$C$\" & $DP52) =$C52),--(INDIRECT(\"WP!$\" & $BK$41 & \"$\" & $DO52 & \":$\" & $BK$41 & \"$\" & $DP52) <>\"\"),INDIRECT(\"WP!$K\" & $DO52 & \":$K\" & $DP52)),\"\"),\"\"),\"\")","v":""},{"$f":"IFERROR(IF(WpAreaB_Sub1_exist,IF(SUMPRODUCT(--(INDIRECT(\"WP!$C$\" & $DO52 & \":$C$\" & $DP52)=$C52),--(INDIRECT(\"WP!$B\" & $DO52 & \":$B\" & $DP52)=\"Y\"),--(INDIRECT(\"WP!$\" & $BK$41 & \"$\" & $DO52 & \":$\" & $BK$41 & \"$\" & $DP52)=1),--(INDIRECT(\"WP!$K\" & $DO52 & \":$K\" & $DP52)>0))<>0,SUMPRODUCT(--(INDIRECT(\"WP!$C$\" & $DO52 & \":$C$\" & $DP52)=$C52),--(INDIRECT(\"WP!$B\" & $DO52 & \":$B\" & $DP52)=\"Y\"),--(INDIRECT(\"WP!$\" & $BK$41 & \"$\" & $DO52 & \":$\" & $BK$41 & \"$\" & $DP52)=1),INDIRECT(\"WP!$K\" & $DO52 & \":$K\" & $DP52)),IF(BM52<>\"\",0,\"\")),\"\"),\"\")","v":""},{"$f":"IFERROR(IF(WpAreaB_Sub1_exist,IF(SUMPRODUCT(--(INDIRECT(\"WP!$C$\" & $DO52 & \":$C$\" & $DP52)=$C52),--(INDIRECT(\"WP!$B\" & $DO52 & \":$B\" & $DP52)=\"Y\"),--(INDIRECT(\"WP!$\" & $BK$41 & \"$\" & $DO52 & \":$\" & $BK$41 & \"$\" & $DP52)<>\"\"),--(INDIRECT(\"WP!$K\" & $DO52 & \":$K\" & $DP52)>0))<>0,SUMPRODUCT(--(INDIRECT(\"WP!$C$\" & $DO52 & \":$C$\" & $DP52)=$C52),--(INDIRECT(\"WP!$B\" & $DO52 & \":$B\" & $DP52)=\"Y\"),--(INDIRECT(\"WP!$\" & $BK$41 & \"$\" & $DO52 & \":$\" & $BK$41 & \"$\" & $DP52)<>\"\"),INDIRECT(\"WP!$K\" & $DO52 & \":$K\" & $DP52)),\"\"),\"\"),\"\")","v":""},{"$f":"IFERROR(IF(WpAreaB_Sub2_exist,IF(SUMPRODUCT(--(INDIRECT(\"WP!$C$\" & $DO52 & \":$C$\" & $DP52) =$C52),--(INDIRECT(\"WP!$\" & $BN$41 & \"$\" & $DO52 & \":$\" & $BN$41 & \"$\" & $DP52) <>\"\"),--(INDIRECT(\"WP!$K$\" & $DO52 & \":$K$\" & $DP52)>0))>0,SUMPRODUCT(--(INDIRECT(\"WP!$C$\" & $DO52 & \":$C$\" & $DP52) =$C52),--(INDIRECT(\"WP!$\" & $BN$41 & \"$\" & $DO52 & \":$\" & $BN$41 & \"$\" & $DP52) <>\"\"),INDIRECT(\"WP!$K\" & $DO52 & \":$K\" & $DP52),INDIRECT(\"WP!$\" & $BN$41 & \"$\" & $DO52 & \":$\" & $BN$41 & \"$\" & $DP52))/SUMPRODUCT(--(INDIRECT(\"WP!$C$\" & $DO52 & \":$C$\" & $DP52) =$C52),--(INDIRECT(\"WP!$\" & $BN$41 & \"$\" & $DO52 & \":$\" & $BN$41 & \"$\" & $DP52) <>\"\"),INDIRECT(\"WP!$K\" & $DO52 & \":$K\" & $DP52)),\"\"),\"\"),\"\")","v":""},{"$f":"IFERROR(IF(WpAreaB_Sub2_exist,IF(SUMPRODUCT(--(INDIRECT(\"WP!$C$\" & $DO52 & \":$C$\" & $DP52)=$C52),--(INDIRECT(\"WP!$B\" & $DO52 & \":$B\" & $DP52)=\"Y\"),--(INDIRECT(\"WP!$\" & $BN$41 & \"$\" & $DO52 & \":$\" & $BN$41 & \"$\" & $DP52)=1),--(INDIRECT(\"WP!$K\" & $DO52 & \":$K\" & $DP52)>0))<>0,SUMPRODUCT(--(INDIRECT(\"WP!$C$\" & $DO52 & \":$C$\" & $DP52)=$C52),--(INDIRECT(\"WP!$B\" & $DO52 & \":$B\" & $DP52)=\"Y\"),--(INDIRECT(\"WP!$\" & $BN$41 & \"$\" & $DO52 & \":$\" & $BN$41 & \"$\" & $DP52)=1),INDIRECT(\"WP!$K\" & $DO52 & \":$K\" & $DP52)),IF(BP52<>\"\",0,\"\")),\"\"),\"\")","v":""},{"$f":"IFERROR(IF(WpAreaB_Sub2_exist,IF(SUMPRODUCT(--(INDIRECT(\"WP!$C$\" & $DO52 & \":$C$\" & $DP52)=$C52),--(INDIRECT(\"WP!$B\" & $DO52 & \":$B\" & $DP52)=\"Y\"),--(INDIRECT(\"WP!$\" & $BN$41 & \"$\" & $DO52 & \":$\" & $BN$41 & \"$\" & $DP52)<>\"\"),--(INDIRECT(\"WP!$K\" & $DO52 & \":$K\" & $DP52)>0))<>0,SUMPRODUCT(--(INDIRECT(\"WP!$C$\" & $DO52 & \":$C$\" & $DP52)=$C52),--(INDIRECT(\"WP!$B\" & $DO52 & \":$B\" & $DP52)=\"Y\"),--(INDIRECT(\"WP!$\" & $BN$41 & \"$\" & $DO52 & \":$\" & $BN$41 & \"$\" & $DP52)<>\"\"),INDIRECT(\"WP!$K\" & $DO52 & \":$K\" & $DP52)),\"\"),\"\"),\"\")","v":""},{"$f":"IFERROR(IF(WpAreaB_Sub3_exist,IF(SUMPRODUCT(--(INDIRECT(\"WP!$C$\" & $DO52 & \":$C$\" & $DP52) =$C52),--(INDIRECT(\"WP!$\" & $BQ$41 & \"$\" & $DO52 & \":$\" & $BQ$41 & \"$\" & $DP52) <>\"\"),--(INDIRECT(\"WP!$K$\" & $DO52 & \":$K$\" & $DP52)>0))>0,SUMPRODUCT(--(INDIRECT(\"WP!$C$\" & $DO52 & \":$C$\" & $DP52) =$C52),--(INDIRECT(\"WP!$\" & $BQ$41 & \"$\" & $DO52 & \":$\" & $BQ$41 & \"$\" & $DP52) <>\"\"),INDIRECT(\"WP!$K\" & $DO52 & \":$K\" & $DP52),INDIRECT(\"WP!$\" & $BQ$41 & \"$\" & $DO52 & \":$\" & $BQ$41 & \"$\" & $DP52))/SUMPRODUCT(--(INDIRECT(\"WP!$C$\" & $DO52 & \":$C$\" & $DP52) =$C52),--(INDIRECT(\"WP!$\" & $BQ$41 & \"$\" & $DO52 & \":$\" & $BQ$41 & \"$\" & $DP52) <>\"\"),INDIRECT(\"WP!$K\" & $DO52 & \":$K\" & $DP52)),\"\"),\"\"),\"\")","v":""},{"$f":"IFERROR(IF(WpAreaB_Sub3_exist,IF(SUMPRODUCT(--(INDIRECT(\"WP!$C$\" & $DO52 & \":$C$\" & $DP52)=$C52),--(INDIRECT(\"WP!$B\" & $DO52 & \":$B\" & $DP52)=\"Y\"),--(INDIRECT(\"WP!$\" & $BQ$41 & \"$\" & $DO52 & \":$\" & $BQ$41 & \"$\" & $DP52)=1),--(INDIRECT(\"WP!$K\" & $DO52 & \":$K\" & $DP52)>0))<>0,SUMPRODUCT(--(INDIRECT(\"WP!$C$\" & $DO52 & \":$C$\" & $DP52)=$C52),--(INDIRECT(\"WP!$B\" & $DO52 & \":$B\" & $DP52)=\"Y\"),--(INDIRECT(\"WP!$\" & $BQ$41 & \"$\" & $DO52 & \":$\" & $BQ$41 & \"$\" & $DP52)=1),INDIRECT(\"WP!$K\" & $DO52 & \":$K\" & $DP52)),IF(BS52<>\"\",0,\"\")),\"\"),\"\")","v":""},{"$f":"IFERROR(IF(WpAreaB_Sub3_exist,IF(SUMPRODUCT(--(INDIRECT(\"WP!$C$\" & $DO52 & \":$C$\" & $DP52)=$C52),--(INDIRECT(\"WP!$B\" & $DO52 & \":$B\" & $DP52)=\"Y\"),--(INDIRECT(\"WP!$\" & $BQ$41 & \"$\" & $DO52 & \":$\" & $BQ$41 & \"$\" & $DP52)<>\"\"),--(INDIRECT(\"WP!$K\" & $DO52 & \":$K\" & $DP52)>0))<>0,SUMPRODUCT(--(INDIRECT(\"WP!$C$\" & $DO52 & \":$C$\" & $DP52)=$C52),--(INDIRECT(\"WP!$B\" & $DO52 & \":$B\" & $DP52)=\"Y\"),--(INDIRECT(\"WP!$\" & $BQ$41 & \"$\" & $DO52 & \":$\" & $BQ$41 & \"$\" & $DP52)<>\"\"),INDIRECT(\"WP!$K\" & $DO52 & \":$K\" & $DP52)),\"\"),\"\"),\"\")","v":""},null,{"$f":"IFERROR(IF(WpAreaC_Sub1_exist,IF(SUMPRODUCT(--(INDIRECT(\"WP!$C$\" & $DO52 & \":$C$\" & $DP52) =$C52),--(INDIRECT(\"WP!$\" & $BU$41 & \"$\" & $DO52 & \":$\" & $BU$41 & \"$\" & $DP52) <>\"\"),--(INDIRECT(\"WP!$K$\" & $DO52 & \":$K$\" & $DP52)>0))>0,SUMPRODUCT(--(INDIRECT(\"WP!$C$\" & $DO52 & \":$C$\" & $DP52) =$C52),--(INDIRECT(\"WP!$\" & $BU$41 & \"$\" & $DO52 & \":$\" & $BU$41 & \"$\" & $DP52) <>\"\"),INDIRECT(\"WP!$K\" & $DO52 & \":$K\" & $DP52),INDIRECT(\"WP!$\" & $BU$41 & \"$\" & $DO52 & \":$\" & $BU$41 & \"$\" & $DP52))/SUMPRODUCT(--(INDIRECT(\"WP!$C$\" & $DO52 & \":$C$\" & $DP52) =$C52),--(INDIRECT(\"WP!$\" & $BU$41 & \"$\" & $DO52 & \":$\" & $BU$41 & \"$\" & $DP52) <>\"\"),INDIRECT(\"WP!$K\" & $DO52 & \":$K\" & $DP52)),\"\"),\"\"),\"\")","v":""},{"$f":"IFERROR(IF(WpAreaC_Sub1_exist,IF(SUMPRODUCT(--(INDIRECT(\"WP!$C$\" & $DO52 & \":$C$\" & $DP52)=$C52),--(INDIRECT(\"WP!$B\" & $DO52 & \":$B\" & $DP52)=\"Y\"),--(INDIRECT(\"WP!$\" & $BU$41 & \"$\" & $DO52 & \":$\" & $BU$41 & \"$\" & $DP52)=1),--(INDIRECT(\"WP!$K\" & $DO52 & \":$K\" & $DP52)>0))<>0,SUMPRODUCT(--(INDIRECT(\"WP!$C$\" & $DO52 & \":$C$\" & $DP52)=$C52),--(INDIRECT(\"WP!$B\" & $DO52 & \":$B\" & $DP52)=\"Y\"),--(INDIRECT(\"WP!$\" & $BU$41 & \"$\" & $DO52 & \":$\" & $BU$41 & \"$\" & $DP52)=1),INDIRECT(\"WP!$K\" & $DO52 & \":$K\" & $DP52)),IF(BW52<>\"\",0,\"\")),\"\"),\"\")","v":""},{"$f":"IFERROR(IF(WpAreaC_Sub1_exist,IF(SUMPRODUCT(--(INDIRECT(\"WP!$C$\" & $DO52 & \":$C$\" & $DP52)=$C52),--(INDIRECT(\"WP!$B\" & $DO52 & \":$B\" & $DP52)=\"Y\"),--(INDIRECT(\"WP!$\" & $BU$41 & \"$\" & $DO52 & \":$\" & $BU$41 & \"$\" & $DP52)<>\"\"),--(INDIRECT(\"WP!$K\" & $DO52 & \":$K\" & $DP52)>0))<>0,SUMPRODUCT(--(INDIRECT(\"WP!$C$\" & $DO52 & \":$C$\" & $DP52)=$C52),--(INDIRECT(\"WP!$B\" & $DO52 & \":$B\" & $DP52)=\"Y\"),--(INDIRECT(\"WP!$\" & $BU$41 & \"$\" & $DO52 & \":$\" & $BU$41 & \"$\" & $DP52)<>\"\"),INDIRECT(\"WP!$K\" & $DO52 & \":$K\" & $DP52)),\"\"),\"\"),\"\")","v":""},{"$f":"IFERROR(IF(WpAreaC_Sub2_exist,IF(SUMPRODUCT(--(INDIRECT(\"WP!$C$\" & $DO52 & \":$C$\" & $DP52) =$C52),--(INDIRECT(\"WP!$\" & $BX$41 & \"$\" & $DO52 & \":$\" & $BX$41 & \"$\" & $DP52) <>\"\"),--(INDIRECT(\"WP!$K$\" & $DO52 & \":$K$\" & $DP52)>0))>0,SUMPRODUCT(--(INDIRECT(\"WP!$C$\" & $DO52 & \":$C$\" & $DP52) =$C52),--(INDIRECT(\"WP!$\" & $BX$41 & \"$\" & $DO52 & \":$\" & $BX$41 & \"$\" & $DP52) <>\"\"),INDIRECT(\"WP!$K\" & $DO52 & \":$K\" & $DP52),INDIRECT(\"WP!$\" & $BX$41 & \"$\" & $DO52 & \":$\" & $BX$41 & \"$\" & $DP52))/SUMPRODUCT(--(INDIRECT(\"WP!$C$\" & $DO52 & \":$C$\" & $DP52) =$C52),--(INDIRECT(\"WP!$\" & $BX$41 & \"$\" & $DO52 & \":$\" & $BX$41 & \"$\" & $DP52) <>\"\"),INDIRECT(\"WP!$K\" & $DO52 & \":$K\" & $DP52)),\"\"),\"\"),\"\")","v":""},{"$f":"IFERROR(IF(WpAreaC_Sub2_exist,IF(SUMPRODUCT(--(INDIRECT(\"WP!$C$\" & $DO52 & \":$C$\" & $DP52)=$C52),--(INDIRECT(\"WP!$B\" & $DO52 & \":$B\" & $DP52)=\"Y\"),--(INDIRECT(\"WP!$\" & $BX$41 & \"$\" & $DO52 & \":$\" & $BX$41 & \"$\" & $DP52)=1),--(INDIRECT(\"WP!$K\" & $DO52 & \":$K\" & $DP52)>0))<>0,SUMPRODUCT(--(INDIRECT(\"WP!$C$\" & $DO52 & \":$C$\" & $DP52)=$C52),--(INDIRECT(\"WP!$B\" & $DO52 & \":$B\" & $DP52)=\"Y\"),--(INDIRECT(\"WP!$\" & $BX$41 & \"$\" & $DO52 & \":$\" & $BX$41 & \"$\" & $DP52)=1),INDIRECT(\"WP!$K\" & $DO52 & \":$K\" & $DP52)),IF(BZ52<>\"\",0,\"\")),\"\"),\"\")","v":""},{"$f":"IFERROR(IF(WpAreaC_Sub2_exist,IF(SUMPRODUCT(--(INDIRECT(\"WP!$C$\" & $DO52 & \":$C$\" & $DP52)=$C52),--(INDIRECT(\"WP!$B\" & $DO52 & \":$B\" & $DP52)=\"Y\"),--(INDIRECT(\"WP!$\" & $BX$41 & \"$\" & $DO52 & \":$\" & $BX$41 & \"$\" & $DP52)<>\"\"),--(INDIRECT(\"WP!$K\" & $DO52 & \":$K\" & $DP52)>0))<>0,SUMPRODUCT(--(INDIRECT(\"WP!$C$\" & $DO52 & \":$C$\" & $DP52)=$C52),--(INDIRECT(\"WP!$B\" & $DO52 & \":$B\" & $DP52)=\"Y\"),--(INDIRECT(\"WP!$\" & $BX$41 & \"$\" & $DO52 & \":$\" & $BX$41 & \"$\" & $DP52)<>\"\"),INDIRECT(\"WP!$K\" & $DO52 & \":$K\" & $DP52)),\"\"),\"\"),\"\")","v":""},{"$f":"IFERROR(IF(WpAreaC_Sub3_exist,F(SUMPRODUCT(--(INDIRECT(\"WP!$C$\" & $DO52 & \":$C$\" & $DP52) =$C52),--(INDIRECT(\"WP!$\" & $CA$41 & \"$\" & $DO52 & \":$\" & $CA$41 & \"$\" & $DP52) <>\"\"),--(INDIRECT(\"WP!$K$\" & $DO52 & \":$K$\" & $DP52)>0))>0,SUMPRODUCT(--(INDIRECT(\"WP!$C$\" & $DO52 & \":$C$\" & $DP52) =$C52),--(INDIRECT(\"WP!$\" & $CA$41 & \"$\" & $DO52 & \":$\" & $CA$41 & \"$\" & $DP52) <>\"\"),INDIRECT(\"WP!$K\" & $DO52 & \":$K\" & $DP52),INDIRECT(\"WP!$\" & $CA$41 & \"$\" & $DO52 & \":$\" & $CA$41 & \"$\" & $DP52))/SUMPRODUCT(--(INDIRECT(\"WP!$C$\" & $DO52 & \":$C$\" & $DP52) =$C52),--(INDIRECT(\"WP!$\" & $CA$41 & \"$\" & $DO52 & \":$\" & $CA$41 & \"$\" & $DP52) <>\"\"),INDIRECT(\"WP!$K\" & $DO52 & \":$K\" & $DP52)),\"\"),\"\"),\"\")","v":""},{"$f":"IFERROR(IF(WpAreaC_Sub3_exist,IF(SUMPRODUCT(--(INDIRECT(\"WP!$C$\" & $DO52 & \":$C$\" & $DP52)=$C52),--(INDIRECT(\"WP!$B\" & $DO52 & \":$B\" & $DP52)=\"Y\"),--(INDIRECT(\"WP!$\" & $CA$41 & \"$\" & $DO52 & \":$\" & $CA$41 & \"$\" & $DP52)=1),--(INDIRECT(\"WP!$K\" & $DO52 & \":$K\" & $DP52)>0))<>0,SUMPRODUCT(--(INDIRECT(\"WP!$C$\" & $DO52 & \":$C$\" & $DP52)=$C52),--(INDIRECT(\"WP!$B\" & $DO52 & \":$B\" & $DP52)=\"Y\"),--(INDIRECT(\"WP!$\" & $CA$41 & \"$\" & $DO52 & \":$\" & $CA$41 & \"$\" & $DP52)=1),INDIRECT(\"WP!$K\" & $DO52 & \":$K\" & $DP52)),IF(CC52<>\"\",0,\"\")),\"\"),\"\")","v":""},{"$f":"IFERROR(IF(WpAreaC_Sub3_exist,IF(SUMPRODUCT(--(INDIRECT(\"WP!$C$\" & $DO52 & \":$C$\" & $DP52)=$C52),--(INDIRECT(\"WP!$B\" & $DO52 & \":$B\" & $DP52)=\"Y\"),--(INDIRECT(\"WP!$\" & $CA$41 & \"$\" & $DO52 & \":$\" & $CA$41 & \"$\" & $DP52)<>\"\"),--(INDIRECT(\"WP!$K\" & $DO52 & \":$K\" & $DP52)>0))<>0,SUMPRODUCT(--(INDIRECT(\"WP!$C$\" & $DO52 & \":$C$\" & $DP52)=$C52),--(INDIRECT(\"WP!$B\" & $DO52 & \":$B\" & $DP52)=\"Y\"),--(INDIRECT(\"WP!$\" & $CA$41 & \"$\" & $DO52 & \":$\" & $CA$41 & \"$\" & $DP52)<>\"\"),INDIRECT(\"WP!$K\" & $DO52 & \":$K\" & $DP52)),\"\"),\"\"),\"\")","v":""},null,null,null,null,"","","","","","","","","","","","",null,"","","","","","","","","",null,"","","","","","","","","",null,{"$f":"MIN(IF(WP!$C$12:$C$53=$C52,ROW(WP!$C$12:$C$53),\"\"))","v":51},{"$f":"MAX(IF(WP!$C$12:$C$53=$C52,ROW(WP!$C$12:$C$53),\"\"))","v":52}]
[null,null,null,null,null,null,null,null,null,null,null,null,null,null,null,null,null,null,null,null,null,null,null,null,null,null,null,null,null,null,null,null,null,null,null,null,null,null,null,null,null,null,null,null,null,null,"End of source data"]
[]
[null,"5 References"]
[null,"[1] RP-211396","New WID: UE Conformance – Modification of LTE Band 24 Specifications to comply with updated regulatory emission limits\n\n"]

{"sheet":"WP","index":1,"n_rows":53,"n_cols":51,"rows_kept":53,"cut":false,"hidden":false,"merged":[[52,27,52,40],[7,36,14,36],[0,27,5,35],[0,37,5,45],[2,17,2,23],[10,16,10,24],[7,26,14,26],[1,0,1,1],[0,47,0,50],[0,2,0,9],[3,0,3,1],[4,0,4,1],[0,0,0,1],[2,0,2,1],[1,2,1,9],[2,2,2,9],[4,2,4,4],[3,5,3,7],[3,8,3,9],[3,19,4,21],[0,25,6,25],[3,2,3,4],[4,5,4,7],[4,8,4,9],[1,47,4,47],[0,15,5,15],[3,11,4,14],[6,27,6,40],[1,48,4,50],[3,16,4,18],[5,47,5,48],[5,49,5,50],[3,22,4,24],[0,16,1,24]]}
["WP Title:",null,"Work plan for Modification of LTE Band 24 Specifications to comply with updated regulatory emission limit",null,null,null,null,null,null,null,null,null,null,null,null,"Start of workplan status columns.  Note! Do not remove this column. ","WP item status",null,null,null,null,null,null,null,null,"End of workplan columns.  Note! Do not remove this column. ",null,"Current meeting status",null,null,null,null,null,null,null,null,null,"Previous meeting status baseline",null,null,null,null,null,null,null,null,null,"WP rapporteur's private information. \nThese columns will be removed in the clean copy created by \"Create clean WP for publishing\".\n"]
["WI code",null,{"$f":"WI_code","v":"LTE_B24_mod-UEConTest"}]
["WP Scope:",null,"Assess and determine test environments and cases affected by updates to LTE Band 24 and update them in relevant conformance technical specifications",null,null,null,null,null,null,null,null,null,null,null,null,null,null,"vs Area"]
["WP Resp:",null,"Ojas Choksi",null,null,"ojas.choksi@ligado.com",null,null,null,null,null,"WP item completion",null,null,null,null,{"$f":"WpAreaA","v":"LTE"},null,null,{"$f":"WpAreaB","v":"N/A"},null,null,{"$f":"WpAreaC","v":"N/A"}]
["TS Resp:",null,"<TS responsible if a new TS is involved>",null,null,"<Email to TS responsible>"]
["WP Item ID","Is new test case?","TS/area","Clause","Title","Test purpose / Task","Company","Target","TDOC(s)","Comments","Weight","Overall",{"$f":"WpAreaA","v":"LTE"},{"$f":"WpAreaB","v":"N/A"},{"$f":"WpAreaC","v":"N/A"},null,{"$f":"WpAreaA_Sub1","v":"FDD"},{"$f":"WpAreaA_Sub2","v":"N/A"},{"$f":"WpAreaA_Sub3","v":"N/A"},{"$f":"WpAreaB_Sub1","v":"N/A"},{"$f":"WpAreaB_Sub2","v":"N/A"},{"$f":"WpAreaB_Sub3","v":"N/A"},{"$f":"WpAreaC_Sub1","v":"N/A"},{"$f":"WpAreaC_Sub2","v":"N/A"},{"$f":"WpAreaC_Sub3","v":"N/A"},null,null,null,null,null,null,null,null,null,null,null,null,null,null,null,null,null,null,null,null,null,null,"WP rapporteur internal notes",null,"Company <-> Contact email address(es)"]
[null,null,null,null,null,null,null,null,null,null,null,null,null,null,null,null,null,null,null,null,null,null,null,null,null,null,null,"Start of source data",null,null,null,null,null,null,null,null,null,null,null,null,null,null,null,null,null,null,null,"<Internal note column#1>","<Internal note column#2>","Company","E-mail address(es)"]
[null,null,null,null,null,null,null,null,null,null,null,null,null,null,"Overall",null,{"$f":"getProgress(AB8,AL8,\"%\",1,1)","v":"36.1%\n(+36.1%)"},{"$f":"getProgress(AC8,AM8,\"%\",1,1)","v":""},{"$f":"getProgress(AD8,AN8,\"%\",1,1)","v":""},{"$f":"getProgress(AE8,AO8,\"%\",1,1)","v":""},{"$f":"getProgress(AF8,AP8,\"%\",1,1)","v":""},{"$f":"getProgress(AG8,AQ8,\"%\",1,1)","v":""},{"$f":"getProgress(AH8,AR8,\"%\",1,1)","v":""},{"$f":"getProgress(AI8,AS8,\"%\",1,1)","v":""},{"$f":"getProgress(AJ8,AT8,\"%\",1,1)","v":""},null,"Start of Current Meeting Data",{"$f":"IF(SUMPRODUCT(--(INDIRECT(WpAreaA_Sub1_Rng)<>\"\"),INDIRECT(WpWeight_Rng)),$Q$11+(1-$Q$11)*(SUMPRODUCT(--(INDIRECT(WpAreaA_Sub1_Rng) <>\"\"),INDIRECT(WpWeight_Rng),INDIRECT(WpAreaA_Sub1_Rng))/SUMPRODUCT(--(INDIRECT(WpAreaA_Sub1_Rng) <>\"\"),INDIRECT(WpWeight_Rng))),\"\")","v":0.36112499999999992},{"$f":"IF(SUMPRODUCT(--(INDIRECT(WpAreaA_Sub2_Rng)<>\"\"),INDIRECT(WpWeight_Rng)),$Q$11+(1-$Q$11)*(SUMPRODUCT(--(INDIRECT(WpAreaA_Sub2_Rng) <>\"\"),INDIRECT(WpWeight_Rng),INDIRECT(WpAreaA_Sub2_Rng))/SUMPRODUCT(--(INDIRECT(WpAreaA_Sub2_Rng) <>\"\"),INDIRECT(WpWeight_Rng))),\"\")","v":""},{"$f":"IF(SUMPRODUCT(--(INDIRECT(WpAreaA_Sub3_Rng)<>\"\"),INDIRECT(WpWeight_Rng)),$Q$11+(1-$Q$11)*(SUMPRODUCT(--(INDIRECT(WpAreaA_Sub3_Rng) <>\"\"),INDIRECT(WpWeight_Rng),INDIRECT(WpAreaA_Sub3_Rng))/SUMPRODUCT(--(INDIRECT(WpAreaA_Sub3_Rng) <>\"\"),INDIRECT(WpWeight_Rng))),\"\")","v":""},{"$f":"IF(SUMPRODUCT(--(INDIRECT(WpAreaB_Sub1_Rng)<>\"\"),INDIRECT(WpWeight_Rng)),$Q$11+(1-$Q$11)*(SUMPRODUCT(--(INDIRECT(WpAreaB_Sub1_Rng) <>\"\"),INDIRECT(WpWeight_Rng),INDIRECT(WpAreaB_Sub1_Rng))/SUMPRODUCT(--(INDIRECT(WpAreaB_Sub1_Rng) <>\"\"),INDIRECT(WpWeight_Rng))),\"\")","v":""},{"$f":"IF(SUMPRODUCT(--(INDIRECT(WpAreaB_Sub2_Rng)<>\"\"),INDIRECT(WpWeight_Rng)),$Q$11+(1-$Q$11)*(SUMPRODUCT(--(INDIRECT(WpAreaB_Sub2_Rng) <>\"\"),INDIRECT(WpWeight_Rng),INDIRECT(WpAreaB_Sub2_Rng))/SUMPRODUCT(--(INDIRECT(WpAreaB_Sub2_Rng) <>\"\"),INDIRECT(WpWeight_Rng))),\"\")","v":""},{"$f":"IF(SUMPRODUCT(--(INDIRECT(WpAreaB_Sub3_Rng)<>\"\"),INDIRECT(WpWeight_Rng)),$Q$11+(1-$Q$11)*(SUMPRODUCT(--(INDIRECT(WpAreaB_Sub3_Rng) <>\"\"),INDIRECT(WpWeight_Rng),INDIRECT(WpAreaB_Sub3_Rng))/SUMPRODUCT(--(INDIRECT(WpAreaB_Sub3_Rng) <>\"\"),INDIRECT(WpWeight_Rng))),\"\")","v":""},{"$f":"IF(SUMPRODUCT(--(INDIRECT(WpAreaC_Sub1_Rng)<>\"\"),INDIRECT(WpWeight_Rng)),$Q$11+(1-$Q$11)*(SUMPRODUCT(--(INDIRECT(WpAreaC_Sub1_Rng) <>\"\"),INDIRECT(WpWeight_Rng),INDIRECT(WpAreaC_Sub1_Rng))/SUMPRODUCT(--(INDIRECT(WpAreaC_Sub1_Rng) <>\"\"),INDIRECT(WpWeight_Rng))),\"\")","v":""},{"$f":"IF(SUMPRODUCT(--(INDIRECT(WpAreaC_Sub2_Rng)<>\"\"),INDIRECT(WpWeight_Rng)),$Q$11+(1-$Q$11)*(SUMPRODUCT(--(INDIRECT(WpAreaC_Sub2_Rng) <>\"\"),INDIRECT(WpWeight_Rng),INDIRECT(WpAreaC_Sub2_Rng))/SUMPRODUCT(--(INDIRECT(WpAreaC_Sub2_Rng) <>\"\"),INDIRECT(WpWeight_Rng))),\"\")","v":""},{"$f":"IF(SUMPRODUCT(--(INDIRECT(WpAreaC_Sub3_Rng)<>\"\"),INDIRECT(WpWeight_Rng)),$Q$11+(1-$Q$11)*(SUMPRODUCT(--(INDIRECT(WpAreaC_Sub3_Rng) <>\"\"),INDIRECT(WpWeight_Rng),INDIRECT(WpAreaC_Sub3_Rng))/SUMPRODUCT(--(INDIRECT(WpAreaC_Sub3_Rng) <>\"\"),INDIRECT(WpWeight_Rng))),\"\")","v":""},"End of Current Meeting Data","","","","","","","","",""]
[null,null,null,null,null,null,null,null,null,null,null,null,null,null,"Number of WP items",null,{"$f":"getProgress(AB9,AL9,,,1)","v":"29\n(+29)"},{"$f":"getProgress(AC9,AM9,,,1)","v":"0"},{"$f":"getProgress(AD9,AN9,,,1)","v":"0"},{"$f":"getProgress(AE9,AO9,,,1)","v":"0"},{"$f":"getProgress(AF9,AP9,,,1)","v":"0"},{"$f":"getProgress(AG9,AQ9,,,1)","v":"0"},{"$f":"getProgress(AH9,AR9,,,1)","v":"0"},{"$f":"getProgress(AI9,AS9,,,1)","v":"0"},{"$f":"getProgress(AJ9,AT9,,,1)","v":"0"},null,null,{"$f":"IF(WpAreaA_Sub1_exist,COUNTA(INDIRECT(WpAreaA_Sub1_Rng)),0)","v":29},{"$f":"IF(WpAreaA_Sub1_exist,COUNTA(INDIRECT(WpAreaA_Sub2_Rng)),0)","v":0},{"$f":"IF(WpAreaA_Sub1_exist,COUNTA(INDIRECT(WpAreaA_Sub3_Rng)),0)","v":0},{"$f":"IF(WpAreaB_Sub1_exist,COUNTA(INDIRECT(WpAreaB_Sub1_Rng)),0)","v":0},{"$f":"IF(WpAreaB_Sub1_exist,COUNTA(INDIRECT(WpAreaB_Sub2_Rng)),0)","v":0},{"$f":"IF(WpAreaB_Sub1_exist,COUNTA(INDIRECT(WpAreaB_Sub3_Rng)),0)","v":0},{"$f":"IF(WpAreaC_Sub1_exist,COUNTA(INDIRECT(WpAreaC_Sub1_Rng)),0)","v":0},{"$f":"IF(WpAreaC_Sub1_exist,COUNTA(INDIRECT(WpAreaC_Sub2_Rng)),0)","v":0},{"$f":"IF(WpAreaC_Sub1_exist,COUNTA(INDIRECT(WpAreaC_Sub3_Rng)),0)","v":0},null,0,0,0,0,0,0,0,0,0]
[null,null,null,null,null,null,null,null,null,null,null,null,null,null,"Sum weight of WP items",null,{"$f":"getProgress(AB10,AL10,,1,1)","v":"6\n(+6)"},{"$f":"getProgress(AC10,AM10,,1,1)","v":"0"},{"$f":"getProgress(AD10,AN10,,1,1)","v":"0"},{"$f":"getProgress(AE10,AO10,,1,1)","v":"0"},{"$f":"getProgress(AF10,AP10,,1,1)","v":"0"},{"$f":"getProgress(AG10,AQ10,,1,1)","v":"0"},{"$f":"getProgress(AH10,AR10,,1,1)","v":"0"},{"$f":"getProgress(AI10,AS10,,1,1)","v":"0"},{"$f":"getProgress(AJ10,AT10,,1,1)","v":"0"},null,null,{"$f":"IF(WpAreaA_Sub1_exist,SUMPRODUCT(--(INDIRECT(WpAreaA_Sub1_Rng) <>\"\"),INDIRECT(WpWeight_Rng)),0)","v":6},{"$f":"IF(WpAreaA_Sub2_exist,SUMPRODUCT(--(INDIRECT(WpAreaA_Sub2_Rng) <>\"\"),INDIRECT(WpWeight_Rng)),0)","v":0},{"$f":"IF(WpAreaA_Sub3_exist,SUMPRODUCT(--(INDIRECT(WpAreaA_Sub3_Rng) <>\"\"),INDIRECT(WpWeight_Rng)),0)","v":0},{"$f":"IF(WpAreaB_Sub1_exist,SUMPRODUCT(--(INDIRECT(WpAreaB_Sub1_Rng) <>\"\"),INDIRECT(WpWeight_Rng)),0)","v":0},{"$f":"IF(WpAreaB_Sub2_exist,SUMPRODUCT(--(INDIRECT(WpAreaB_Sub2_Rng) <>\"\"),INDIRECT(WpWeight_Rng)),0)","v":0},{"$f":"IF(WpAreaB_Sub3_exist,SUMPRODUCT(--(INDIRECT(WpAreaB_Sub3_Rng) <>\"\"),INDIRECT(WpWeight_Rng)),0)","v":0},{"$f":"IF(WpAreaC_Sub1_exist,SUMPRODUCT(--(INDIRECT(WpAreaC_Sub1_Rng) <>\"\"),INDIRECT(WpWeight_Rng)),0)","v":0},{"$f":"IF(WpAreaC_Sub2_exist,SUMPRODUCT(--(INDIRECT(WpAreaC_Sub2_Rng) <>\"\"),INDIRECT(WpWeight_Rng)),0)","v":0},{"$f":"IF(WpAreaC_Sub3_exist,SUMPRODUCT(--(INDIRECT(WpAreaC_Sub3_Rng) <>\"\"),INDIRECT(WpWeight_Rng)),0)","v":0},null,0,0,0,0,0,0,0,0,0]
[null,null,null,null,null,null,null,null,null,null,null,null,null,null,"Contribution by  work plan analysis",null,0.05,null,null,null,null,null,null,null,null,null,null,{"$f":"Q11","v":0.05},null,null,null,null,null,null,null,null,null,0.05]
["Start of work plan items.  Note! Do not remove this row. Introduce new work plan rows/items below this row."]
["LTE"]
["LTE Common"]
["TS 36.508: Common test environment"]
[1,null,36.508000000000003,"4.3.1","Test frequencies","Update the test frequencies based on the consraints placed on use of the entire band 24 as well as addition of a new Tx-Rx spacing","Ligado Networks","RAN5#92 (Aug-21)","R5-215174",null,0.1,{"$f":"getProgress(AB16,AL16,\"%\",1,1)","v":"100%\n(+100%)"},{"$f":"getProgress(AC16,AM16,\"%\",1,1)","v":"100%\n(+100%)"},{"$f":"getProgress(AD16,AN16,\"%\",1,1)","v":""},{"$f":"getProgress(AE16,AO16,\"%\",1,1)","v":""},null,1,null,null,null,null,null,null,null,null,null,null,{"$f":"IF(SUMPRODUCT(--($Q$10:$Y$10>0),--(Q16:Y16<>\"\"))>0,SUMPRODUCT(--($Q$10:$Y$10>0),Q16:Y16)/SUMPRODUCT(--($Q$10:$Y$10>0),--(Q16:Y16<>\"\")),\"\")","v":1},{"$f":"IF(WpAreaA_exist,IF(SUMPRODUCT(--($Q$9:$S$9<>0),--(Q16:S16<>\"\"))>0,SUMPRODUCT(--($Q$9:$S$9>0),Q16:S16)/SUMPRODUCT(--($Q$9:$S$9<>0),--(Q16:S16<>\"\")),\"\"),\"\")","v":1},{"$f":"IF(WpAreaB_exist,IF(SUMPRODUCT(--($T$9:$V$9<>0),--(T16:V16<>\"\"))>0,SUMPRODUCT(--($T$9:$V$9>0),T16:V16)/SUMPRODUCT(--($T$9:$V$9<>0),--(T16:V16<>\"\")),\"\"),\"\")","v":""},{"$f":"IF(WpAreaC_exist,IF(SUMPRODUCT(--($W$9:$Y$9<>0),--(W16:Y16<>\"\"))>0,SUMPRODUCT(--($W$9:$Y$9>0),W16:Y16)/SUMPRODUCT(--($W$9:$Y$9<>0),--(W16:Y16<>\"\")),\"\"),\"\")","v":""},null,null,null,null,null,null,"","","",""]
[2,null,36.508000000000003,"6.2.3.1","Test frequencies for signaling test","Update the test frequencies based on the consraints placed on use of the entire band 24 as well as specifying the Tx-Rx spacing for protocol testing","Ligado Networks","RAN5#92 (Aug-21)","R5-215175",null,0.1,{"$f":"getProgress(AB17,AL17,\"%\",1,1)","v":"100%\n(+100%)"},{"$f":"getProgress(AC17,AM17,\"%\",1,1)","v":"100%\n(+100%)"},{"$f":"getProgress(AD17,AN17,\"%\",1,1)","v":""},{"$f":"getProgress(AE17,AO17,\"%\",1,1)","v":""},null,1,null,null,null,null,null,null,null,null,null,null,{"$f":"IF(SUMPRODUCT(--($Q$10:$Y$10>0),--(Q17:Y17<>\"\"))>0,SUMPRODUCT(--($Q$10:$Y$10>0),Q17:Y17)/SUMPRODUCT(--($Q$10:$Y$10>0),--(Q17:Y17<>\"\")),\"\")","v":1},{"$f":"IF(WpAreaA_exist,IF(SUMPRODUCT(--($Q$9:$S$9<>0),--(Q17:S17<>\"\"))>0,SUMPRODUCT(--($Q$9:$S$9>0),Q17:S17)/SUMPRODUCT(--($Q$9:$S$9<>0),--(Q17:S17<>\"\")),\"\"),\"\")","v":1},{"$f":"IF(WpAreaB_exist,IF(SUMPRODUCT(--($T$9:$V$9<>0),--(T17:V17<>\"\"))>0,SUMPRODUCT(--($T$9:$V$9>0),T17:V17)/SUMPRODUCT(--($T$9:$V$9<>0),--(T17:V17<>\"\")),\"\"),\"\")","v":""},{"$f":"IF(WpAreaC_exist,IF(SUMPRODUCT(--($W$9:$Y$9<>0),--(W17:Y17<>\"\"))>0,SUMPRODUCT(--($W$9:$Y$9>0),W17:Y17)/SUMPRODUCT(--($W$9:$Y$9<>0),--(W17:Y17<>\"\")),\"\"),\"\")","v":""},null,null,null,null,null,null,"","","",""]
["LTE RF/RRM"]
["TS 36.521-1: RF test cases - Common parts (general clauses, Annexes)"]
[1,null,"36.521-1",5.2,"Updating Operating Band 24 in 36.101","Updating operating bond with a note that constrains use of DL and UL frequencies","Ligado Networks","RAN5#92 (Aug-21)","R5-215177",null,0.1,null,null,null,null,null,1]
[2,null,"36.521-1",5.3,"Addition of a Tx-Rx spacing for Band 24to align with 36.101","Updating Tx-Rx spacing to include an additional value of -120.5 MHz","Ligado Networks","RAN5#92 (Aug-21)","R5-215177",null,0.1,null,null,null,null,null,1]
["TS 36.521-1: RF test cases - Tx"]
[1,null,"36.521-1 Tx","6.2.2","UE Maximum Output Power","Update the conformance (clause 6.2.2.3) and test requirements (clause 6.2.2.5) due to updates to the lower tolerance value for Band 24 PC3 UE","Ligado Networks","RAN5#93 (Nov-21)","R5-215178","Need to review if update to  message content exception required for SIB2",0.1,{"$f":"getProgress(AB23,AL23,\"%\",1,1)","v":"100%\n(+100%)"},{"$f":"getProgress(AC23,AM23,\"%\",1,1)","v":"100%\n(+100%)"},{"$f":"getProgress(AD23,AN23,\"%\",1,1)","v":""},{"$f":"getProgress(AE23,AO23,\"%\",1,1)","v":""},null,1,null,null,null,null,null,null,null,null,null,null,{"$f":"IF(SUMPRODUCT(--($Q$10:$Y$10>0),--(Q23:Y23<>\"\"))>0,SUMPRODUCT(--($Q$10:$Y$10>0),Q23:Y23)/SUMPRODUCT(--($Q$10:$Y$10>0),--(Q23:Y23<>\"\")),\"\")","v":1},{"$f":"IF(WpAreaA_exist,IF(SUMPRODUCT(--($Q$9:$S$9<>0),--(Q23:S23<>\"\"))>0,SUMPRODUCT(--($Q$9:$S$9>0),Q23:S23)/SUMPRODUCT(--($Q$9:$S$9<>0),--(Q23:S23<>\"\")),\"\"),\"\")","v":1},{"$f":"IF(WpAreaB_exist,IF(SUMPRODUCT(--($T$9:$V$9<>0),--(T23:V23<>\"\"))>0,SUMPRODUCT(--($T$9:$V$9>0),T23:V23)/SUMPRODUCT(--($T$9:$V$9<>0),--(T23:V23<>\"\")),\"\"),\"\")","v":""},{"$f":"IF(WpAreaC_exist,IF(SUMPRODUCT(--($W$9:$Y$9<>0),--(W23:Y23<>\"\"))>0,SUMPRODUCT(--($W$9:$Y$9>0),W23:Y23)/SUMPRODUCT(--($W$9:$Y$9<>0),--(W23:Y23<>\"\")),\"\"),\"\")","v":""},null,null,null,null,null,null,"","","",""]
[2,null,"36.521-1 Tx","6.2.2_s","UE Maximum Output Power for subslot/slot TTI","Update the  test requirement (clause 6.2.2_s.3) due to changes to the lower tolerance value for PC3 B24 UE","Ligado Networks","RAN5#93 (Nov-21)","R5-215178","Need to review if update to  message content exception required for SIB2",0.1,null,null,null,null,null,1]
[3,null,"36.521-1 Tx","6.2.3","Maximum Power Reduction (MPR)","Update the test requirement (clause 6.2.3.5) due to changes to the lower tolerance value for PC3 B24 UE","Ligado Networks, Rohde & Schwarz","RAN5#93 (Nov-21)","R5-215178","Need to review if update to  message content exception required for SIB2",0.1,null,null,null,null,null,1]
[4,null,"36.521-1 Tx","6.2.3_2","Maximum Power Reduction (MPR) for Multi-Cluster PUSCH","Update the test requirement (clause 6.2.3_2.5) due to changes to the lower tolerance value for PC3 B24 UE","Ligado Networks, Rohde & Schwarz","RAN5#93 (Nov-21)","R5-215178","Need to review if update to  message content exception required for SIB2",0.1,null,null,null,null,null,1]
[5,null,"36.521-1 Tx","6.2.3_3","Maximum Power Reduction (MPR) for UL 64QAM","Update the test requirement (clause 6.2.3_3.5) due to changes to the lower tolerance value for PC3 B24 UE","Ligado Networks, Rohde & Schwarz","RAN5#93 (Nov-21)","R5-215178","Need to review if update to  message content exception required for SIB2",0.1,null,null,null,null,null,1]
[6,null,"36.521-1 Tx","6.2.3_4","Maximum Power Reduction (MPR) for Multi-Cluster PUSCH with UL 64QAM","Update the test requirement (clause 6.2.3_4.5) due to changes to the lower tolerance value for PC3 B24 UE","Ligado Networks, Rohde & Schwarz","RAN5#92 (Aug-21)","R5-215178","Need to review if update to  message content exception required for SIB2",0.1,null,null,null,null,null,1]
[7,null,"36.521-1 Tx","6.2.3_5","Maximum Power Reduction (MPR) for UL 256QAM","Update the test requirement (clause 6.2.3_5.5) due to changes to the lower tolerance value for PC3 B24 UE","Ligado Networks, Rohde & Schwarz","RAN5#92 (Aug-21)","R5-215178","Need to review if update to  message content exception required for SIB2",0.1,null,null,null,null,null,1]
[8,null,"36.521-1 Tx","6.2.3.D","Maximum Power Reduction (MPR) for UL ProSe Discovery","Update the test requirement (clause 6.2.D_1.5) due to changes to the lower tolerance value for PC3 B24 UE","Ligado Networks, Rohde & Schwarz","RAN5#92 (Aug-21)","R5-215178","Need to review if update to  message content exception required for SIB2",0.1,null,null,null,null,null,1]
[9,null,"36.521-1 Tx","6.2.4","Additional Maximum Power Reduction (A-MPR)","Updates test applicability (6.2.4.2), conformance requirements (6.2.4.3), test description (6.2.4.4) and test requirement (6.2.4.5) for the new NS_56 and associated A-MPR table for B24 in 36.101","Nokia","RAN5#93 (Nov-21)","R5-215179","Only placeholders for test description and test requirement are being introduced.  The actual configurations and associated test requirements to be introduced in RAN5#93e",0.5,null,null,null,null,null,0.05]
[10,null,"36.521-1 Tx","6.2.4_2","Additional Maximum Power Reduction (A-MPR) for UL 64QAM","Updates  test applicability (6.2.4_2.2), test description (6.2.4_2.4) and test requirement (6.2.4_2.5) for the new NS_56 and associated A-MPR table for B24 in 36.101","Nokia","RAN5#93 (Nov-21)","R5-215179","Only placeholders for test description and test requirement are being introduced.  The actual configurations and associated test requirements to be introduced in RAN5#93e",0.5,null,null,null,null,null,0.05]
[11,null,"36.521-1 Tx","6.2.4_3","Additional Maximum Power Reduction (A-MPR) with PUSCH frequency hopping","Updates test applicability (6.2.4_3.2,), test description (6.2.4_3.4) and test requirement (6.2.4_3.5) for the new NS_56 and associated A-MPR table for B24 in 36.101","Nokia","RAN5#93 (Nov-21)","R5-215179","Only placeholder for test requirement is being introduced.  The actual configurations and associated test requirements to be introduced in RAN5#93e",0.5,null,null,null,null,null,0.05]
[12,null,"36.521-1 Tx","6.2.4_4","Additional Maximum Power Reduction (A-MPR) for UL 256QAM","Updates test applicability (6.2.4_4.2),  test description (6.2.4_4.4) and test requirement (6.2.4_4.5) for the new NS_56 and associated A-MPR table for B24 in 36.101","Nokia","RAN5#93 (Nov-21)","R5-215179","Only placeholders for test description and test requirement are being introduced.  The actual configurations and associated test requirements to be introduced in RAN5#93e",0.5,null,null,null,null,null,0.05]
[13,null,"36.521-1 Tx","6.2.4B","Additional Maximum Power Reduction (A-MPR) for UL-MIMO","Updates test applicability (6.2.4B.2),  test description (6.2.4B.4) and test requirement (6.2.4B.5) for the new NS_56 and associated A-MPR table for B24 in 36.101","Nokia","RAN5#93 (Nov-21)","R5-215179","Only placeholders for test description and test requirement are being introduced.  The actual configurations and associated test requirements to be introduced in RAN5#93e",0.5,null,null,null,null,null,0.05]
[14,null,"36.521-Tx","6.2.4_s","Additional Maximum Power Reduction (A-MPR) for subslot/slot TTI","Updates test applicability (6.2.4_s.2),  conformance requirements (6.2.4_s.3) for the new NS_56 and associated A-MPR table for B24 in 36.101","Ligado Networks","RAN5#93 (Nov-21)","R5-215179",null,0.2,null,null,null,null,null,1]
[15,null,"36.521-Tx","6.6.3.3","Additional Spurious Emissions","Updates conformance requirements (6.6.3.3.3), test description (6.6.3.3.4) and test requirements (6.6.3.3.5) for the new NS_56 and associated additional spurious emssions for B24 in 36.101","Ligado Networks, Nokia","RAN5#93 (Nov-21)","R5-215181","Only place holders for test description is being introduced.  The final configuration table to be introduced in RAN5#93e",0.2,null,null,null,null,null,0.05]
[16,null,"36.521-Tx","6.6.3.3_1","Additional Spurious Emissions for UL 64QAM","Updates test requirements (6.6.3.3_1.4) for the new NS_56 and associated additional spurious emissions for B24 in 36.101","Ligado Networks, Nokia","RAN5#93 (Nov-21)","R5-215181","Only place holders for test description is being introduced.  The final configuration table to be introduced in RAN5#93e",0.2,null,null,null,null,null,0.05]
[17,null,"36.521-Tx","6.6.3.3_2","Additional Spurious Emissions for UL 256QAM","Updates test requirements (6.6.3.3_2.4) for the new NS_56 and associated additional spurious emissions for B24 in 36.101","Ligado Networks, Nokia","RAN5#93 (Nov-21)","R5-215181","Only place holders for test description is being introduced.  The final configuration table to be introduced in RAN5#93e",0.2,null,null,null,null,null,0.05]
[18,null,"36.521-Tx","6.6.3B.3","Additional Spurious Emissions for UL-MIMO","Updates test requirements (6.6.3B.3.4) for the new NS_56 and associated additional spurious emissions for B24 in 36.101","Ligado Networks, Nokia","RAN5#93 (Nov-21)","R5-215181","Only place holders for test description is being introduced.  The final configuration table to be introduced in RAN5#93e",0.2,null,null,null,null,null,0.05]
[19,null,"36.521-1","Annex F.3.2","Derivation of Test Requirements for A-MPR for NS_56","Once configuration Ids are identified for A-MPR test case for NS_56, formulas identified for row 6.2.4 in Table F.3.2-1 need to be mapped","Nokia","RAN5#93 (Nov-21)",null,"Updates to be provided at the next meeting",0.2,null,null,null,null,null,0]
["TS 36.521-1: RF test cases - Rx"]
[1,null,"36.521-1 Rx",7.3,"Reference Senstivity","Update conformance requirements (7.3.3) due to introduction of NS_56 for B24; update test description (7.3.4) due to addition of a new Tx-Rx spacing","Ligado Networks","RAN5#92 (Aug-21)","R5-215186",null,0.1,null,null,null,null,null,1]
[2,null,"36.521-1 Rx","7.6.1","In-band Blocking","Update conformance requirements (7.6.1.3) and test requirements (7.6.1.5) to include B24","Ligado Networks","RAN5#92 (Aug-21)","R5-215187",null,0.1,null,null,null,null,null,1]
["TR 36.905: Test Point analysis receiver and transmitter test cases"]
[1,null,36.905000000000001,"<Clause>","TP for NS_56","TP analysis for NS_56","Nokia","RAN5#93 (Nov-21)",null,"TP analysis for NS_56 is required",0.5,{"$f":"getProgress(AB46,AL46,\"%\",1,1)","v":"0%"},{"$f":"getProgress(AC46,AM46,\"%\",1,1)","v":"0%"},{"$f":"getProgress(AD46,AN46,\"%\",1,1)","v":""},{"$f":"getProgress(AE46,AO46,\"%\",1,1)","v":""},null,0,null,null,null,null,null,null,null,null,null,null,{"$f":"IF(SUMPRODUCT(--($Q$10:$Y$10>0),--(Q46:Y46<>\"\"))>0,SUMPRODUCT(--($Q$10:$Y$10>0),Q46:Y46)/SUMPRODUCT(--($Q$10:$Y$10>0),--(Q46:Y46<>\"\")),\"\")","v":0},{"$f":"IF(WpAreaA_exist,IF(SUMPRODUCT(--($Q$9:$S$9<>0),--(Q46:S46<>\"\"))>0,SUMPRODUCT(--($Q$9:$S$9>0),Q46:S46)/SUMPRODUCT(--($Q$9:$S$9<>0),--(Q46:S46<>\"\")),\"\"),\"\")","v":0},{"$f":"IF(WpAreaB_exist,IF(SUMPRODUCT(--($T$9:$V$9<>0),--(T46:V46<>\"\"))>0,SUMPRODUCT(--($T$9:$V$9>0),T46:V46)/SUMPRODUCT(--($T$9:$V$9<>0),--(T46:V46<>\"\")),\"\"),\"\")","v":""},{"$f":"IF(WpAreaC_exist,IF(SUMPRODUCT(--($W$9:$Y$9<>0),--(W46:Y46<>\"\"))>0,SUMPRODUCT(--($W$9:$Y$9>0),W46:Y46)/SUMPRODUCT(--($W$9:$Y$9<>0),--(W46:Y46<>\"\")),\"\"),\"\")","v":""},null,null,null,null,null,null,"","","",""]
["LTE RAN and CN protocols",null,null,null,null,null,null,null,null,null,null,{"$f":"getProgress(AB47,AL47,\"%\",1,1)","v":""},{"$f":"getProgress(AC47,AM47,\"%\",1,1)","v":""},{"$f":"getProgress(AD47,AN47,\"%\",1,1)","v":""},{"$f":"getProgress(AE47,AO47,\"%\",1,1)","v":""}]
["TS 36.523-1: Protocol test cases"]
["TBD",null,"36.523-1","<Clause>","<Title>",null,"Rohde & Schwarz?","RAN5#93 (Nov-21)",null,"ProSe related test cases need to be updated to reflect the different Tx-Rx spacing for High range",0.2,{"$f":"getProgress(AB49,AL49,\"%\",1,1)","v":"0%"},{"$f":"getProgress(AC49,AM49,\"%\",1,1)","v":"0%"},{"$f":"getProgress(AD49,AN49,\"%\",1,1)","v":""},{"$f":"getProgress(AE49,AO49,\"%\",1,1)","v":""},null,0,null,null,null,null,null,null,null,null,null,null,{"$f":"IF(SUMPRODUCT(--($Q$10:$Y$10>0),--(Q49:Y49<>\"\"))>0,SUMPRODUCT(--($Q$10:$Y$10>0),Q49:Y49)/SUMPRODUCT(--($Q$10:$Y$10>0),--(Q49:Y49<>\"\")),\"\")","v":0},{"$f":"IF(WpAreaA_exist,IF(SUMPRODUCT(--($Q$9:$S$9<>0),--(Q49:S49<>\"\"))>0,SUMPRODUCT(--($Q$9:$S$9>0),Q49:S49)/SUMPRODUCT(--($Q$9:$S$9<>0),--(Q49:S49<>\"\")),\"\"),\"\")","v":0},{"$f":"IF(WpAreaB_exist,IF(SUMPRODUCT(--($T$9:$V$9<>0),--(T49:V49<>\"\"))>0,SUMPRODUCT(--($T$9:$V$9>0),T49:V49)/SUMPRODUCT(--($T$9:$V$9<>0),--(T49:V49<>\"\")),\"\"),\"\")","v":""},{"$f":"IF(WpAreaC_exist,IF(SUMPRODUCT(--($W$9:$Y$9<>0),--(W49:Y49<>\"\"))>0,SUMPRODUCT(--($W$9:$Y$9>0),W49:Y49)/SUMPRODUCT(--($W$9:$Y$9<>0),--(W49:Y49<>\"\")),\"\"),\"\")","v":""},null,null,null,null,null,null,"","","",""]
["TS 36.523-3: Protocol test suites (TTCN)"]
[1,null,"36.523-3",11.1,"Updates to guidelines on test execution for LTE Band 24","Update guidelines to test executions given that only 2 5 MHz channels can be operated due to constraints on  DL frequency range operation","Ligado Networks","RAN5#92 (Aug-21)","R5-215176",null,0.1,{"$f":"getProgress(AB51,AL51,\"%\",1,1)","v":"100%\n(+100%)"},{"$f":"getProgress(AC51,AM51,\"%\",1,1)","v":"100%\n(+100%)"},{"$f":"getProgress(AD51,AN51,\"%\",1,1)","v":""},{"$f":"getProgress(AE51,AO51,\"%\",1,1)","v":""},null,1,null,null,null,null,null,null,null,null,null,null,{"$f":"IF(SUMPRODUCT(--($Q$10:$Y$10>0),--(Q51:Y51<>\"\"))>0,SUMPRODUCT(--($Q$10:$Y$10>0),Q51:Y51)/SUMPRODUCT(--($Q$10:$Y$10>0),--(Q51:Y51<>\"\")),\"\")","v":1},{"$f":"IF(WpAreaA_exist,IF(SUMPRODUCT(--($Q$9:$S$9<>0),--(Q51:S51<>\"\"))>0,SUMPRODUCT(--($Q$9:$S$9>0),Q51:S51)/SUMPRODUCT(--($Q$9:$S$9<>0),--(Q51:S51<>\"\")),\"\"),\"\")","v":1},{"$f":"IF(WpAreaB_exist,IF(SUMPRODUCT(--($T$9:$V$9<>0),--(T51:V51<>\"\"))>0,SUMPRODUCT(--($T$9:$V$9>0),T51:V51)/SUMPRODUCT(--($T$9:$V$9<>0),--(T51:V51<>\"\")),\"\"),\"\")","v":""},{"$f":"IF(WpAreaC_exist,IF(SUMPRODUCT(--($W$9:$Y$9<>0),--(W51:Y51<>\"\"))>0,SUMPRODUCT(--($W$9:$Y$9>0),W51:Y51)/SUMPRODUCT(--($W$9:$Y$9<>0),--(W51:Y51<>\"\")),\"\"),\"\")","v":""},null,null,null,null,null,null,"","","",""]
[2,null,"36.523-3",11.2,"EUTRA - UTRAN - GERAN","Update guidelines for IRAT test execution","Ligado Networks","RAN5#92 (Aug-21)","R5-215176",null,0.1,null,null,null,null,null,1]
["End of workplan items.  Note! Do not remove this row. Introduce new work plan rows/items above this row.",null,null,null,null,null,null,null,null,null,null,null,null,null,null,null,null,null,null,null,null,null,null,null,null,null,null,"End of source data"]

{"sheet":"WP configuration","index":2,"n_rows":50,"n_cols":4,"rows_kept":50,"cut":false,"hidden":false,"merged":[[37,0,37,1],[48,0,48,1],[49,0,58,1],[46,0,46,1],[38,0,38,1],[28,0,28,1],[36,0,36,1],[1,0,1,1],[0,0,0,1],[16,0,16,1],[29,0,29,1],[30,0,30,1]]}
["Configure work plan properties",null,null,"WP support data - DO NOT EDIT THIS COLUMN"]
["Work plan scope"]
[null,"Define WP scope",null,"Active WP scope"]
["WP area A","LTE",null,{"$f":"IF(OR(B4=\"\",B4=\"N/A\"),\"N/A\",B4)","v":"LTE"}]
["sub-area#1","FDD",null,{"$f":"IF(D4=\"N/A\",\"N/A\",IF(OR(B5=\"\",B5=\"N/A\"),\"\",B5))","v":"FDD"}]
["sub-area#2","N/A",null,{"$f":"IF(OR(D5=\"N/A\",D5=\"-\"),\"N/A\",IF(B6=\"\",\"N/A\",B6))","v":"N/A"}]
["sub-area#3","FR1 + FR2",null,{"$f":"IF(OR(D6=\"N/A\",D6=\"-\"),\"N/A\",IF(B7=\"\",\"N/A\",B7))","v":"N/A"}]
["WP area B","N/A",null,{"$f":"IF(OR($D$4=\"N/A\",$B$8=\"\"),\"N/A\",B8)","v":"N/A"}]
["sub-area#1","FR1",null,{"$f":"IF(OR(D8=\"N/A\",B9=\"N/A\"),\"N/A\",IF(B9=\"\",\"\",B9))","v":"N/A"}]
["sub-area#2","FR2",null,{"$f":"IF(OR(D9=\"N/A\",B10=\"\"),\"N/A\",IF(B10=\"\",\"N/A\",B10))","v":"N/A"}]
["sub-area#3","FR1 + FR2",null,"N/A"]
["WP area C","LTE",null,{"$f":"IF(OR($D$8=\"N/A\",$B$12=\"\"),\"N/A\",B12)","v":"N/A"}]
["sub-area#1","FDD",null,{"$f":"IF(OR(D12=\"N/A\",B13=\"N/A\"),\"N/A\",IF(B13=\"\",\"\",B13))","v":"N/A"}]
["sub-area#2","TDD",null,{"$f":"IF(OR(D13=\"N/A\",$B$13=\"\"),\"N/A\",IF(B14=\"\",\"N/A\",B14))","v":"N/A"}]
["sub-area#3","FDD + TDD",null,"N/A"]
[]
["RAN5 meetings used as target values in WP"]
[null,"RAN5#88-e (Aug-20)"]
[null,"RAN5#89-e (Nov-20)"]
[null,"RAN5#90-e (Feb-21)"]
[null,"RAN5#91-e (May-21)"]
[null,"RAN5#92 (Aug-21)"]
[null,"RAN5#93 (Nov-21)"]
[null,"RAN5#94 (Feb-22)"]
[null,"RAN5#95 (May-22)"]
[null,"RAN5#96 (Aug-22)"]
[null,"RAN5#97 (Nov-22)"]
[null,"TBD"]
["End of list (insert/replace any additional meetings above the 'TBD' row)"]
[]
["WP areas (used above for selecting WP area scope)"]
[null,"SA Option 2 (SA NR)"]
[null,"NSA Option 3 (EN-DC)"]
[null,"PX5"]
[null,"LTE"]
[null,"N/A"]
["End of list (insert any additional areas above the 'N/A' row)"]
[]
["WP sub-areas (used above for selecting WP sub-area scope)"]
[null,"FR1"]
[null,"FR2"]
[null,"FR1 + FR2"]
[null,"FDD"]
[null,"TDD"]
[null,"FDD + TDD"]
[null,"N/A"]
["End of list (insert any additional areas above the 'N/A' row)"]
[]
["Completion Compensation"]
["After that completion progress has been reported in a status report to a RAN Plenary it should not be decreased due to late new tasks are added to the work plan or due to corrections of the work plan. \nThe earlier reported completion status should be kept until necessary progress have been achieved such that completion exceeds the earlier reported completion level. The difference between reported completion and actual completion level is handled by adding a Completion Compensation to the overlal work item completion level.\nIf needed the Completion Compensation can be reset to zero (0) by the 'Reset Completion Compensation' button."]