{"text_format":"1","workbook":"xlsx","n_sheets":3,"sheets":["Cover sheet","WP","WP configuration"],"not_rendered":{"charts":0,"images":0,"macros":1,"external_links":0,"defined_names":92,"comments":2,"pivot_tables":0},"unopened":[],"bounds":{"document_bytes":16777216,"sheet_cells":100000,"rows_first":2000,"rows_last":500,"rows_between":2000,"halvings":0,"cell_chars":16384,"cell_head_chars":4096},"cells_cut":0,"cells_raw":0,"read":"whole","date_system":"1900"}

{"sheet":"Cover sheet","index":0,"n_rows":59,"n_cols":121,"rows_kept":59,"cut":false,"hidden":false,"merged":[[0,41,0,42],[0,118,0,119],[1,1,1,11],[1,13,1,15],[1,118,1,119],[2,1,2,13],[2,41,2,42],[2,118,2,119],[4,2,4,15],[5,2,5,15],[6,2,6,15],[7,2,7,15],[9,2,9,15],[10,9,10,15],[17,1,17,35],[17,46,17,106],[18,1,18,2],[18,7,18,15],[18,40,18,43],[18,46,18,80],[18,82,18,116],[18,118,18,119],[19,1,19,2],[19,7,19,15],[19,40,19,43],[20,1,20,2],[20,4,20,15],[20,40,20,43],[21,3,21,15],[21,40,21,43],[22,1,22,35],[22,40,22,43],[23,7,23,15],[23,40,23,43],[24,1,24,2],[24,7,24,15],[24,40,24,43],[25,1,25,2],[25,7,25,15],[25,40,25,43],[26,1,26,2],[26,7,26,15],[26,40,26,43],[27,1,27,2],[27,7,27,15],[27,40,27,43],[28,1,28,2],[28,7,28,15],[28,40,28,43],[29,1,29,2],[29,7,29,15],[29,40,29,43],[30,1,30,2],[30,7,30,15],[30,40,30,43],[31,1,31,2],[31,7,31,15],[31,40,31,43],[32,1,32,2],[32,7,32,15],[32,40,32,43],[33,1,33,2],[33,7,33,15],[33,40,33,43],[34,1,34,2],[34,7,34,15],[34,40,34,43],[35,1,35,2],[35,7,35,15],[35,40,35,43],[36,40,36,43],[37,1,37,35],[37,40,37,43],[38,3,38,5],[38,7,38,15],[38,17,38,25],[38,27,38,35],[38,40,38,43],[39,7,39,9],[39,10,39,12],[39,13,39,15],[39,17,39,19],[39,20,39,22],[39,23,39,25],[39,27,39,29],[39,30,39,32],[39,33,39,35],[39,40,39,43],[40,40,40,43],[41,1,41,2],[42,1,42,2],[44,1,44,2],[51,1,51,2],[55,46,55,106],[58,2,58,15],[39,1,40,1],[39,2,40,2],[39,3,40,3],[39,4,40,4],[39,5,40,5],[0,39,17,39],[0,45,17,45],[18,81,22,81],[12,46,16,116],[7,46,10,106],[4,46,6,106],[12,1,15,15]]}
[null,null,null,null,null,null,null,null,null,null,null,null,null,null,null,null,null,null,null,null,null,null,null,null,null,null,null,null,null,null,null,null,null,null,null,null,null,null,null,"End of Cover Sheet",null,"Rapporteur's tools",null,null,null,"Start of Current Meeting Data",null,null,null,null,null,null,null,null,null,null,null,null,null,null,null,null,null,null,null,null,null,null,null,null,null,null,null,null,null,null,null,null,null,null,null,null,null,null,null,null,null,null,null,null,null,null,null,null,null,null,null,null,null,null,null,null,null,null,null,null,null,null,null,null,null,null,null,null,null,null,null,null,"Overall completion"]
[null,"3GPP TSG-RAN5 Meeting #103",null,null,null,null,null,null,null,null,null,null,null,"R5-YYXXXX",null,null,null,null,null,null,null,null,null,null,null,null,null,null,null,null,null,null,null,null,null,null,null,null,null,null,null,null,null,null,null,null,null,null,null,null,null,null,null,null,null,null,null,null,null,null,null,null,null,null,null,null,null,null,null,null,null,null,null,null,null,null,null,null,null,null,null,null,null,null,null,null,null,null,null,null,null,null,null,null,null,null,null,null,null,null,null,null,null,null,null,null,null,null,null,null,null,null,null,null,null,null,null,null,{"$f":"IF(OverallWp_SumWeights>0,(IF(AX26<>\"\",AX26*WP!AB10,0)+IF(AX27<>\"\",AX27*WP!AC10,0)+IF(AX28<>\"\",AX28*WP!AD10,0)+IF(AX30<>\"\",AX30*WP!AE10,0)+IF(AX31<>\"\",AX31*WP!AF10,0)+IF(AX32<>\"\",AX32*WP!AG10,0)+IF(AX34<>\"\",AX34*WP!AH10,0)+IF(AX35<>\"\",AX35*WP!AI10,0)+IF(AX36<>\"\",AX36*WP!AJ10,0))/OverallWp_SumWeights,0)","v":0.05}]
[null,"Fukuoka, Japan, May 20 – 24 , 2024",null,null,null,null,null,null,null,null,null,null,null,null,null,null,null,null,null,null,null,null,null,null,null,null,null,null,null,null,null,null,null,null,null,null,null,null,null,null,null,null,null,null,null,null,null,null,null,null,null,null,null,null,null,null,null,null,null,null,null,null,null,null,null,null,null,null,null,null,null,null,null,null,null,null,null,null,null,null,null,null,null,null,null,null,null,null,null,null,null,null,null,null,null,null,null,null,null,null,null,null,null,null,null,null,null,null,null,null,null,null,null,null,null,null,null,null,{"$f":"IFERROR(IF(CH20-DO2>0,CH20-DO2,0),0)","v":0}]
[]
[null,"Agenda Item:","7.5.2",null,null,null,null,null,null,null,null,null,null,null,null,null,null,null,null,null,null,null,null,null,null,null,null,null,null,null,null,null,null,null,null,null,null,null,null,null,null,null,"Edit/Protect status of cover sheet",null,null,null,null,null,null,null,null,null,null,null,null,null,null,null,null,null,null,null,null,null,null,null,null,null,null,null,null,null,null,null,null,null,null,null,null,null,null,null,null,null,null,null,null,null,null,null,null,null,null,null,null,null,null,null,null,null,null,null,null,null,null,null,null,null,null,null,null,null,null,null,null,null,null,null,null,"First status column in WP","Last status column in WP"]
[null,"Source:","CMCC,Mediatek,CAICT",null,null,null,null,null,null,null,null,null,null,null,null,null,null,null,null,null,null,null,null,null,null,null,null,null,null,null,null,null,null,null,null,null,null,null,null,null,null,null,"Protected",null,null,null,null,null,null,null,null,null,null,null,null,null,null,null,null,null,null,null,null,null,null,null,null,null,null,null,null,null,null,null,null,null,null,null,null,null,null,null,null,null,null,null,null,null,null,null,null,null,null,null,null,null,null,null,null,null,null,null,null,null,null,null,null,null,null,null,null,null,null,null,null,null,null,null,null,{"$f":"SUBSTITUTE(ADDRESS(1,COLUMN(StartOfWPstsCol)+1,4),\"1\",\"\")","v":"Q"},{"$f":"IF(WpAreaB_exist=FALSE,WpAreaA_Sub3_Column,IF(WpAreaC_exist=FALSE,WpAreaB_Sub3_Column,WpAreaC_Sub3_Column))","v":"S"}]
[null,"Title:","UE Conformance - IoT NTN enhancements",null,null,null,null,null,null,null,null,null,null,null,null,null,null,null,null,null,null,null,null,null,null,null,null,null,null,null,null,null,null,null,null,null,null,null,null,null,null,null,"Changed to Protected when switching worksheet",null,null,null,null,null,null,null,null,null,null,null,null,null,null,null,null,null,null,null,null,null,null,null,null,null,null,null,null,null,null,null,null,null,null,null,null,null,null,null,null,null,null,null,null,null,null,null,null,null,null,null,null,null,null,null,null,null,null,null,null,null,null,null,null,null,null,null,null,null,null,null,null,null,null,null,null,"First row WP items","Last row WP items"]
[null,"Work item code:","IoT_NTN_enh_plus_CT1-UEConTest",null,null,null,null,null,null,null,null,null,null,null,null,null,null,null,null,null,null,null,null,null,null,null,null,null,null,null,null,null,null,null,null,null,null,null,null,null,null,null,null,null,null,null,null,null,null,null,null,null,null,null,null,null,null,null,null,null,null,null,null,null,null,null,null,null,null,null,null,null,null,null,null,null,null,null,null,null,null,null,null,null,null,null,null,null,null,null,null,null,null,null,null,null,null,null,null,null,null,null,null,null,null,null,null,null,null,null,null,null,null,null,null,null,null,null,null,{"$f":"ROW(StartWpItems)","v":12},{"$f":"ROW(EndWPitems)","v":79}]
[null,"Release:","Rel-18"]
[null,"Document for:        ","Information",null,null,null,null,null,null,null,null,null,null,null,null,null,null,null,null,null,null,null,null,null,null,null,null,null,null,null,null,null,null,null,null,null,null,null,null,null,null,null,"Current baseline for progress indication:"]
[null,null,null,null,null,null,null,null,null,"RAN5 WP template v3.0.0",null,null,null,null,null,null,null,null,null,null,null,null,null,null,null,null,null,null,null,null,null,null,null,null,null,null,null,null,null,null,null,null,"2021-01-13 (09:27:52)"]
[null,"1. Introduction"]
[null,"At RAN#103 meeting in March 2024, a Release 18 work item for UE Conformance - IoT NTN enhancements plus CT1 aspects  core & performance requirements for Non-Terrestrial Networks (NTN) was approved [1].\nThe objective of this work item is to define the UE conformance requirements corresponding to WID on IoT NTN UE with Unique identifier 1030073. This work item will cover RF/RRM/Demod conformance test specifications with IoT NTN.",null,null,null,null,null,null,null,null,null,null,null,null,null,null,null,null,null,null,null,null,null,null,null,null,null,null,null,null,null,null,null,null,null,null,null,null,null,null,null,null,null,null,null,null,"Source data used for calculating current status and progress from previous meeting"]
[]
[]
[]
[null,"2. Work item status"]
[null,"Estimation of WI overall completion:",null,null,null,null,null,null,null,null,null,null,null,null,null,null,null,null,null,null,null,null,null,null,null,null,null,null,null,null,null,null,null,null,null,null,null,null,null,null,null,null,null,null,null,null,"Start of source data"]
[null,"Area",null,"Completion\n\n","Number of new completed test cases\n(Note 1)","Number of new test cases",null,"Comments",null,null,null,null,null,null,null,null,null,null,null,null,null,null,null,null,null,null,null,null,null,null,null,null,null,null,null,null,null,null,"\n\n\n\n",null,"Don't remove this row",null,null,null,null,null,"Current meeting status",null,null,null,null,null,null,null,null,null,null,null,null,null,null,null,null,null,null,null,null,null,null,null,null,null,null,null,null,null,null,null,null,null,null,"End of Current Meeting Data","Previous meeting status baseline",null,null,null,null,null,null,null,null,null,null,null,null,null,null,null,null,null,null,null,null,null,null,null,null,null,null,null,null,null,null,null,null,null,null,null,"Sum WP weights"]
[null,"Overall completion\n",null,{"$f":"getProgress(AX20,CH20,\"%\",0,1)","v":"5%\n(+5%)"},{"$f":"getProgress(AY20,CI20,,,1)","v":"0"},{"$f":"getProgress(AZ20,CJ20,,,1)","v":"12\n(+12)"},null,null,null,null,null,null,null,null,null,null,null,null,null,null,null,null,null,null,null,null,null,null,null,null,null,null,null,null,null,null,null,null,null,null,"Don't remove this row",null,null,null,null,null,null,null,null,{"$f":"IF(OverallWp_SumWeights>0,DO2+DO3,\"\")","v":0.05},{"$f":"IF(SUMPRODUCT(--(INDIRECT(WpIsNewTC_Rng)=\"Y\"),--(INDIRECT(WpOverall_Rng)=1),--(INDIRECT(WpWeight_Rng)>0))>0,SUMPRODUCT(--(INDIRECT(WpIsNewTC_Rng)=\"Y\"),--(INDIRECT(WpOverall_Rng)=1),INDIRECT(WpWeight_Rng)),IF(AZ20<>\"\",0,\"\"))","v":0},{"$f":"IF(SUMPRODUCT(--(INDIRECT(WpIsNewTC_Rng)=\"Y\"),--(INDIRECT(WpOverall_Rng)<>\"\"),--(INDIRECT(WpWeight_Rng)>0))<>0,SUMPRODUCT(--(INDIRECT(WpIsNewTC_Rng)=\"Y\"),--(INDIRECT(WpOverall_Rng)<>\"\"),INDIRECT(WpWeight_Rng)),\"\")","v":12},null,null,null,null,null,null,null,null,null,null,null,null,null,null,null,null,null,null,null,null,null,null,null,null,null,null,null,null,null,null,null,null,null,null,"","",null,null,null,null,null,null,null,null,null,null,null,null,null,null,null,null,null,null,null,null,null,null,null,null,null,null,null,null,null,null,"WP area A",{"$f":"IF(WpAreaA_exist,SUM(WP!AB10:AD10),0)","v":19.4}]
[null,"Completion Compensation ",null,{"$f":"IF(AND(D20<>\"\",DO3>0),DO3,\"-\")","v":"-"},null,null,null,null,null,null,null,null,null,null,null,null,null,null,null,null,null,null,null,null,null,null,null,null,null,null,null,null,null,null,null,null,null,null,null,null,"Don't remove this row",null,null,null,null,null,null,null,null,null,null,null,null,null,null,null,null,null,null,null,null,null,null,null,null,null,null,null,null,null,null,null,null,null,null,null,null,null,null,null,null,null,null,null,null,null,null,null,null,null,null,null,null,null,null,null,null,null,null,null,null,null,null,null,null,null,null,null,null,null,null,null,null,null,null,null,null,null,"WP area B",{"$f":"IF(WpAreaB_exist,SUM(WP!AE10:AG10),0)","v":0}]
["\n\n",null,"Note 1: ","Only test cases completed for all applicable WP areas and sub-areas are counted. For completed test cases per WP areas and WP sub-areas see below.",null,null,null,null,null,null,null,null,null,null,null,null,null,null,null,null,null,null,null,null,null,null,null,null,null,null,null,null,null,null,null,null,null,null,null,null,"Don't remove this row",null,null,null,null,null,null,null,null,null,null,null,null,null,null,null,null,null,null,null,null,null,null,null,null,null,null,null,null,null,null,null,null,null,null,null,null,null,null,null,null,null,null,null,null,null,null,null,null,null,null,null,null,null,null,null,null,null,null,null,null,null,null,null,null,null,null,null,null,null,null,null,null,null,null,null,null,null,"WP area C",{"$f":"IF(WpAreaC_exist,SUM(WP!AH10:AJ10),0)","v":0}]
[null,"Estimation WI completion per area and sub-area:",null,null,null,null,null,null,null,null,null,null,null,null,null,null,null,null,null,null,null,null,null,null,null,null,null,null,null,null,null,null,null,null,null,null,null,null,null,null,"Don't remove this row",null,null,null,null,null,null,null,null,null,null,null,null,null,null,null,null,null,null,null,null,null,null,null,null,null,null,null,null,null,null,null,null,null,null,null,null,null,null,null,null,null,null,null,null,null,null,null,null,null,null,null,null,null,null,null,null,null,null,null,null,null,null,null,null,null,null,null,null,null,null,null,null,null,null,null,null,null,"Overall",{"$f":"SUM(DP20:DP22)","v":19.4}]
["\n",null,null,"Completion\n\n","Number of new completed test cases","Number of new test cases",null,"Comments",null,null,null,null,null,null,null,null,null,null,null,null,null,null,null,null,null,null,null,null,null,null,null,null,null,null,null,null,null,null,"\n",null,"Don't remove this row",null,null,null,null,null,null,null,null,null,null,null,null,null,null,null,null,null,null,null,null,null,null,null,null,null,null,null,null,null,null,null,null,null,null,null,null,null,null,null,null,null,null,null,null,null,null,null,null,null,null,null,null,null,null,null,null,null,null,null,null,null,null,null,null,null,null,null,null,null,null,null,null,null,null,null,null,null,null,"Column","Range"]
["\n",{"$f":"IF(WpAreaA_exist,IF(WpAreaA_Sub2_exist,WpAreaA,WpAreaA&IF(WpAreaA_Sub1<>\"\",\" (\"&WpAreaA_Sub1&\")\",\"\")),\"WP Scope not defined\")","v":"LTE (FDD)"},null,{"$f":"getProgress(AX25,CH25,\"%\",1,1)","v":"5%\n(+5%)"},{"$f":"getProgress(AY25,CI25,,,1)","v":"0"},{"$f":"getProgress(AZ25,CJ25,,,1)","v":"12\n(+12)"},null,null,null,null,null,null,null,null,null,null,null,null,null,null,null,null,null,null,null,null,null,null,null,null,null,null,null,null,null,null,null,null,null,null,"Don't remove this row",null,null,null,null,null,null,null,null,{"$f":"IF(WpAreaA_exist,IF(WpAreaA_SumWeights>0,(IF(AX26<>\"\",AX26*WP!$AB$10,0)+IF(AX27<>\"\",AX27*WP!$AC$10,0)+IF(AX28<>\"\",AX28*WP!$AD$10,0))/WpAreaA_SumWeights,\"\"),\"\")","v":0.05},{"$f":"IF(WpAreaA_exist,IF(SUMPRODUCT(--(INDIRECT(WpIsNewTC_Rng)=\"Y\"),--(INDIRECT(WpAreaAoverall_Rng)=1),--(INDIRECT(WpWeight_Rng)>0))<>0,SUMPRODUCT(--(INDIRECT(WpIsNewTC_Rng)=\"Y\"),--(INDIRECT(WpAreaAoverall_Rng)=1),INDIRECT(WpWeight_Rng)),IF(AZ25<>\"\",0,\"\")),\"\")","v":0},{"$f":"IF(WpAreaA_exist,IF(SUMPRODUCT(--(INDIRECT(WpIsNewTC_Rng)=\"Y\"),--(INDIRECT(WpAreaAoverall_Rng)<>\"\"),--(INDIRECT(WpWeight_Rng)>0))<>0,SUMPRODUCT(--(INDIRECT(WpIsNewTC_Rng)=\"Y\"),--(INDIRECT(WpAreaAoverall_Rng)<>\"\"),INDIRECT(WpWeight_Rng)),\"\"),\"\")","v":12},null,null,null,null,null,null,null,null,null,null,null,null,null,null,null,null,null,null,null,null,null,null,null,null,null,null,null,null,null,null,null,null,null,"","","",null,null,null,null,null,null,null,null,null,null,null,null,null,null,null,null,null,null,null,null,null,null,null,null,null,null,null,null,null,null,"Is new text case",{"$f":"SUBSTITUTE(ADDRESS(1,COLUMN(WP!$B$6),4),\"1\",\"\")","v":"B"},{"$f":"\"WP!$\"&DP25&\"$\"&FirstRowWPitems&\":$\"&DP25&\"$\"&LastRowWPitems","v":"WP!$B$12:$B$79"}]
[null,{"$f":"IF(WpAreaA_exist,WpAreaA_Sub1,\"N/A\")","v":"FDD"},null,{"$f":"getProgress(AX26,CH26,\"%\",1,1)","v":"5%\n(+5%)"},{"$f":"getProgress(AY26,CI26,,,1)","v":"0"},{"$f":"getProgress(AZ26,CJ26,,,1)","v":"12\n(+12)"},null,null,null,null,null,null,null,null,null,null,null,null,null,null,null,null,null,null,null,null,null,null,null,null,null,null,null,null,null,null,null,null,null,null,"Don't remove this row",null,null,null,null,null,null,null,null,{"$f":"IF(WpAreaA_Sub1_exist,WP!$AB$8,\"\")","v":0.05},{"$f":"IF(WpAreaA_exist,IF(SUMPRODUCT(--(INDIRECT(WpIsNewTC_Rng)=\"Y\"),--(INDIRECT(WpAreaA_Sub1_Rng)=1),--(INDIRECT(WpWeight_Rng)>0))<>0,SUMPRODUCT(--(INDIRECT(WpIsNewTC_Rng)=\"Y\"),--(INDIRECT(WpAreaA_Sub1_Rng)=1),INDIRECT(WpWeight_Rng)),IF(AZ26<>\"\",0,\"\")),\"\")","v":0},{"$f":"IF(WpAreaA_exist,IF(SUMPRODUCT(--(INDIRECT(WpIsNewTC_Rng)=\"Y\"),--(INDIRECT(WpAreaA_Sub1_Rng)<>\"\"),--(INDIRECT(WpWeight_Rng)>0))<>0,SUMPRODUCT(--(INDIRECT(WpIsNewTC_Rng)=\"Y\"),--(INDIRECT(WpAreaA_Sub1_Rng)<>\"\"),INDIRECT(WpWeight_Rng)),\"\"),\"\")","v":12},null,null,null,null,null,null,null,null,null,null,null,null,null,null,null,null,null,null,null,null,null,null,null,null,null,null,null,null,null,null,null,null,null,"","","",null,null,null,null,null,null,null,null,null,null,null,null,null,null,null,null,null,null,null,null,null,null,null,null,null,null,null,null,null,null,"TS/TR",{"$f":"SUBSTITUTE(ADDRESS(1,COLUMN(WP!$C$6),4),\"1\",\"\")","v":"C"},"WP!$C$12:$C$79"]
[null,{"$f":"IF(WpAreaA_exist,WpAreaA_Sub2,\"N/A\")","v":"N/A"},null,{"$f":"getProgress(AX27,CH27,\"%\",1,1)","v":""},{"$f":"getProgress(AY27,CI27,,,1)","v":""},{"$f":"getProgress(AZ27,CJ27,,,1)","v":""},null,null,null,null,null,null,null,null,null,null,null,null,null,null,null,null,null,null,null,null,null,null,null,null,null,null,null,null,null,null,null,null,null,null,"Don't remove this row",null,null,null,null,null,null,null,null,{"$f":"IF(WpAreaA_Sub2_exist,WP!$AC$8,\"\")","v":""},{"$f":"IF(WpAreaA_exist,IF(SUMPRODUCT(--(INDIRECT(WpIsNewTC_Rng)=\"Y\"),--(INDIRECT(WpAreaA_Sub2_Rng)=1),--(INDIRECT(WpWeight_Rng)>0))<>0,SUMPRODUCT(--(INDIRECT(WpIsNewTC_Rng)=\"Y\"),--(INDIRECT(WpAreaA_Sub2_Rng)=1),INDIRECT(WpWeight_Rng)),IF(AZ27<>\"\",0,\"\")),\"\")","v":""},{"$f":"IF(WpAreaA_exist,IF(SUMPRODUCT(--(INDIRECT(WpIsNewTC_Rng)=\"Y\"),--(INDIRECT(WpAreaA_Sub2_Rng)<>\"\"),--(INDIRECT(WpWeight_Rng)>0))<>0,SUMPRODUCT(--(INDIRECT(WpIsNewTC_Rng)=\"Y\"),--(INDIRECT(WpAreaA_Sub2_Rng)<>\"\"),INDIRECT(WpWeight_Rng)),\"\"),\"\")","v":""},null,null,null,null,null,null,null,null,null,null,null,null,null,null,null,null,null,null,null,null,null,null,null,null,null,null,null,null,null,null,null,null,null,"","","",null,null,null,null,null,null,null,null,null,null,null,null,null,null,null,null,null,null,null,null,null,null,null,null,null,null,null,null,null,null,"Weight",{"$f":"SUBSTITUTE(ADDRESS(1,COLUMN(WP!$K$6),4),\"1\",\"\")","v":"K"},"WP!$K$12:$K$79"]
[null,{"$f":"IF(WpAreaA_exist,WpAreaA_Sub3,\"N/A\")","v":"N/A"},null,{"$f":"getProgress(AX28,CH28,\"%\",1,1)","v":""},{"$f":"getProgress(AY28,CI28,,,1)","v":""},{"$f":"getProgress(AZ28,CJ28,,,1)","v":""},null,null,null,null,null,null,null,null,null,null,null,null,null,null,null,null,null,null,null,null,null,null,null,null,null,null,null,null,null,null,null,null,"\n",null,"Don't remove this row",null,null,null,null,null,null,null,null,{"$f":"IF(WpAreaA_Sub3_exist,WP!$AD$8,\"\")","v":""},{"$f":"IF(WpAreaA_exist,IF(SUMPRODUCT(--(INDIRECT(WpIsNewTC_Rng)=\"Y\"),--(INDIRECT(WpAreaA_Sub3_Rng)=1),--(INDIRECT(WpWeight_Rng)>0))<>0,SUMPRODUCT(--(INDIRECT(WpIsNewTC_Rng)=\"Y\"),--(INDIRECT(WpAreaA_Sub3_Rng)=1),INDIRECT(WpWeight_Rng)),IF(AZ28<>\"\",0,\"\")),\"\")","v":""},{"$f":"IF(WpAreaA_exist,IF(SUMPRODUCT(--(INDIRECT(WpIsNewTC_Rng)=\"Y\"),--(INDIRECT(WpAreaA_Sub3_Rng)<>\"\"),--(INDIRECT(WpWeight_Rng)>0))<>0,SUMPRODUCT(--(INDIRECT(WpIsNewTC_Rng)=\"Y\"),--(INDIRECT(WpAreaA_Sub3_Rng)<>\"\"),INDIRECT(WpWeight_Rng)),\"\"),\"\")","v":""},null,null,null,null,null,null,null,null,null,null,null,null,null,null,null,null,null,null,null,null,null,null,null,null,null,null,null,null,null,null,null,null,null,"","","",null,null,null,null,null,null,null,null,null,null,null,null,null,null,null,null,null,null,null,null,null,null,null,null,null,null,null,null,null,null,"Overall",{"$f":"SUBSTITUTE(ADDRESS(1,COLUMN(WP!$AB$6),4),\"1\",\"\")","v":"AB"},"WP!$AB$12:$AB$79"]
[null,{"$f":"IF(WpAreaB_exist,WpAreaB,\"N/A\")","v":"N/A"},null,{"$f":"getProgress(AX29,CH29,\"%\",1,1,WpAreaB_exist)","v":""},{"$f":"getProgress(AY29,CI29,,,1,WpAreaB_exist)","v":""},{"$f":"getProgress(AZ29,CJ29,,,1,WpAreaB_exist)","v":""},null,null,null,null,null,null,null,null,null,null,null,null,null,null,null,null,null,null,null,null,null,null,null,null,null,null,null,null,null,null,null,null,"\n",null,"Don't remove this row",null,null,null,null,null,null,null,null,{"$f":"IF(WpAreaB_exist,IF(WpAreaB_SumWeights>0,(IF(AX30<>\"\",AX30*WP!$AE$10,0)+IF(AX31<>\"\",AX31*WP!$AF$10,0)+IF(AX32<>\"\",AX32*WP!$AG$10,0))/WpAreaB_SumWeights,\"\"),\"\")","v":""},{"$f":"IF(WpAreaB_exist,IF(SUMPRODUCT(--(INDIRECT(WpIsNewTC_Rng)=\"Y\"),--(INDIRECT(WpAreaBoverall_Rng)=1),--(INDIRECT(WpWeight_Rng)>0))<>0,SUMPRODUCT(--(INDIRECT(WpIsNewTC_Rng)=\"Y\"),--(INDIRECT(WpAreaBoverall_Rng)=1),INDIRECT(WpWeight_Rng)),IF(AZ29<>\"\",0,\"\")),\"\")","v":""},{"$f":"IF(WpAreaB_exist,IF(SUMPRODUCT(--(INDIRECT(WpIsNewTC_Rng)=\"Y\"),--(INDIRECT(WpAreaBoverall_Rng)<>\"\"),--(INDIRECT(WpWeight_Rng)>0))<>0,SUMPRODUCT(--(INDIRECT(WpIsNewTC_Rng)=\"Y\"),--(INDIRECT(WpAreaBoverall_Rng)<>\"\"),INDIRECT(WpWeight_Rng)),\"\"),\"\")","v":""},null,null,null,null,null,null,null,null,null,null,null,null,null,null,null,null,null,null,null,null,null,null,null,null,null,null,null,null,null,null,null,null,null,"","","",null,null,null,null,null,null,null,null,null,null,null,null,null,null,null,null,null,null,null,null,null,null,null,null,null,null,null,null,null,null,"Overall Area A",{"$f":"SUBSTITUTE(ADDRESS(1,COLUMN(WP!$AC$6),4),\"1\",\"\")","v":"AC"},"WP!$AC$12:$AC$79"]
[null,{"$f":"IF(WpAreaB_exist,WpAreaB_Sub1,\"N/A\")","v":"N/A"},null,{"$f":"getProgress(AX30,CH30,\"%\",1,1,WpAreaB_exist)","v":""},{"$f":"getProgress(AY30,CI30,,,1,WpAreaB_exist)","v":""},{"$f":"getProgress(AZ30,CJ30,,,1,WpAreaB_exist)","v":""},null,null,null,null,null,null,null,null,null,null,null,null,null,null,null,null,null,null,null,null,null,null,null,null,null,null,null,null,null,null,null,null,null,null,"Don't remove this row",null,null,null,null,null,null,null,null,{"$f":"IF(WpAreaB_exist,WP!$AE$8,\"\")","v":""},{"$f":"IF(WpAreaB_exist,IF(SUMPRODUCT(--(INDIRECT(WpIsNewTC_Rng)=\"Y\"),--(INDIRECT(WpAreaB_Sub1_Rng)=1),--(INDIRECT(WpWeight_Rng)>0))<>0,SUMPRODUCT(--(INDIRECT(WpIsNewTC_Rng)=\"Y\"),--(INDIRECT(WpAreaB_Sub1_Rng)=1),INDIRECT(WpWeight_Rng)),IF(AZ30<>\"\",0,\"\")),\"\")","v":""},{"$f":"IF(WpAreaB_exist,IF(SUMPRODUCT(--(INDIRECT(WpIsNewTC_Rng)=\"Y\"),--(INDIRECT(WpAreaB_Sub1_Rng)<>\"\"),--(INDIRECT(WpWeight_Rng)>0))<>0,SUMPRODUCT(--(INDIRECT(WpIsNewTC_Rng)=\"Y\"),--(INDIRECT(WpAreaB_Sub1_Rng)<>\"\"),INDIRECT(WpWeight_Rng)),\"\"),\"\")","v":""},null,null,null,null,null,null,null,null,null,null,null,null,null,null,null,null,null,null,null,null,null,null,null,null,null,null,null,null,null,null,null,null,null,"","","",null,null,null,null,null,null,null,null,null,null,null,null,null,null,null,null,null,null,null,null,null,null,null,null,null,null,null,null,null,null,"Overall Area B",{"$f":"SUBSTITUTE(ADDRESS(1,COLUMN(WP!$AD$6),4),\"1\",\"\")","v":"AD"},"WP!$AD$12:$AD$79"]
[null,{"$f":"IF(WpAreaB_exist,WpAreaB_Sub2,\"N/A\")","v":"N/A"},null,{"$f":"getProgress(AX31,CH31,\"%\",1,1,WpAreaB_exist)","v":""},{"$f":"getProgress(AY31,CI31,,,1,WpAreaB_exist)","v":""},{"$f":"getProgress(AZ31,CJ31,,,1,WpAreaB_exist)","v":""},null,null,null,null,null,null,null,null,null,null,null,null,null,null,null,null,null,null,null,null,null,null,null,null,null,null,null,null,null,null,null,null,null,null,"Don't remove this row",null,null,null,null,null,null,null,null,{"$f":"IF(WpAreaB_exist,WP!$AF$8,\"\")","v":""},{"$f":"IF(WpAreaB_exist,IF(SUMPRODUCT(--(INDIRECT(WpIsNewTC_Rng)=\"Y\"),--(INDIRECT(WpAreaB_Sub2_Rng)=1),--(INDIRECT(WpWeight_Rng)>0))<>0,SUMPRODUCT(--(INDIRECT(WpIsNewTC_Rng)=\"Y\"),--(INDIRECT(WpAreaB_Sub2_Rng)=1),INDIRECT(WpWeight_Rng)),IF(AZ31<>\"\",0,\"\")),\"\")","v":""},{"$f":"IF(WpAreaB_exist,IF(SUMPRODUCT(--(INDIRECT(WpIsNewTC_Rng)=\"Y\"),--(INDIRECT(WpAreaB_Sub2_Rng)<>\"\"),--(INDIRECT(WpWeight_Rng)>0))<>0,SUMPRODUCT(--(INDIRECT(WpIsNewTC_Rng)=\"Y\"),--(INDIRECT(WpAreaB_Sub2_Rng)<>\"\"),INDIRECT(WpWeight_Rng)),\"\"),\"\")","v":""},null,null,null,null,null,null,null,null,null,null,null,null,null,null,null,null,null,null,null,null,null,null,null,null,null,null,null,null,null,null,null,null,null,"","","",null,null,null,null,null,null,null,null,null,null,null,null,null,null,null,null,null,null,null,null,null,null,null,null,null,null,null,null,null,null,"Overall Area C",{"$f":"SUBSTITUTE(ADDRESS(1,COLUMN(WP!$AE$6),4),\"1\",\"\")","v":"AE"},"WP!$AE$12:$AE$79"]
[null,{"$f":"IF(WpAreaB_exist,WpAreaB_Sub3,\"N/A\")","v":"N/A"},null,{"$f":"getProgress(AX32,CH32,\"%\",1,1,WpAreaB_exist)","v":""},{"$f":"getProgress(AY32,CI32,,,1,WpAreaB_exist)","v":""},{"$f":"getProgress(AZ32,CJ32,,,1,WpAreaB_exist)","v":""},null,null,null,null,null,null,null,null,null,null,null,null,null,null,null,null,null,null,null,null,null,null,null,null,null,null,null,null,null,null,null,null,null,null,"Don't remove this row",null,null,null,null,null,null,null,null,{"$f":"IF(WpAreaB_exist,WP!$AG$8,\"\")","v":""},{"$f":"IF(WpAreaB_exist,IF(SUMPRODUCT(--(INDIRECT(WpIsNewTC_Rng)=\"Y\"),--(INDIRECT(WpAreaB_Sub3_Rng)=1),--(INDIRECT(WpWeight_Rng)>0))<>0,SUMPRODUCT(--(INDIRECT(WpIsNewTC_Rng)=\"Y\"),--(INDIRECT(WpAreaB_Sub3_Rng)=1),INDIRECT(WpWeight_Rng)),IF(AZ32<>\"\",0,\"\")),\"\")","v":""},{"$f":"IF(WpAreaB_exist,IF(SUMPRODUCT(--(INDIRECT(WpIsNewTC_Rng)=\"Y\"),--(INDIRECT(WpAreaB_Sub3_Rng)<>\"\"),--(INDIRECT(WpWeight_Rng)>0))<>0,SUMPRODUCT(--(INDIRECT(WpIsNewTC_Rng)=\"Y\"),--(INDIRECT(WpAreaB_Sub3_Rng)<>\"\"),INDIRECT(WpWeight_Rng)),\"\"),\"\")","v":""},null,null,null,null,null,null,null,null,null,null,null,null,null,null,null,null,null,null,null,null,null,null,null,null,null,null,null,null,null,null,null,null,null,"","","",null,null,null,null,null,null,null,null,null,null,null,null,null,null,null,null,null,null,null,null,null,null,null,null,null,null,null,null,null,null,"WP area A Sub1",{"$f":"SUBSTITUTE(ADDRESS(1,COLUMN(WP!$Q$6),4),\"1\",\"\")","v":"Q"},"WP!$Q$12:$Q$79"]
[null,{"$f":"IF(WpAreaC_exist,WpAreaC,\"N/A\")","v":"N/A"},null,{"$f":"getProgress(AX33,CH33,\"%\",1,1,WpAreaC_exist)","v":""},{"$f":"getProgress(AY33,CI33,,,1,WpAreaC_exist)","v":""},{"$f":"getProgress(AZ33,CJ33,,,1,WpAreaC_exist)","v":""},null,null,null,null,null,null,null,null,null,null,null,null,null,null,null,null,null,null,null,null,null,null,null,null,null,null,null,null,null,null,null,null,null,null,"Don't remove this row",null,null,null,null,null,null,null,null,{"$f":"IF(WpAreaC_exist,IF(WpAreaC_SumWeights>0,(IF(AX34<>\"\",AX34*WP!$AH$10,0)+IF(AX35<>\"\",AX35*WP!$AI$10,0)+IF(AX36<>\"\",AX36*WP!$AJ$10,0))/WpAreaC_SumWeights,\"\"),\"\")","v":""},{"$f":"IF(WpAreaC_exist,IF(SUMPRODUCT(--(INDIRECT(WpIsNewTC_Rng)=\"Y\"),--(INDIRECT(WpAreaCoverall_Rng)=1),--(INDIRECT(WpWeight_Rng)>0))<>0,SUMPRODUCT(--(INDIRECT(WpIsNewTC_Rng)=\"Y\"),--(INDIRECT(WpAreaCoverall_Rng)=1),INDIRECT(WpWeight_Rng)),IF(AZ33<>\"\",0,\"\")),\"\")","v":""},{"$f":"IF(WpAreaC_exist,IF(SUMPRODUCT(--(INDIRECT(WpIsNewTC_Rng)=\"Y\"),--(INDIRECT(WpAreaCoverall_Rng)<>\"\"),--(INDIRECT(WpWeight_Rng)>0))<>0,SUMPRODUCT(--(INDIRECT(WpIsNewTC_Rng)=\"Y\"),--(INDIRECT(WpAreaCoverall_Rng)<>\"\"),INDIRECT(WpWeight_Rng)),\"\"),\"\")","v":""},null,null,null,null,null,null,null,null,null,null,null,null,null,null,null,null,null,null,null,null,null,null,null,null,null,null,null,null,null,null,null,null,null,"","","",null,null,null,null,null,null,null,null,null,null,null,null,null,null,null,null,null,null,null,null,null,null,null,null,null,null,null,null,null,null,"WP area A Sub2",{"$f":"SUBSTITUTE(ADDRESS(1,COLUMN(WP!$R$6),4),\"1\",\"\")","v":"R"},"WP!$R$12:$R$79"]
[null,{"$f":"IF(WpAreaC_exist,WpAreaC_Sub1,\"N/A\")","v":"N/A"},null,{"$f":"getProgress(AX34,CH34,\"%\",1,1,WpAreaC_exist)","v":""},{"$f":"getProgress(AY34,CI34,,,1,WpAreaC_exist)","v":""},{"$f":"getProgress(AZ34,CJ34,,,1,WpAreaC_exist)","v":""},null,null,null,null,null,null,null,null,null,null,null,null,null,null,null,null,null,null,null,null,null,null,null,null,null,null,null,null,null,null,null,null,null,null,"Don't remove this row",null,null,null,null,null,null,null,null,{"$f":"IF(WpAreaC_exist,WP!$AH$8,\"\")","v":""},{"$f":"IF(WpAreaC_exist,IF(SUMPRODUCT(--(INDIRECT(WpIsNewTC_Rng)=\"Y\"),--(INDIRECT(WpAreaC_Sub1_Rng)=1),--(INDIRECT(WpWeight_Rng)>0))<>0,SUMPRODUCT(--(INDIRECT(WpIsNewTC_Rng)=\"Y\"),--(INDIRECT(WpAreaC_Sub1_Rng)=1),INDIRECT(WpWeight_Rng)),IF(AZ34<>\"\",0,\"\")),\"\")","v":""},{"$f":"IF(WpAreaC_exist,IF(SUMPRODUCT(--(INDIRECT(WpIsNewTC_Rng)=\"Y\"),--(INDIRECT(WpAreaC_Sub1_Rng)<>\"\"),--(INDIRECT(WpWeight_Rng)>0))<>0,SUMPRODUCT(--(INDIRECT(WpIsNewTC_Rng)=\"Y\"),--(INDIRECT(WpAreaC_Sub1_Rng)<>\"\"),INDIRECT(WpWeight_Rng)),\"\"),\"\")","v":""},null,null,null,null,null,null,null,null,null,null,null,null,null,null,null,null,null,null,null,null,null,null,null,null,null,null,null,null,null,null,null,null,null,"","","",null,null,null,null,null,null,null,null,null,null,null,null,null,null,null,null,null,null,null,null,null,null,null,null,null,null,null,null,null,null,"WP area A Sub3",{"$f":"SUBSTITUTE(ADDRESS(1,COLUMN(WP!$S$6),4),\"1\",\"\")","v":"S"},"WP!$S$12:$S$79"]
[null,{"$f":"IF(WpAreaC_exist,WpAreaC_Sub2,\"N/A\")","v":"N/A"},null,{"$f":"getProgress(AX35,CH35,\"%\",1,1,WpAreaC_exist)","v":""},{"$f":"getProgress(AY35,CI35,,,1,WpAreaC_exist)","v":""},{"$f":"getProgress(AZ35,CJ35,,,1,WpAreaC_exist)","v":""},null,null,null,null,null,null,null,null,null,null,null,null,null,null,null,null,null,null,null,null,null,null,null,null,null,null,null,null,null,null,null,null,null,null,"Don't remove this row",null,null,null,null,null,null,null,null,{"$f":"IF(WpAreaC_exist,WP!$AI$8,\"\")","v":""},{"$f":"IF(WpAreaC_exist,IF(SUMPRODUCT(--(INDIRECT(WpIsNewTC_Rng)=\"Y\"),--(INDIRECT(WpAreaC_Sub2_Rng)=1),--(INDIRECT(WpWeight_Rng)>0))<>0,SUMPRODUCT(--(INDIRECT(WpIsNewTC_Rng)=\"Y\"),--(INDIRECT(WpAreaC_Sub2_Rng)=1),INDIRECT(WpWeight_Rng)),IF(AZ35<>\"\",0,\"\")),\"\")","v":""},{"$f":"IF(WpAreaC_exist,IF(SUMPRODUCT(--(INDIRECT(WpIsNewTC_Rng)=\"Y\"),--(INDIRECT(WpAreaC_Sub2_Rng)<>\"\"),--(INDIRECT(WpWeight_Rng)>0))<>0,SUMPRODUCT(--(INDIRECT(WpIsNewTC_Rng)=\"Y\"),--(INDIRECT(WpAreaC_Sub2_Rng)<>\"\"),INDIRECT(WpWeight_Rng)),\"\"),\"\")","v":""},null,null,null,null,null,null,null,null,null,null,null,null,null,null,null,null,null,null,null,null,null,null,null,null,null,null,null,null,null,null,null,null,null,"","","",null,null,null,null,null,null,null,null,null,null,null,null,null,null,null,null,null,null,null,null,null,null,null,null,null,null,null,null,null,null,"WP area B Sub1",{"$f":"SUBSTITUTE(ADDRESS(1,COLUMN(WP!$T$6),4),\"1\",\"\")","v":"T"},"WP!$T$12:$T$79"]
[null,{"$f":"IF(WpAreaC_exist,WpAreaC_Sub3,\"N/A\")","v":"N/A"},null,{"$f":"getProgress(AX36,CH36,\"%\",1,1,WpAreaC_exist)","v":""},{"$f":"getProgress(AY36,CI36,,,1,WpAreaC_exist)","v":""},{"$f":"getProgress(AZ36,CJ36,,,1,WpAreaC_exist)","v":""},null,null,null,null,null,null,null,null,null,null,null,null,null,null,null,null,null,null,null,null,null,null,null,null,null,null,null,null,null,null,null,null,null,null,"Don't remove this row",null,null,null,null,null,null,null,null,{"$f":"IF(WpAreaC_exist,WP!$AJ$8,\"\")","v":""},{"$f":"IF(WpAreaC_exist,IF(SUMPRODUCT(--(INDIRECT(WpIsNewTC_Rng)=\"Y\"),--(INDIRECT(WpAreaC_Sub3_Rng)=1),--(INDIRECT(WpWeight_Rng)>0))<>0,SUMPRODUCT(--(INDIRECT(WpIsNewTC_Rng)=\"Y\"),--(INDIRECT(WpAreaC_Sub3_Rng)=1),INDIRECT(WpWeight_Rng)),IF(AZ36<>\"\",0,\"\")),\"\")","v":""},{"$f":"IF(WpAreaC_exist,IF(SUMPRODUCT(--(INDIRECT(WpIsNewTC_Rng)=\"Y\"),--(INDIRECT(WpAreaC_Sub3_Rng)<>\"\"),--(INDIRECT(WpWeight_Rng)>0))<>0,SUMPRODUCT(--(INDIRECT(WpIsNewTC_Rng)=\"Y\"),--(INDIRECT(WpAreaC_Sub3_Rng)<>\"\"),INDIRECT(WpWeight_Rng)),\"\"),\"\")","v":""},null,null,null,null,null,null,null,null,null,null,null,null,null,null,null,null,null,null,null,null,null,null,null,null,null,null,null,null,null,null,null,null,null,"","","",null,null,null,null,null,null,null,null,null,null,null,null,null,null,null,null,null,null,null,null,null,null,null,null,null,null,null,null,null,null,"WP area B Sub2",{"$f":"SUBSTITUTE(ADDRESS(1,COLUMN(WP!$U$6),4),\"1\",\"\")","v":"U"},"WP!$U$12:$U$79"]
[null,null,null,null,null,null,null,null,null,null,null,null,null,null,null,null,null,null,null,null,null,null,null,null,null,null,null,null,null,null,null,null,null,null,null,null,null,null,null,null,"Don't remove this row",null,null,null,null,null,null,null,null,null,null,null,{"$f":"WpAreaA<>\"N/A\"","v":true},null,null,null,null,null,null,null,null,null,{"$f":"WpAreaB<>\"N/A\"","v":false},null,null,null,null,null,null,null,null,null,{"$f":"WpAreaC<>\"N/A\"","v":false},null,null,null,null,null,null,null,null,null,null,null,null,null,null,null,true,null,null,null,null,null,null,null,null,null,true,null,null,null,null,null,null,null,null,null,true,null,null,null,null,null,null,null,null,null,"WP area B Sub3",{"$f":"SUBSTITUTE(ADDRESS(1,COLUMN(WP!$V$6),4),\"1\",\"\")","v":"V"},"WP!$V$12:$V$79"]
[null,"Estimation of completion per TS (area):",null,null,null,null,null,null,null,null,null,null,null,null,null,null,null,null,null,null,null,null,null,null,null,null,null,null,null,null,null,null,null,null,null,null,null,null,null,null,"Don't remove this row",null,null,null,null,null,null,null,null,null,null,null,{"$f":"WpAreaA_Sub1<>\"N/A\"","v":true},null,null,{"$f":"WpAreaA_Sub2<>\"N/A\"","v":false},null,null,{"$f":"WpAreaA_Sub3<>\"N/A\"","v":false},null,null,null,{"$f":"WpAreaB_Sub1<>\"N/A\"","v":false},null,null,{"$f":"WpAreaB_Sub2<>\"N/A\"","v":false},null,null,{"$f":"WpAreaB_Sub3<>\"N/A\"","v":false},null,null,null,{"$f":"WpAreaC_Sub1<>\"N/A\"","v":false},null,null,{"$f":"WpAreaC_Sub2<>\"N/A\"","v":false},null,null,{"$f":"WpAreaC_Sub3<>\"N/A\"","v":false},null,null,null,null,null,null,null,null,null,true,null,null,true,null,null,true,null,null,null,true,null,null,true,null,null,true,null,null,null,true,null,null,true,null,null,true,null,null,null,"WP area C Sub1",{"$f":"SUBSTITUTE(ADDRESS(1,COLUMN(WP!$W$6),4),\"1\",\"\")","v":"W"},"WP!$W$12:$W$79"]
[null,null,null,"TS/TR overall completion",null,null,null,{"$f":"WpAreaA","v":"LTE"},null,null,null,null,null,null,null,null,null,{"$f":"WpAreaB","v":"N/A"},null,null,null,null,null,null,null,null,null,{"$f":"WpAreaC","v":"N/A"},null,null,null,null,null,null,null,null,null,null,null,null,"Don't remove this row",null,null,null,null,null,null,null,null,"Overall",null,null,{"$f":"IF(WpAreaA<>\"\",WpAreaA,\"N/A\")","v":"LTE"},null,null,null,null,null,null,null,null,null,{"$f":"IF(WpAreaB<>\"\",WpAreaB,\"N/A\")","v":"N/A"},null,null,null,null,null,null,null,null,null,{"$f":"IF(WpAreaC<>\"\",WpAreaC,\"N/A\")","v":"N/A"},null,null,null,null,null,null,null,null,null,null,null,null,"Overall",null,null,"SA Option 2 (SA NR)",null,null,null,null,null,null,null,null,null,"NSA Option 3 (EN-DC)",null,null,null,null,null,null,null,null,null,"LTE",null,null,null,null,null,null,null,null,null,"WP area C Sub2",{"$f":"SUBSTITUTE(ADDRESS(1,COLUMN(WP!$X$6),4),\"1\",\"\")","v":"X"},{"$f":"\"WP!$\"&DP39&\"$\"&FirstRowWPitems&\":$\"&DP39&\"$\"&LastRowWPitems","v":"WP!$X$12:$X$79"}]
[null,"TS/TR Scope\n","TS/TR\n","Completion","Number of new completed test cases","Number of new test cases",null,{"$f":"IF(WpAreaA_Sub1_exist,WpAreaA_Sub1,\"\")","v":"FDD"},null,null,{"$f":"IF(WpAreaA_Sub2_exist,WpAreaA_Sub2,\"\")","v":""},null,null,{"$f":"IF(WpAreaA_Sub3_exist,WpAreaA_Sub3,\"\")","v":""},null,null,null,{"$f":"IF(WpAreaB_Sub1_exist,WpAreaB_Sub1,\"\")","v":""},null,null,{"$f":"IF(WpAreaB_Sub2_exist,WpAreaB_Sub2,\"\")","v":""},null,null,{"$f":"IF(WpAreaB_Sub3_exist,WpAreaB_Sub3,\"\")","v":""},null,null,null,{"$f":"IF(WpAreaC_Sub1_exist,WpAreaC_Sub1,\"\")","v":""},null,null,{"$f":"IF(WpAreaC_Sub2_exist,WpAreaC_Sub2,\"\")","v":""},null,null,{"$f":"IF(WpAreaC_Sub3_exist,WpAreaC_Sub3,\"\")","v":""},null,null,null,null,null,null,"Don't remove this row",null,null,null,null,null,null,null,null,null,null,null,{"$f":"WpAreaA_Sub1","v":"FDD"},null,null,{"$f":"WpAreaA_Sub2","v":"N/A"},null,null,{"$f":"WpAreaA_Sub3","v":"N/A"},null,null,null,{"$f":"WpAreaB_Sub1","v":"N/A"},null,null,{"$f":"WpAreaB_Sub2","v":"N/A"},null,null,{"$f":"WpAreaB_Sub3","v":"N/A"},null,null,null,{"$f":"WpAreaC_Sub1","v":"N/A"},null,null,{"$f":"WpAreaC_Sub2","v":"N/A"},null,null,{"$f":"WpAreaC_Sub3","v":"N/A"},null,null,null,null,null,null,null,null,null,{"$f":"WpAreaA_Sub1","v":"FDD"},null,null,{"$f":"WpAreaA_Sub2","v":"N/A"},null,null,{"$f":"WpAreaA_Sub3","v":"N/A"},null,null,null,{"$f":"WpAreaB_Sub1","v":"N/A"},null,null,{"$f":"WpAreaB_Sub2","v":"N/A"},null,null,{"$f":"WpAreaB_Sub3","v":"N/A"},null,null,null,{"$f":"WpAreaC_Sub1","v":"N/A"},null,null,{"$f":"WpAreaC_Sub2","v":"N/A"},null,null,{"$f":"WpAreaC_Sub3","v":"N/A"},null,null,null,"WP area C Sub3",{"$f":"SUBSTITUTE(ADDRESS(1,COLUMN(WP!$Y$6),4),\"1\",\"\")","v":"Y"},{"$f":"\"WP!$\"&DP40&\"$\"&FirstRowWPitems&\":$\"&DP40&\"$\"&LastRowWPitems","v":"WP!$Y$12:$Y$79"}]
[null,null,null,null,null,null,null,{"$f":"IF(WpAreaA_Sub1_exist,\"Completion\",\"\")","v":"Completion"},{"$f":"IF(WpAreaA_Sub1_exist,\"Number of new completed test cases\",\"\")","v":"Number of new completed test cases"},{"$f":"IF(WpAreaA_Sub1_exist,\"Number of new test cases\",\"\")","v":"Number of new test cases"},{"$f":"IF(WpAreaA_Sub2_exist,\"Completion\",\"\")","v":""},{"$f":"IF(WpAreaA_Sub2_exist,\"Number of new completed test cases\",\"\")","v":""},{"$f":"IF(WpAreaA_Sub2_exist,\"Number of new test cases\",\"\")","v":""},{"$f":"IF(WpAreaA_Sub3_exist,\"Completion\",\"\")","v":""},{"$f":"IF(WpAreaA_Sub3_exist,\"Number of new completed test cases\",\"\")","v":""},{"$f":"IF(WpAreaA_Sub3_exist,\"Number of new test cases\",\"\")","v":""},null,{"$f":"IF(WpAreaB_Sub1_exist,\"Completion\",\"\")","v":""},{"$f":"IF(WpAreaB_Sub1_exist,\"Number of new completed test cases\",\"\")","v":""},{"$f":"IF(WpAreaB_Sub1_exist,\"Number of new test cases\",\"\")","v":""},{"$f":"IF(WpAreaB_Sub2_exist,\"Completion\",\"\")","v":""},{"$f":"IF(WpAreaB_Sub2_exist,\"Number of new completed test cases\",\"\")","v":""},{"$f":"IF(WpAreaB_Sub2_exist,\"Number of new test cases\",\"\")","v":""},{"$f":"IF(WpAreaB_Sub3_exist,\"Completion\",\"\")","v":""},{"$f":"IF(WpAreaB_Sub3_exist,\"Number of new completed test cases\",\"\")","v":""},{"$f":"IF(WpAreaB_Sub3_exist,\"Number of new test cases\",\"\")","v":""},null,{"$f":"IF(WpAreaC_Sub1_exist,\"Completion\",\"\")","v":""},{"$f":"IF(WpAreaC_Sub1_exist,\"Number of new completed test cases\",\"\")","v":""},{"$f":"IF(WpAreaC_Sub1_exist,\"Number of new test cases\",\"\")","v":""},{"$f":"IF(WpAreaC_Sub2_exist,\"Completion\",\"\")","v":""},{"$f":"IF(WpAreaC_Sub2_exist,\"Number of new completed test cases\",\"\")","v":""},{"$f":"IF(WpAreaC_Sub2_exist,\"Number of new test cases\",\"\")","v":""},{"$f":"IF(WpAreaC_Sub3_exist,\"Completion\",\"\")","v":""},{"$f":"IF(WpAreaC_Sub3_exist,\"Number of new completed test cases\",\"\")","v":""},{"$f":"IF(WpAreaC_Sub3_exist,\"Number of new test cases\",\"\")","v":""},null,null,null,null,"Don't remove this row",null,null,null,null,null,null,null,null,{"$f":"SUBSTITUTE(ADDRESS(1,COLUMN(WP!$AB:$AB),4),\"1\",\"\")","v":"AB"},null,null,{"$f":"SUBSTITUTE(ADDRESS(1,COLUMN(WP!$Q:$Q),4),\"1\",\"\")","v":"Q"},null,null,{"$f":"SUBSTITUTE(ADDRESS(1,COLUMN(WP!$R:$R),4),\"1\",\"\")","v":"R"},null,null,{"$f":"SUBSTITUTE(ADDRESS(1,COLUMN(WP!$S:$S),4),\"1\",\"\")","v":"S"},null,null,null,{"$f":"SUBSTITUTE(ADDRESS(1,COLUMN(WP!$T:$T),4),\"1\",\"\")","v":"T"},null,null,{"$f":"SUBSTITUTE(ADDRESS(1,COLUMN(WP!$U:$U),4),\"1\",\"\")","v":"U"},null,null,{"$f":"SUBSTITUTE(ADDRESS(1,COLUMN(WP!$V:$V),4),\"1\",\"\")","v":"V"},null,null,null,{"$f":"SUBSTITUTE(ADDRESS(1,COLUMN(WP!$W:$W),4),\"1\",\"\")","v":"W"},null,null,{"$f":"SUBSTITUTE(ADDRESS(1,COLUMN(WP!$X:$X),4),\"1\",\"\")","v":"X"},null,null,{"$f":"SUBSTITUTE(ADDRESS(1,COLUMN(WP!$Y:$Y),4),\"1\",\"\")","v":"Y"},null,null,null,null,null,null,"AB",null,null,"Q",null,null,"R",null,null,"S",null,null,null,"T",null,null,"U",null,null,"V",null,null,null,"W",null,null,"X",null,null,"Y"]
[null,"LTE"]
[null,"LTE Common"]
[null,"Common test environment","36.508",{"$f":"getProgress(AX44,CH44,\"%\",1,1)","v":""},{"$f":"getProgress(AY44,CI44,,,1)","v":""},{"$f":"getProgress(AZ44,CJ44,,,1)","v":""},null,{"$f":"getProgress(BA44,CK44,\"%\",1,1,WpAreaA_Sub1_exist)","v":""},{"$f":"getProgress(BB44,CL44,,,1,WpAreaA_Sub1_exist)","v":""},{"$f":"getProgress(BC44,CM44,,,1,WpAreaA_Sub1_exist)","v":""},{"$f":"getProgress(BD44,CN44,\"%\",1,1,WpAreaA_Sub2_exist)","v":""},{"$f":"getProgress(BE44,CO44,,,1,WpAreaA_Sub2_exist)","v":""},{"$f":"getProgress(BF44,CP44,,,1,WpAreaA_Sub2_exist)","v":""},{"$f":"getProgress(BG44,CQ44,\"%\",1,1,WpAreaA_Sub3_exist)","v":""},{"$f":"getProgress(BH44,CR44,,,1,WpAreaA_Sub3_exist)","v":""},{"$f":"getProgress(BI44,CS44,,,1,WpAreaA_Sub3_exist)","v":""},null,{"$f":"getProgress(BK44,CU44,\"%\",1,1,WpAreaB_Sub1_exist)","v":""},{"$f":"getProgress(BL44,CV44,,,1,WpAreaB_Sub1_exist)","v":""},{"$f":"getProgress(BM44,CW44,,,1,WpAreaB_Sub1_exist)","v":""},{"$f":"getProgress(BN44,CX44,\"%\",1,1,WpAreaB_Sub2_exist)","v":""},{"$f":"getProgress(BO44,CY44,,,1,WpAreaB_Sub2_exist)","v":""},{"$f":"getProgress(BP44,CZ44,,,1,WpAreaB_Sub2_exist)","v":""},{"$f":"getProgress(BQ44,DA44,\"%\",1,1,WpAreaB_Sub3_exist)","v":""},{"$f":"getProgress(BR44,DB44,,,1,WpAreaB_Sub3_exist)","v":""},{"$f":"getProgress(BS44,DC44,,,1,WpAreaB_Sub3_exist)","v":""},null,{"$f":"getProgress(BU44,DE44,\"%\",1,1,WpAreaC_Sub1_exist)","v":""},{"$f":"getProgress(BV44,DF44,,,1,WpAreaC_Sub1_exist)","v":""},{"$f":"getProgress(BW44,DG44,,,1,WpAreaC_Sub1_exist)","v":""},{"$f":"getProgress(BX44,DH44,\"%\",1,1,WpAreaC_Sub2_exist)","v":""},{"$f":"getProgress(BY44,DI44,,,1,WpAreaC_Sub2_exist)","v":""},{"$f":"getProgress(BZ44,DJ44,,,1,WpAreaC_Sub2_exist)","v":""},{"$f":"getProgress(CA44,DK44,\"%\",1,1,WpAreaC_Sub3_exist)","v":""},{"$f":"getProgress(CB44,DL44,,,1,WpAreaC_Sub3_exist)","v":""},{"$f":"getProgress(CC44,DM44,,,1,WpAreaC_Sub3_exist)","v":""},null,null,null,null,null,null,null,null,null,null,null,null,null,{"$f":"IFERROR((IF(WpAreaA_exist,IF(BA44<>\"\",BA44*WP!$AB$9,0)+IF(BD44<>\"\",BD44*WP!$AC$9,0)+IF(BG44<>\"\",BG44*WP!$AD$9,0),0)+IF(WpAreaB_exist,IF(BK44<>\"\",BK44*WP!$AE$10)+IF(BN44<>\"\",BN44*WP!$AF$10,0)+IF(BQ44<>\"\",BQ44*WP!$AG$10,0),0)+IF(WpAreaC_exist,IF(BU44<>\"\",BU44*WP!$AH$10)+IF(BX44<>\"\",BX44*WP!$AI$10,0)+IF(CA44<>\"\",CA44*WP!$AJ$10,0),0))/(IF(WpAreaA_exist,IF(BA44<>\"\",WP!$AB$9,0)+IF(BD44<>\"\",WP!$AC$9,0)+IF(BG44<>\"\",WP!$AD$9,0),0)+IF(WpAreaB_exist,IF(BK44<>\"\",WP!$AE$10,0)+IF(BN44<>\"\",WP!$AF$10,0)+IF(BQ44<>\"\",WP!$AG$10,0),0)+IF(WpAreaC_exist,IF(BU44<>\"\",WP!$AH$10,0)+IF(BX44<>\"\",WP!$AI$10,0)+IF(CA44<>\"\",WP!$AJ$10,0),0)),\"\")","v":""},{"$f":"IFERROR(IF(SUMPRODUCT(--(INDIRECT(\"WP!$C$\"&$DO44&\":$C$\"&$DP44)=$C44),--(INDIRECT(\"WP!$B$\"&$DO44&\":$B$\"&$DP44)=\"Y\"),--(INDIRECT(\"WP!$\"&$AX$41&\"$\"&$DO44&\":$\"&$AX$41&\"$\"&$DP44)=1),--(INDIRECT(\"WP!$K$\"&$DO44&\":$K$\"&$DP44)>0))<>0,SUMPRODUCT(--(INDIRECT(\"WP!$C$\"&$DO44&\":$C$\"&$DP44)=$C44),--(INDIRECT(\"WP!$B$\"&$DO44&\":$B$\"&$DP44)=\"Y\"),--(INDIRECT(\"WP!$\"&$AX$41&\"$\"&$DO44&\":$\"&$AX$41&\"$\"&$DP44)=1),INDIRECT(\"WP!$K$\"&$DO44&\":$K$\"&$DP44)),IF(AZ44<>\"\",0,\"\")),\"\")","v":""},{"$f":"IFERROR(IF(SUMPRODUCT(--(INDIRECT(\"WP!$C$\"&$DO44&\":$C$\"&$DP44)=$C44),--(INDIRECT(\"WP!$B\"&$DO44&\":$B\"&$DP44)=\"Y\"),--(INDIRECT(\"WP!$\"&$AX$41&\"$\"&$DO44&\":$\"&$AX$41&\"$\"&$DP44)<>\"\"),--(INDIRECT(\"WP!$K\"&$DO44&\":$K\"&$DP44)>0))<>0,SUMPRODUCT(--(INDIRECT(\"WP!$C$\"&$DO44&\":$C$\"&$DP44)=$C44),--(INDIRECT(\"WP!$B\"&$DO44&\":$B\"&$DP44)=\"Y\"),--(INDIRECT(\"WP!$\"&$AX$41&\"$\"&$DO44&\":$\"&$AX$41&\"$\"&$DP44)<>\"\"),INDIRECT(\"WP!$K\"&$DO44&\":$K\"&$DP44)),\"\"),\"\")","v":""},{"$f":"IFERROR(IF(WpAreaA_Sub1_exist,IF(SUMPRODUCT(--(INDIRECT(\"WP!$C$\"&$DO44&\":$C$\"&$DP44)=$C44),--(INDIRECT(\"WP!$\"&$BA$41&\"$\"&$DO44&\":$\"&$BA$41&\"$\"&$DP44)<>\"\"),--(INDIRECT(\"WP!$K$\"&$DO44&\":$K$\"&$DP44)>0))>0,SUMPRODUCT(--(INDIRECT(\"WP!$C$\"&$DO44&\":$C$\"&$DP44)=$C44),--(INDIRECT(\"WP!$\"&$BA$41&\"$\"&$DO44&\":$\"&$BA$41&\"$\"&$DP44)<>\"\"),INDIRECT(\"WP!$K$\"&$DO44&\":$K$\"&$DP44),INDIRECT(\"WP!$\"&$BA$41&\"$\"&$DO44&\":$\"&$BA$41&\"$\"&$DP44))/SUMPRODUCT(--(INDIRECT(\"WP!$C$\"&$DO44&\":$C$\"&$DP44)=$C44),--(INDIRECT(\"WP!$\"&$BA$41&\"$\"&$DO44&\":$\"&$BA$41&\"$\"&$DP44)<>\"\"),INDIRECT(\"WP!$K$\"&$DO44&\":$K$\"&$DP44)),\"\"),\"\"),\"\")","v":""},{"$f":"IFERROR(IF(WpAreaA_Sub1_exist,IF(SUMPRODUCT(--(INDIRECT(\"WP!$C$\"&$DO44&\":$C$\"&$DP44)=$C44),--(INDIRECT(\"WP!$B$\"&$DO44&\":$B$\"&$DP44)=\"Y\"),--(INDIRECT(\"WP!$\"&$BA$41&\"$\"&$DO44&\":$\"&$BA$41&\"$\"&$DP44)=1),--(INDIRECT(\"WP!$K$\"&$DO44&\":$K$\"&$DP44)>0))<>0,SUMPRODUCT(--(INDIRECT(\"WP!$C$\"&$DO44&\":$C$\"&$DP44)=$C44),--(INDIRECT(\"WP!$B$\"&$DO44&\":$B$\"&$DP44)=\"Y\"),--(INDIRECT(\"WP!$\"&$BA$41&\"$\"&$DO44&\":$\"&$BA$41&\"$\"&$DP44)=1),INDIRECT(\"WP!$K$\"&$DO44&\":$K$\"&$DP44)),IF(BC44<>\"\",0,\"\")),\"\"),\"\")","v":""},{"$f":"IFERROR(IF(WpAreaA_Sub1_exist,IF(SUMPRODUCT(--(INDIRECT(\"WP!$C$\"&$DO44&\":$C$\"&$DP44)=$C44),--(INDIRECT(\"WP!$B\"&$DO44&\":$B\"&$DP44)=\"Y\"),--(INDIRECT(\"WP!$\"&$BA$41&\"$\"&$DO44&\":$\"&$BA$41&\"$\"&$DP44)<>\"\"),--(INDIRECT(\"WP!$K\"&$DO44&\":$K\"&$DP44)>0))<>0,SUMPRODUCT(--(INDIRECT(\"WP!$C$\"&$DO44&\":$C$\"&$DP44)=$C44),--(INDIRECT(\"WP!$B\"&$DO44&\":$B\"&$DP44)=\"Y\"),--(INDIRECT(\"WP!$\"&$BA$41&\"$\"&$DO44&\":$\"&$BA$41&\"$\"&$DP44)<>\"\"),INDIRECT(\"WP!$K\"&$DO44&\":$K\"&$DP44)),\"\"),\"\"),\"\")","v":""},{"$f":"IFERROR(IF(WpAreaA_Sub2_exist,IF(SUMPRODUCT(--(INDIRECT(\"WP!$C$\"&$DO44&\":$C$\"&$DP44)=$C44),--(INDIRECT(\"WP!$\"&$BD$41&\"$\"&$DO44&\":$\"&$BD$41&\"$\"&$DP44)<>\"\"),--(INDIRECT(\"WP!$K$\"&$DO44&\":$K$\"&$DP44)>0))>0,SUMPRODUCT(--(INDIRECT(\"WP!$C$\"&$DO44&\":$C$\"&$DP44)=$C44),--(INDIRECT(\"WP!$\"&$BD$41&\"$\"&$DO44&\":$\"&$BD$41&\"$\"&$DP44)<>\"\"),INDIRECT(\"WP!$K\"&$DO44&\":$K\"&$DP44),INDIRECT(\"WP!$\"&$BD$41&\"$\"&$DO44&\":$\"&$BD$41&\"$\"&$DP44))/SUMPRODUCT(--(INDIRECT(\"WP!$C$\"&$DO44&\":$C$\"&$DP44)=$C44),--(INDIRECT(\"WP!$\"&$BD$41&\"$\"&$DO44&\":$\"&$BD$41&\"$\"&$DP44)<>\"\"),INDIRECT(\"WP!$K\"&$DO44&\":$K\"&$DP44)),\"\"),\"\"),\"\")","v":""},{"$f":"IFERROR(IF(WpAreaA_Sub2_exist,IF(SUMPRODUCT(--(INDIRECT(\"WP!$C$\"&$DO44&\":$C$\"&$DP44)=$C44),--(INDIRECT(\"WP!$B\"&$DO44&\":$B\"&$DP44)=\"Y\"),--(INDIRECT(\"WP!$\"&$BD$41&\"$\"&$DO44&\":$\"&$BD$41&\"$\"&$DP44)=1),--(INDIRECT(\"WP!$K\"&$DO44&\":$K\"&$DP44)>0))<>0,SUMPRODUCT(--(INDIRECT(\"WP!$C$\"&$DO44&\":$C$\"&$DP44)=$C44),--(INDIRECT(\"WP!$B\"&$DO44&\":$B\"&$DP44)=\"Y\"),--(INDIRECT(\"WP!$\"&$BD$41&\"$\"&$DO44&\":$\"&$BD$41&\"$\"&$DP44)=1),INDIRECT(\"WP!$K\"&$DO44&\":$K\"&$DP44)),IF(BF44<>\"\",0,\"\")),\"\"),\"\")","v":""},{"$f":"IFERROR(IF(WpAreaA_Sub2_exist,IF(SUMPRODUCT(--(INDIRECT(\"WP!$C$\"&$DO44&\":$C$\"&$DP44)=$C44),--(INDIRECT(\"WP!$B\"&$DO44&\":$B\"&$DP44)=\"Y\"),--(INDIRECT(\"WP!$\"&$BD$41&\"$\"&$DO44&\":$\"&$BD$41&\"$\"&$DP44)<>\"\"),--(INDIRECT(\"WP!$K\"&$DO44&\":$K\"&$DP44)>0))<>0,SUMPRODUCT(--(INDIRECT(\"WP!$C$\"&$DO44&\":$C$\"&$DP44)=$C44),--(INDIRECT(\"WP!$B\"&$DO44&\":$B\"&$DP44)=\"Y\"),--(INDIRECT(\"WP!$\"&$BD$41&\"$\"&$DO44&\":$\"&$BD$41&\"$\"&$DP44)<>\"\"),INDIRECT(\"WP!$K\"&$DO44&\":$K\"&$DP44)),\"\"),\"\"),\"\")","v":""},{"$f":"IFERROR(IF(WpAreaA_Sub3_exist,IF(SUMPRODUCT(--(INDIRECT(\"WP!$C$\"&$DO44&\":$C$\"&$DP44)=$C44),--(INDIRECT(\"WP!$\"&$BG$41&\"$\"&$DO44&\":$\"&$BG$41&\"$\"&$DP44)<>\"\"),--(INDIRECT(\"WP!$K$\"&$DO44&\":$K$\"&$DP44)>0))>0,SUMPRODUCT(--(INDIRECT(\"WP!$C$\"&$DO44&\":$C$\"&$DP44)=$C44),--(INDIRECT(\"WP!$\"&$BG$41&\"$\"&$DO44&\":$\"&$BG$41&\"$\"&$DP44)<>\"\"),INDIRECT(\"WP!$K\"&$DO44&\":$K\"&$DP44),INDIRECT(\"WP!$\"&$BG$41&\"$\"&$DO44&\":$\"&$BG$41&\"$\"&$DP44))/SUMPRODUCT(--(INDIRECT(\"WP!$C$\"&$DO44&\":$C$\"&$DP44)=$C44),--(INDIRECT(\"WP!$\"&$BG$41&\"$\"&$DO44&\":$\"&$BG$41&\"$\"&$DP44)<>\"\"),INDIRECT(\"WP!$K\"&$DO44&\":$K\"&$DP44)),\"\"),\"\"),\"\")","v":""},{"$f":"IFERROR(IF(WpAreaA_Sub3_exist,IF(SUMPRODUCT(--(INDIRECT(\"WP!$C$\"&$DO44&\":$C$\"&$DP44)=$C44),--(INDIRECT(\"WP!$B\"&$DO44&\":$B\"&$DP44)=\"Y\"),--(INDIRECT(\"WP!$\"&$BG$41&\"$\"&$DO44&\":$\"&$BG$41&\"$\"&$DP44)=1),--(INDIRECT(\"WP!$K\"&$DO44&\":$K\"&$DP44)>0))<>0,SUMPRODUCT(--(INDIRECT(\"WP!$C$\"&$DO44&\":$C$\"&$DP44)=$C44),--(INDIRECT(\"WP!$B\"&$DO44&\":$B\"&$DP44)=\"Y\"),--(INDIRECT(\"WP!$\"&$BG$41&\"$\"&$DO44&\":$\"&$BG$41&\"$\"&$DP44)=1),INDIRECT(\"WP!$K\"&$DO44&\":$K\"&$DP44)),IF(BI44<>\"\",0,\"\")),\"\"),\"\")","v":""},{"$f":"IFERROR(IF(WpAreaA_Sub3_exist,IF(SUMPRODUCT(--(INDIRECT(\"WP!$C$\"&$DO44&\":$C$\"&$DP44)=$C44),--(INDIRECT(\"WP!$B\"&$DO44&\":$B\"&$DP44)=\"Y\"),--(INDIRECT(\"WP!$\"&$BG$41&\"$\"&$DO44&\":$\"&$BG$41&\"$\"&$DP44)<>\"\"),--(INDIRECT(\"WP!$K\"&$DO44&\":$K\"&$DP44)>0))<>0,SUMPRODUCT(--(INDIRECT(\"WP!$C$\"&$DO44&\":$C$\"&$DP44)=$C44),--(INDIRECT(\"WP!$B\"&$DO44&\":$B\"&$DP44)=\"Y\"),--(INDIRECT(\"WP!$\"&$BG$41&\"$\"&$DO44&\":$\"&$BG$41&\"$\"&$DP44)<>\"\"),INDIRECT(\"WP!$K\"&$DO44&\":$K\"&$DP44)),\"\"),\"\"),\"\")","v":""},null,{"$f":"IFERROR(IF(WpAreaB_Sub1_exist,IF(SUMPRODUCT(--(INDIRECT(\"WP!$C$\"&$DO44&\":$C$\"&$DP44)=$C44),--(INDIRECT(\"WP!$\"&$BK$41&\"$\"&$DO44&\":$\"&$BK$41&\"$\"&$DP44)<>\"\"),--(INDIRECT(\"WP!$K$\"&$DO44&\":$K$\"&$DP44)>0))>0,SUMPRODUCT(--(INDIRECT(\"WP!$C$\"&$DO44&\":$C$\"&$DP44)=$C44),--(INDIRECT(\"WP!$\"&$BK$41&\"$\"&$DO44&\":$\"&$BK$41&\"$\"&$DP44)<>\"\"),INDIRECT(\"WP!$K\"&$DO44&\":$K\"&$DP44),INDIRECT(\"WP!$\"&$BK$41&\"$\"&$DO44&\":$\"&$BK$41&\"$\"&$DP44))/SUMPRODUCT(--(INDIRECT(\"WP!$C$\"&$DO44&\":$C$\"&$DP44)=$C44),--(INDIRECT(\"WP!$\"&$BK$41&\"$\"&$DO44&\":$\"&$BK$41&\"$\"&$DP44)<>\"\"),INDIRECT(\"WP!$K\"&$DO44&\":$K\"&$DP44)),\"\"),\"\"),\"\")","v":""},{"$f":"IFERROR(IF(WpAreaB_Sub1_exist,IF(SUMPRODUCT(--(INDIRECT(\"WP!$C$\"&$DO44&\":$C$\"&$DP44)=$C44),--(INDIRECT(\"WP!$B\"&$DO44&\":$B\"&$DP44)=\"Y\"),--(INDIRECT(\"WP!$\"&$BK$41&\"$\"&$DO44&\":$\"&$BK$41&\"$\"&$DP44)=1),--(INDIRECT(\"WP!$K\"&$DO44&\":$K\"&$DP44)>0))<>0,SUMPRODUCT(--(INDIRECT(\"WP!$C$\"&$DO44&\":$C$\"&$DP44)=$C44),--(INDIRECT(\"WP!$B\"&$DO44&\":$B\"&$DP44)=\"Y\"),--(INDIRECT(\"WP!$\"&$BK$41&\"$\"&$DO44&\":$\"&$BK$41&\"$\"&$DP44)=1),INDIRECT(\"WP!$K\"&$DO44&\":$K\"&$DP44)),IF(BM44<>\"\",0,\"\")),\"\"),\"\")","v":""},{"$f":"IFERROR(IF(WpAreaB_Sub1_exist,IF(SUMPRODUCT(--(INDIRECT(\"WP!$C$\"&$DO44&\":$C$\"&$DP44)=$C44),--(INDIRECT(\"WP!$B\"&$DO44&\":$B\"&$DP44)=\"Y\"),--(INDIRECT(\"WP!$\"&$BK$41&\"$\"&$DO44&\":$\"&$BK$41&\"$\"&$DP44)<>\"\"),--(INDIRECT(\"WP!$K\"&$DO44&\":$K\"&$DP44)>0))<>0,SUMPRODUCT(--(INDIRECT(\"WP!$C$\"&$DO44&\":$C$\"&$DP44)=$C44),--(INDIRECT(\"WP!$B\"&$DO44&\":$B\"&$DP44)=\"Y\"),--(INDIRECT(\"WP!$\"&$BK$41&\"$\"&$DO44&\":$\"&$BK$41&\"$\"&$DP44)<>\"\"),INDIRECT(\"WP!$K\"&$DO44&\":$K\"&$DP44)),\"\"),\"\"),\"\")","v":""},{"$f":"IFERROR(IF(WpAreaB_Sub2_exist,IF(SUMPRODUCT(--(INDIRECT(\"WP!$C$\"&$DO44&\":$C$\"&$DP44)=$C44),--(INDIRECT(\"WP!$\"&$BN$41&\"$\"&$DO44&\":$\"&$BN$41&\"$\"&$DP44)<>\"\"),--(INDIRECT(\"WP!$K$\"&$DO44&\":$K$\"&$DP44)>0))>0,SUMPRODUCT(--(INDIRECT(\"WP!$C$\"&$DO44&\":$C$\"&$DP44)=$C44),--(INDIRECT(\"WP!$\"&$BN$41&\"$\"&$DO44&\":$\"&$BN$41&\"$\"&$DP44)<>\"\"),INDIRECT(\"WP!$K\"&$DO44&\":$K\"&$DP44),INDIRECT(\"WP!$\"&$BN$41&\"$\"&$DO44&\":$\"&$BN$41&\"$\"&$DP44))/SUMPRODUCT(--(INDIRECT(\"WP!$C$\"&$DO44&\":$C$\"&$DP44)=$C44),--(INDIRECT(\"WP!$\"&$BN$41&\"$\"&$DO44&\":$\"&$BN$41&\"$\"&$DP44)<>\"\"),INDIRECT(\"WP!$K\"&$DO44&\":$K\"&$DP44)),\"\"),\"\"),\"\")","v":""},{"$f":"IFERROR(IF(WpAreaB_Sub2_exist,IF(SUMPRODUCT(--(INDIRECT(\"WP!$C$\"&$DO44&\":$C$\"&$DP44)=$C44),--(INDIRECT(\"WP!$B\"&$DO44&\":$B\"&$DP44)=\"Y\"),--(INDIRECT(\"WP!$\"&$BN$41&\"$\"&$DO44&\":$\"&$BN$41&\"$\"&$DP44)=1),--(INDIRECT(\"WP!$K\"&$DO44&\":$K\"&$DP44)>0))<>0,SUMPRODUCT(--(INDIRECT(\"WP!$C$\"&$DO44&\":$C$\"&$DP44)=$C44),--(INDIRECT(\"WP!$B\"&$DO44&\":$B\"&$DP44)=\"Y\"),--(INDIRECT(\"WP!$\"&$BN$41&\"$\"&$DO44&\":$\"&$BN$41&\"$\"&$DP44)=1),INDIRECT(\"WP!$K\"&$DO44&\":$K\"&$DP44)),IF(BP44<>\"\",0,\"\")),\"\"),\"\")","v":""},{"$f":"IFERROR(IF(WpAreaB_Sub2_exist,IF(SUMPRODUCT(--(INDIRECT(\"WP!$C$\"&$DO44&\":$C$\"&$DP44)=$C44),--(INDIRECT(\"WP!$B\"&$DO44&\":$B\"&$DP44)=\"Y\"),--(INDIRECT(\"WP!$\"&$BN$41&\"$\"&$DO44&\":$\"&$BN$41&\"$\"&$DP44)<>\"\"),--(INDIRECT(\"WP!$K\"&$DO44&\":$K\"&$DP44)>0))<>0,SUMPRODUCT(--(INDIRECT(\"WP!$C$\"&$DO44&\":$C$\"&$DP44)=$C44),--(INDIRECT(\"WP!$B\"&$DO44&\":$B\"&$DP44)=\"Y\"),--(INDIRECT(\"WP!$\"&$BN$41&\"$\"&$DO44&\":$\"&$BN$41&\"$\"&$DP44)<>\"\"),INDIRECT(\"WP!$K\"&$DO44&\":$K\"&$DP44)),\"\"),\"\"),\"\")","v":""},{"$f":"IFERROR(IF(WpAreaB_Sub3_exist,IF(SUMPRODUCT(--(INDIRECT(\"WP!$C$\"&$DO44&\":$C$\"&$DP44)=$C44),--(INDIRECT(\"WP!$\"&$BQ$41&\"$\"&$DO44&\":$\"&$BQ$41&\"$\"&$DP44)<>\"\"),--(INDIRECT(\"WP!$K$\"&$DO44&\":$K$\"&$DP44)>0))>0,SUMPRODUCT(--(INDIRECT(\"WP!$C$\"&$DO44&\":$C$\"&$DP44)=$C44),--(INDIRECT(\"WP!$\"&$BQ$41&\"$\"&$DO44&\":$\"&$BQ$41&\"$\"&$DP44)<>\"\"),INDIRECT(\"WP!$K\"&$DO44&\":$K\"&$DP44),INDIRECT(\"WP!$\"&$BQ$41&\"$\"&$DO44&\":$\"&$BQ$41&\"$\"&$DP44))/SUMPRODUCT(--(INDIRECT(\"WP!$C$\"&$DO44&\":$C$\"&$DP44)=$C44),--(INDIRECT(\"WP!$\"&$BQ$41&\"$\"&$DO44&\":$\"&$BQ$41&\"$\"&$DP44)<>\"\"),INDIRECT(\"WP!$K\"&$DO44&\":$K\"&$DP44)),\"\"),\"\"),\"\")","v":""},{"$f":"IFERROR(IF(WpAreaB_Sub3_exist,IF(SUMPRODUCT(--(INDIRECT(\"WP!$C$\"&$DO44&\":$C$\"&$DP44)=$C44),--(INDIRECT(\"WP!$B\"&$DO44&\":$B\"&$DP44)=\"Y\"),--(INDIRECT(\"WP!$\"&$BQ$41&\"$\"&$DO44&\":$\"&$BQ$41&\"$\"&$DP44)=1),--(INDIRECT(\"WP!$K\"&$DO44&\":$K\"&$DP44)>0))<>0,SUMPRODUCT(--(INDIRECT(\"WP!$C$\"&$DO44&\":$C$\"&$DP44)=$C44),--(INDIRECT(\"WP!$B\"&$DO44&\":$B\"&$DP44)=\"Y\"),--(INDIRECT(\"WP!$\"&$BQ$41&\"$\"&$DO44&\":$\"&$BQ$41&\"$\"&$DP44)=1),INDIRECT(\"WP!$K\"&$DO44&\":$K\"&$DP44)),IF(BS44<>\"\",0,\"\")),\"\"),\"\")","v":""},{"$f":"IFERROR(IF(WpAreaB_Sub3_exist,IF(SUMPRODUCT(--(INDIRECT(\"WP!$C$\"&$DO44&\":$C$\"&$DP44)=$C44),--(INDIRECT(\"WP!$B\"&$DO44&\":$B\"&$DP44)=\"Y\"),--(INDIRECT(\"WP!$\"&$BQ$41&\"$\"&$DO44&\":$\"&$BQ$41&\"$\"&$DP44)<>\"\"),--(INDIRECT(\"WP!$K\"&$DO44&\":$K\"&$DP44)>0))<>0,SUMPRODUCT(--(INDIRECT(\"WP!$C$\"&$DO44&\":$C$\"&$DP44)=$C44),--(INDIRECT(\"WP!$B\"&$DO44&\":$B\"&$DP44)=\"Y\"),--(INDIRECT(\"WP!$\"&$BQ$41&\"$\"&$DO44&\":$\"&$BQ$41&\"$\"&$DP44)<>\"\"),INDIRECT(\"WP!$K\"&$DO44&\":$K\"&$DP44)),\"\"),\"\"),\"\")","v":""},null,{"$f":"IFERROR(IF(WpAreaC_Sub1_exist,IF(SUMPRODUCT(--(INDIRECT(\"WP!$C$\"&$DO44&\":$C$\"&$DP44)=$C44),--(INDIRECT(\"WP!$\"&$BU$41&\"$\"&$DO44&\":$\"&$BU$41&\"$\"&$DP44)<>\"\"),--(INDIRECT(\"WP!$K$\"&$DO44&\":$K$\"&$DP44)>0))>0,SUMPRODUCT(--(INDIRECT(\"WP!$C$\"&$DO44&\":$C$\"&$DP44)=$C44),--(INDIRECT(\"WP!$\"&$BU$41&\"$\"&$DO44&\":$\"&$BU$41&\"$\"&$DP44)<>\"\"),INDIRECT(\"WP!$K\"&$DO44&\":$K\"&$DP44),INDIRECT(\"WP!$\"&$BU$41&\"$\"&$DO44&\":$\"&$BU$41&\"$\"&$DP44))/SUMPRODUCT(--(INDIRECT(\"WP!$C$\"&$DO44&\":$C$\"&$DP44)=$C44),--(INDIRECT(\"WP!$\"&$BU$41&\"$\"&$DO44&\":$\"&$BU$41&\"$\"&$DP44)<>\"\"),INDIRECT(\"WP!$K\"&$DO44&\":$K\"&$DP44)),\"\"),\"\"),\"\")","v":""},{"$f":"IFERROR(IF(WpAreaC_Sub1_exist,IF(SUMPRODUCT(--(INDIRECT(\"WP!$C$\"&$DO44&\":$C$\"&$DP44)=$C44),--(INDIRECT(\"WP!$B\"&$DO44&\":$B\"&$DP44)=\"Y\"),--(INDIRECT(\"WP!$\"&$BU$41&\"$\"&$DO44&\":$\"&$BU$41&\"$\"&$DP44)=1),--(INDIRECT(\"WP!$K\"&$DO44&\":$K\"&$DP44)>0))<>0,SUMPRODUCT(--(INDIRECT(\"WP!$C$\"&$DO44&\":$C$\"&$DP44)=$C44),--(INDIRECT(\"WP!$B\"&$DO44&\":$B\"&$DP44)=\"Y\"),--(INDIRECT(\"WP!$\"&$BU$41&\"$\"&$DO44&\":$\"&$BU$41&\"$\"&$DP44)=1),INDIRECT(\"WP!$K\"&$DO44&\":$K\"&$DP44)),IF(BW44<>\"\",0,\"\")),\"\"),\"\")","v":""},{"$f":"IFERROR(IF(WpAreaC_Sub1_exist,IF(SUMPRODUCT(--(INDIRECT(\"WP!$C$\"&$DO44&\":$C$\"&$DP44)=$C44),--(INDIRECT(\"WP!$B\"&$DO44&\":$B\"&$DP44)=\"Y\"),--(INDIRECT(\"WP!$\"&$BU$41&\"$\"&$DO44&\":$\"&$BU$41&\"$\"&$DP44)<>\"\"),--(INDIRECT(\"WP!$K\"&$DO44&\":$K\"&$DP44)>0))<>0,SUMPRODUCT(--(INDIRECT(\"WP!$C$\"&$DO44&\":$C$\"&$DP44)=$C44),--(INDIRECT(\"WP!$B\"&$DO44&\":$B\"&$DP44)=\"Y\"),--(INDIRECT(\"WP!$\"&$BU$41&\"$\"&$DO44&\":$\"&$BU$41&\"$\"&$DP44)<>\"\"),INDIRECT(\"WP!$K\"&$DO44&\":$K\"&$DP44)),\"\"),\"\"),\"\")","v":""},{"$f":"IFERROR(IF(WpAreaC_Sub2_exist,IF(SUMPRODUCT(--(INDIRECT(\"WP!$C$\"&$DO44&\":$C$\"&$DP44)=$C44),--(INDIRECT(\"WP!$\"&$BX$41&\"$\"&$DO44&\":$\"&$BX$41&\"$\"&$DP44)<>\"\"),--(INDIRECT(\"WP!$K$\"&$DO44&\":$K$\"&$DP44)>0))>0,SUMPRODUCT(--(INDIRECT(\"WP!$C$\"&$DO44&\":$C$\"&$DP44)=$C44),--(INDIRECT(\"WP!$\"&$BX$41&\"$\"&$DO44&\":$\"&$BX$41&\"$\"&$DP44)<>\"\"),INDIRECT(\"WP!$K\"&$DO44&\":$K\"&$DP44),INDIRECT(\"WP!$\"&$BX$41&\"$\"&$DO44&\":$\"&$BX$41&\"$\"&$DP44))/SUMPRODUCT(--(INDIRECT(\"WP!$C$\"&$DO44&\":$C$\"&$DP44)=$C44),--(INDIRECT(\"WP!$\"&$BX$41&\"$\"&$DO44&\":$\"&$BX$41&\"$\"&$DP44)<>\"\"),INDIRECT(\"WP!$K\"&$DO44&\":$K\"&$DP44)),\"\"),\"\"),\"\")","v":""},{"$f":"IFERROR(IF(WpAreaC_Sub2_exist,IF(SUMPRODUCT(--(INDIRECT(\"WP!$C$\"&$DO44&\":$C$\"&$DP44)=$C44),--(INDIRECT(\"WP!$B\"&$DO44&\":$B\"&$DP44)=\"Y\"),--(INDIRECT(\"WP!$\"&$BX$41&\"$\"&$DO44&\":$\"&$BX$41&\"$\"&$DP44)=1),--(INDIRECT(\"WP!$K\"&$DO44&\":$K\"&$DP44)>0))<>0,SUMPRODUCT(--(INDIRECT(\"WP!$C$\"&$DO44&\":$C$\"&$DP44)=$C44),--(INDIRECT(\"WP!$B\"&$DO44&\":$B\"&$DP44)=\"Y\"),--(INDIRECT(\"WP!$\"&$BX$41&\"$\"&$DO44&\":$\"&$BX$41&\"$\"&$DP44)=1),INDIRECT(\"WP!$K\"&$DO44&\":$K\"&$DP44)),IF(BZ44<>\"\",0,\"\")),\"\"),\"\")","v":""},{"$f":"IFERROR(IF(WpAreaC_Sub2_exist,IF(SUMPRODUCT(--(INDIRECT(\"WP!$C$\"&$DO44&\":$C$\"&$DP44)=$C44),--(INDIRECT(\"WP!$B\"&$DO44&\":$B\"&$DP44)=\"Y\"),--(INDIRECT(\"WP!$\"&$BX$41&\"$\"&$DO44&\":$\"&$BX$41&\"$\"&$DP44)<>\"\"),--(INDIRECT(\"WP!$K\"&$DO44&\":$K\"&$DP44)>0))<>0,SUMPRODUCT(--(INDIRECT(\"WP!$C$\"&$DO44&\":$C$\"&$DP44)=$C44),--(INDIRECT(\"WP!$B\"&$DO44&\":$B\"&$DP44)=\"Y\"),--(INDIRECT(\"WP!$\"&$BX$41&\"$\"&$DO44&\":$\"&$BX$41&\"$\"&$DP44)<>\"\"),INDIRECT(\"WP!$K\"&$DO44&\":$K\"&$DP44)),\"\"),\"\"),\"\")","v":""},{"$f":"IFERROR(IF(WpAreaC_Sub3_exist,IF(SUMPRODUCT(--(INDIRECT(\"WP!$C$\"&$DO44&\":$C$\"&$DP44)=$C44),--(INDIRECT(\"WP!$\"&$CA$41&\"$\"&$DO44&\":$\"&$CA$41&\"$\"&$DP44)<>\"\"),--(INDIRECT(\"WP!$K$\"&$DO44&\":$K$\"&$DP44)>0))>0,SUMPRODUCT(--(INDIRECT(\"WP!$C$\"&$DO44&\":$C$\"&$DP44)=$C44),--(INDIRECT(\"WP!$\"&$CA$41&\"$\"&$DO44&\":$\"&$CA$41&\"$\"&$DP44)<>\"\"),INDIRECT(\"WP!$K\"&$DO44&\":$K\"&$DP44),INDIRECT(\"WP!$\"&$CA$41&\"$\"&$DO44&\":$\"&$CA$41&\"$\"&$DP44))/SUMPRODUCT(--(INDIRECT(\"WP!$C$\"&$DO44&\":$C$\"&$DP44)=$C44),--(INDIRECT(\"WP!$\"&$CA$41&\"$\"&$DO44&\":$\"&$CA$41&\"$\"&$DP44)<>\"\"),INDIRECT(\"WP!$K\"&$DO44&\":$K\"&$DP44)),\"\"),\"\"),\"\")","v":""},{"$f":"IFERROR(IF(WpAreaC_Sub3_exist,IF(SUMPRODUCT(--(INDIRECT(\"WP!$C$\"&$DO44&\":$C$\"&$DP44)=$C44),--(INDIRECT(\"WP!$B\"&$DO44&\":$B\"&$DP44)=\"Y\"),--(INDIRECT(\"WP!$\"&$CA$41&\"$\"&$DO44&\":$\"&$CA$41&\"$\"&$DP44)=1),--(INDIRECT(\"WP!$K\"&$DO44&\":$K\"&$DP44)>0))<>0,SUMPRODUCT(--(INDIRECT(\"WP!$C$\"&$DO44&\":$C$\"&$DP44)=$C44),--(INDIRECT(\"WP!$B\"&$DO44&\":$B\"&$DP44)=\"Y\"),--(INDIRECT(\"WP!$\"&$CA$41&\"$\"&$DO44&\":$\"&$CA$41&\"$\"&$DP44)=1),INDIRECT(\"WP!$K\"&$DO44&\":$K\"&$DP44)),IF(CC44<>\"\",0,\"\")),\"\"),\"\")","v":""},{"$f":"IFERROR(IF(WpAreaC_Sub3_exist,IF(SUMPRODUCT(--(INDIRECT(\"WP!$C$\"&$DO44&\":$C$\"&$DP44)=$C44),--(INDIRECT(\"WP!$B\"&$DO44&\":$B\"&$DP44)=\"Y\"),--(INDIRECT(\"WP!$\"&$CA$41&\"$\"&$DO44&\":$\"&$CA$41&\"$\"&$DP44)<>\"\"),--(INDIRECT(\"WP!$K\"&$DO44&\":$K\"&$DP44)>0))<>0,SUMPRODUCT(--(INDIRECT(\"WP!$C$\"&$DO44&\":$C$\"&$DP44)=$C44),--(INDIRECT(\"WP!$B\"&$DO44&\":$B\"&$DP44)=\"Y\"),--(INDIRECT(\"WP!$\"&$CA$41&\"$\"&$DO44&\":$\"&$CA$41&\"$\"&$DP44)<>\"\"),INDIRECT(\"WP!$K\"&$DO44&\":$K\"&$DP44)),\"\"),\"\"),\"\")","v":""},null,null,null,null,"","","","","","","","","","","","",null,"","","","","","","","","",null,"","","","","","","","","",null,{"$f":"MIN(IF(WP!$C$12:$C$79=$C44,ROW(WP!$C$12:$C$79),\"\"))","v":16},{"$f":"MAX(IF(WP!$C$12:$C$79=$C44,ROW(WP!$C$12:$C$79),\"\"))","v":21}]
[null,"LTE RF/RRM"]
[null,"RF common parts","36.521-4",{"$f":"getProgress(AX46,CH46,\"%\",1,1)","v":""},{"$f":"getProgress(AY46,CI46,,,1)","v":""},{"$f":"getProgress(AZ46,CJ46,,,1)","v":""},null,{"$f":"getProgress(BA46,CK46,\"%\",1,1,WpAreaA_Sub1_exist)","v":""},{"$f":"getProgress(BB46,CL46,,,1,WpAreaA_Sub1_exist)","v":""},{"$f":"getProgress(BC46,CM46,,,1,WpAreaA_Sub1_exist)","v":""},{"$f":"getProgress(BD46,CN46,\"%\",1,1,WpAreaA_Sub2_exist)","v":""},{"$f":"getProgress(BE46,CO46,,,1,WpAreaA_Sub2_exist)","v":""},{"$f":"getProgress(BF46,CP46,,,1,WpAreaA_Sub2_exist)","v":""},{"$f":"getProgress(BG46,CQ46,\"%\",1,1,WpAreaA_Sub3_exist)","v":""},{"$f":"getProgress(BH46,CR46,,,1,WpAreaA_Sub3_exist)","v":""},{"$f":"getProgress(BI46,CS46,,,1,WpAreaA_Sub3_exist)","v":""},null,{"$f":"getProgress(BK46,CU46,\"%\",1,1,WpAreaB_Sub1_exist)","v":""},{"$f":"getProgress(BL46,CV46,,,1,WpAreaB_Sub1_exist)","v":""},{"$f":"getProgress(BM46,CW46,,,1,WpAreaB_Sub1_exist)","v":""},{"$f":"getProgress(BN46,CX46,\"%\",1,1,WpAreaB_Sub2_exist)","v":""},{"$f":"getProgress(BO46,CY46,,,1,WpAreaB_Sub2_exist)","v":""},{"$f":"getProgress(BP46,CZ46,,,1,WpAreaB_Sub2_exist)","v":""},{"$f":"getProgress(BQ46,DA46,\"%\",1,1,WpAreaB_Sub3_exist)","v":""},{"$f":"getProgress(BR46,DB46,,,1,WpAreaB_Sub3_exist)","v":""},{"$f":"getProgress(BS46,DC46,,,1,WpAreaB_Sub3_exist)","v":""},null,{"$f":"getProgress(BU46,DE46,\"%\",1,1,WpAreaC_Sub1_exist)","v":""},{"$f":"getProgress(BV46,DF46,,,1,WpAreaC_Sub1_exist)","v":""},{"$f":"getProgress(BW46,DG46,,,1,WpAreaC_Sub1_exist)","v":""},{"$f":"getProgress(BX46,DH46,\"%\",1,1,WpAreaC_Sub2_exist)","v":""},{"$f":"getProgress(BY46,DI46,,,1,WpAreaC_Sub2_exist)","v":""},{"$f":"getProgress(BZ46,DJ46,,,1,WpAreaC_Sub2_exist)","v":""},{"$f":"getProgress(CA46,DK46,\"%\",1,1,WpAreaC_Sub3_exist)","v":""},{"$f":"getProgress(CB46,DL46,,,1,WpAreaC_Sub3_exist)","v":""},{"$f":"getProgress(CC46,DM46,,,1,WpAreaC_Sub3_exist)","v":""},null,null,null,null,null,null,null,null,null,null,null,null,null,{"$f":"IFERROR((IF(WpAreaA_exist,IF(BA46<>\"\",BA46*WP!$AB$9,0)+IF(BD46<>\"\",BD46*WP!$AC$9,0)+IF(BG46<>\"\",BG46*WP!$AD$9,0),0)+IF(WpAreaB_exist,IF(BK46<>\"\",BK46*WP!$AE$10)+IF(BN46<>\"\",BN46*WP!$AF$10,0)+IF(BQ46<>\"\",BQ46*WP!$AG$10,0),0)+IF(WpAreaC_exist,IF(BU46<>\"\",BU46*WP!$AH$10)+IF(BX46<>\"\",BX46*WP!$AI$10,0)+IF(CA46<>\"\",CA46*WP!$AJ$10,0),0))/(IF(WpAreaA_exist,IF(BA46<>\"\",WP!$AB$9,0)+IF(BD46<>\"\",WP!$AC$9,0)+IF(BG46<>\"\",WP!$AD$9,0),0)+IF(WpAreaB_exist,IF(BK46<>\"\",WP!$AE$10,0)+IF(BN46<>\"\",WP!$AF$10,0)+IF(BQ46<>\"\",WP!$AG$10,0),0)+IF(WpAreaC_exist,IF(BU46<>\"\",WP!$AH$10,0)+IF(BX46<>\"\",WP!$AI$10,0)+IF(CA46<>\"\",WP!$AJ$10,0),0)),\"\")","v":""},{"$f":"IFERROR(IF(SUMPRODUCT(--(INDIRECT(\"WP!$C$\"&$DO46&\":$C$\"&$DP46)=$C46),--(INDIRECT(\"WP!$B$\"&$DO46&\":$B$\"&$DP46)=\"Y\"),--(INDIRECT(\"WP!$\"&$AX$41&\"$\"&$DO46&\":$\"&$AX$41&\"$\"&$DP46)=1),--(INDIRECT(\"WP!$K$\"&$DO46&\":$K$\"&$DP46)>0))<>0,SUMPRODUCT(--(INDIRECT(\"WP!$C$\"&$DO46&\":$C$\"&$DP46)=$C46),--(INDIRECT(\"WP!$B$\"&$DO46&\":$B$\"&$DP46)=\"Y\"),--(INDIRECT(\"WP!$\"&$AX$41&\"$\"&$DO46&\":$\"&$AX$41&\"$\"&$DP46)=1),INDIRECT(\"WP!$K$\"&$DO46&\":$K$\"&$DP46)),IF(AZ46<>\"\",0,\"\")),\"\")","v":""},{"$f":"IFERROR(IF(SUMPRODUCT(--(INDIRECT(\"WP!$C$\"&$DO46&\":$C$\"&$DP46)=$C46),--(INDIRECT(\"WP!$B\"&$DO46&\":$B\"&$DP46)=\"Y\"),--(INDIRECT(\"WP!$\"&$AX$41&\"$\"&$DO46&\":$\"&$AX$41&\"$\"&$DP46)<>\"\"),--(INDIRECT(\"WP!$K\"&$DO46&\":$K\"&$DP46)>0))<>0,SUMPRODUCT(--(INDIRECT(\"WP!$C$\"&$DO46&\":$C$\"&$DP46)=$C46),--(INDIRECT(\"WP!$B\"&$DO46&\":$B\"&$DP46)=\"Y\"),--(INDIRECT(\"WP!$\"&$AX$41&\"$\"&$DO46&\":$\"&$AX$41&\"$\"&$DP46)<>\"\"),INDIRECT(\"WP!$K\"&$DO46&\":$K\"&$DP46)),\"\"),\"\")","v":""},{"$f":"IFERROR(IF(WpAreaA_Sub1_exist,IF(SUMPRODUCT(--(INDIRECT(\"WP!$C$\"&$DO46&\":$C$\"&$DP46)=$C46),--(INDIRECT(\"WP!$\"&$BA$41&\"$\"&$DO46&\":$\"&$BA$41&\"$\"&$DP46)<>\"\"),--(INDIRECT(\"WP!$K$\"&$DO46&\":$K$\"&$DP46)>0))>0,SUMPRODUCT(--(INDIRECT(\"WP!$C$\"&$DO46&\":$C$\"&$DP46)=$C46),--(INDIRECT(\"WP!$\"&$BA$41&\"$\"&$DO46&\":$\"&$BA$41&\"$\"&$DP46)<>\"\"),INDIRECT(\"WP!$K$\"&$DO46&\":$K$\"&$DP46),INDIRECT(\"WP!$\"&$BA$41&\"$\"&$DO46&\":$\"&$BA$41&\"$\"&$DP46))/SUMPRODUCT(--(INDIRECT(\"WP!$C$\"&$DO46&\":$C$\"&$DP46)=$C46),--(INDIRECT(\"WP!$\"&$BA$41&\"$\"&$DO46&\":$\"&$BA$41&\"$\"&$DP46)<>\"\"),INDIRECT(\"WP!$K$\"&$DO46&\":$K$\"&$DP46)),\"\"),\"\"),\"\")","v":""},{"$f":"IFERROR(IF(WpAreaA_Sub1_exist,IF(SUMPRODUCT(--(INDIRECT(\"WP!$C$\"&$DO46&\":$C$\"&$DP46)=$C46),--(INDIRECT(\"WP!$B$\"&$DO46&\":$B$\"&$DP46)=\"Y\"),--(INDIRECT(\"WP!$\"&$BA$41&\"$\"&$DO46&\":$\"&$BA$41&\"$\"&$DP46)=1),--(INDIRECT(\"WP!$K$\"&$DO46&\":$K$\"&$DP46)>0))<>0,SUMPRODUCT(--(INDIRECT(\"WP!$C$\"&$DO46&\":$C$\"&$DP46)=$C46),--(INDIRECT(\"WP!$B$\"&$DO46&\":$B$\"&$DP46)=\"Y\"),--(INDIRECT(\"WP!$\"&$BA$41&\"$\"&$DO46&\":$\"&$BA$41&\"$\"&$DP46)=1),INDIRECT(\"WP!$K$\"&$DO46&\":$K$\"&$DP46)),IF(BC46<>\"\",0,\"\")),\"\"),\"\")","v":""},{"$f":"IFERROR(IF(WpAreaA_Sub1_exist,IF(SUMPRODUCT(--(INDIRECT(\"WP!$C$\"&$DO46&\":$C$\"&$DP46)=$C46),--(INDIRECT(\"WP!$B\"&$DO46&\":$B\"&$DP46)=\"Y\"),--(INDIRECT(\"WP!$\"&$BA$41&\"$\"&$DO46&\":$\"&$BA$41&\"$\"&$DP46)<>\"\"),--(INDIRECT(\"WP!$K\"&$DO46&\":$K\"&$DP46)>0))<>0,SUMPRODUCT(--(INDIRECT(\"WP!$C$\"&$DO46&\":$C$\"&$DP46)=$C46),--(INDIRECT(\"WP!$B\"&$DO46&\":$B\"&$DP46)=\"Y\"),--(INDIRECT(\"WP!$\"&$BA$41&\"$\"&$DO46&\":$\"&$BA$41&\"$\"&$DP46)<>\"\"),INDIRECT(\"WP!$K\"&$DO46&\":$K\"&$DP46)),\"\"),\"\"),\"\")","v":""},{"$f":"IFERROR(IF(WpAreaA_Sub2_exist,IF(SUMPRODUCT(--(INDIRECT(\"WP!$C$\"&$DO46&\":$C$\"&$DP46)=$C46),--(INDIRECT(\"WP!$\"&$BD$41&\"$\"&$DO46&\":$\"&$BD$41&\"$\"&$DP46)<>\"\"),--(INDIRECT(\"WP!$K$\"&$DO46&\":$K$\"&$DP46)>0))>0,SUMPRODUCT(--(INDIRECT(\"WP!$C$\"&$DO46&\":$C$\"&$DP46)=$C46),--(INDIRECT(\"WP!$\"&$BD$41&\"$\"&$DO46&\":$\"&$BD$41&\"$\"&$DP46)<>\"\"),INDIRECT(\"WP!$K\"&$DO46&\":$K\"&$DP46),INDIRECT(\"WP!$\"&$BD$41&\"$\"&$DO46&\":$\"&$BD$41&\"$\"&$DP46))/SUMPRODUCT(--(INDIRECT(\"WP!$C$\"&$DO46&\":$C$\"&$DP46)=$C46),--(INDIRECT(\"WP!$\"&$BD$41&\"$\"&$DO46&\":$\"&$BD$41&\"$\"&$DP46)<>\"\"),INDIRECT(\"WP!$K\"&$DO46&\":$K\"&$DP46)),\"\"),\"\"),\"\")","v":""},{"$f":"IFERROR(IF(WpAreaA_Sub2_exist,IF(SUMPRODUCT(--(INDIRECT(\"WP!$C$\"&$DO46&\":$C$\"&$DP46)=$C46),--(INDIRECT(\"WP!$B\"&$DO46&\":$B\"&$DP46)=\"Y\"),--(INDIRECT(\"WP!$\"&$BD$41&\"$\"&$DO46&\":$\"&$BD$41&\"$\"&$DP46)=1),--(INDIRECT(\"WP!$K\"&$DO46&\":$K\"&$DP46)>0))<>0,SUMPRODUCT(--(INDIRECT(\"WP!$C$\"&$DO46&\":$C$\"&$DP46)=$C46),--(INDIRECT(\"WP!$B\"&$DO46&\":$B\"&$DP46)=\"Y\"),--(INDIRECT(\"WP!$\"&$BD$41&\"$\"&$DO46&\":$\"&$BD$41&\"$\"&$DP46)=1),INDIRECT(\"WP!$K\"&$DO46&\":$K\"&$DP46)),IF(BF46<>\"\",0,\"\")),\"\"),\"\")","v":""},{"$f":"IFERROR(IF(WpAreaA_Sub2_exist,IF(SUMPRODUCT(--(INDIRECT(\"WP!$C$\"&$DO46&\":$C$\"&$DP46)=$C46),--(INDIRECT(\"WP!$B\"&$DO46&\":$B\"&$DP46)=\"Y\"),--(INDIRECT(\"WP!$\"&$BD$41&\"$\"&$DO46&\":$\"&$BD$41&\"$\"&$DP46)<>\"\"),--(INDIRECT(\"WP!$K\"&$DO46&\":$K\"&$DP46)>0))<>0,SUMPRODUCT(--(INDIRECT(\"WP!$C$\"&$DO46&\":$C$\"&$DP46)=$C46),--(INDIRECT(\"WP!$B\"&$DO46&\":$B\"&$DP46)=\"Y\"),--(INDIRECT(\"WP!$\"&$BD$41&\"$\"&$DO46&\":$\"&$BD$41&\"$\"&$DP46)<>\"\"),INDIRECT(\"WP!$K\"&$DO46&\":$K\"&$DP46)),\"\"),\"\"),\"\")","v":""},{"$f":"IFERROR(IF(WpAreaA_Sub3_exist,IF(SUMPRODUCT(--(INDIRECT(\"WP!$C$\"&$DO46&\":$C$\"&$DP46)=$C46),--(INDIRECT(\"WP!$\"&$BG$41&\"$\"&$DO46&\":$\"&$BG$41&\"$\"&$DP46)<>\"\"),--(INDIRECT(\"WP!$K$\"&$DO46&\":$K$\"&$DP46)>0))>0,SUMPRODUCT(--(INDIRECT(\"WP!$C$\"&$DO46&\":$C$\"&$DP46)=$C46),--(INDIRECT(\"WP!$\"&$BG$41&\"$\"&$DO46&\":$\"&$BG$41&\"$\"&$DP46)<>\"\"),INDIRECT(\"WP!$K\"&$DO46&\":$K\"&$DP46),INDIRECT(\"WP!$\"&$BG$41&\"$\"&$DO46&\":$\"&$BG$41&\"$\"&$DP46))/SUMPRODUCT(--(INDIRECT(\"WP!$C$\"&$DO46&\":$C$\"&$DP46)=$C46),--(INDIRECT(\"WP!$\"&$BG$41&\"$\"&$DO46&\":$\"&$BG$41&\"$\"&$DP46)<>\"\"),INDIRECT(\"WP!$K\"&$DO46&\":$K\"&$DP46)),\"\"),\"\"),\"\")","v":""},{"$f":"IFERROR(IF(WpAreaA_Sub3_exist,IF(SUMPRODUCT(--(INDIRECT(\"WP!$C$\"&$DO46&\":$C$\"&$DP46)=$C46),--(INDIRECT(\"WP!$B\"&$DO46&\":$B\"&$DP46)=\"Y\"),--(INDIRECT(\"WP!$\"&$BG$41&\"$\"&$DO46&\":$\"&$BG$41&\"$\"&$DP46)=1),--(INDIRECT(\"WP!$K\"&$DO46&\":$K\"&$DP46)>0))<>0,SUMPRODUCT(--(INDIRECT(\"WP!$C$\"&$DO46&\":$C$\"&$DP46)=$C46),--(INDIRECT(\"WP!$B\"&$DO46&\":$B\"&$DP46)=\"Y\"),--(INDIRECT(\"WP!$\"&$BG$41&\"$\"&$DO46&\":$\"&$BG$41&\"$\"&$DP46)=1),INDIRECT(\"WP!$K\"&$DO46&\":$K\"&$DP46)),IF(BI46<>\"\",0,\"\")),\"\"),\"\")","v":""},{"$f":"IFERROR(IF(WpAreaA_Sub3_exist,IF(SUMPRODUCT(--(INDIRECT(\"WP!$C$\"&$DO46&\":$C$\"&$DP46)=$C46),--(INDIRECT(\"WP!$B\"&$DO46&\":$B\"&$DP46)=\"Y\"),--(INDIRECT(\"WP!$\"&$BG$41&\"$\"&$DO46&\":$\"&$BG$41&\"$\"&$DP46)<>\"\"),--(INDIRECT(\"WP!$K\"&$DO46&\":$K\"&$DP46)>0))<>0,SUMPRODUCT(--(INDIRECT(\"WP!$C$\"&$DO46&\":$C$\"&$DP46)=$C46),--(INDIRECT(\"WP!$B\"&$DO46&\":$B\"&$DP46)=\"Y\"),--(INDIRECT(\"WP!$\"&$BG$41&\"$\"&$DO46&\":$\"&$BG$41&\"$\"&$DP46)<>\"\"),INDIRECT(\"WP!$K\"&$DO46&\":$K\"&$DP46)),\"\"),\"\"),\"\")","v":""},null,{"$f":"IFERROR(IF(WpAreaB_Sub1_exist,IF(SUMPRODUCT(--(INDIRECT(\"WP!$C$\"&$DO46&\":$C$\"&$DP46)=$C46),--(INDIRECT(\"WP!$\"&$BK$41&\"$\"&$DO46&\":$\"&$BK$41&\"$\"&$DP46)<>\"\"),--(INDIRECT(\"WP!$K$\"&$DO46&\":$K$\"&$DP46)>0))>0,SUMPRODUCT(--(INDIRECT(\"WP!$C$\"&$DO46&\":$C$\"&$DP46)=$C46),--(INDIRECT(\"WP!$\"&$BK$41&\"$\"&$DO46&\":$\"&$BK$41&\"$\"&$DP46)<>\"\"),INDIRECT(\"WP!$K\"&$DO46&\":$K\"&$DP46),INDIRECT(\"WP!$\"&$BK$41&\"$\"&$DO46&\":$\"&$BK$41&\"$\"&$DP46))/SUMPRODUCT(--(INDIRECT(\"WP!$C$\"&$DO46&\":$C$\"&$DP46)=$C46),--(INDIRECT(\"WP!$\"&$BK$41&\"$\"&$DO46&\":$\"&$BK$41&\"$\"&$DP46)<>\"\"),INDIRECT(\"WP!$K\"&$DO46&\":$K\"&$DP46)),\"\"),\"\"),\"\")","v":""},{"$f":"IFERROR(IF(WpAreaB_Sub1_exist,IF(SUMPRODUCT(--(INDIRECT(\"WP!$C$\"&$DO46&\":$C$\"&$DP46)=$C46),--(INDIRECT(\"WP!$B\"&$DO46&\":$B\"&$DP46)=\"Y\"),--(INDIRECT(\"WP!$\"&$BK$41&\"$\"&$DO46&\":$\"&$BK$41&\"$\"&$DP46)=1),--(INDIRECT(\"WP!$K\"&$DO46&\":$K\"&$DP46)>0))<>0,SUMPRODUCT(--(INDIRECT(\"WP!$C$\"&$DO46&\":$C$\"&$DP46)=$C46),--(INDIRECT(\"WP!$B\"&$DO46&\":$B\"&$DP46)=\"Y\"),--(INDIRECT(\"WP!$\"&$BK$41&\"$\"&$DO46&\":$\"&$BK$41&\"$\"&$DP46)=1),INDIRECT(\"WP!$K\"&$DO46&\":$K\"&$DP46)),IF(BM46<>\"\",0,\"\")),\"\"),\"\")","v":""},{"$f":"IFERROR(IF(WpAreaB_Sub1_exist,IF(SUMPRODUCT(--(INDIRECT(\"WP!$C$\"&$DO46&\":$C$\"&$DP46)=$C46),--(INDIRECT(\"WP!$B\"&$DO46&\":$B\"&$DP46)=\"Y\"),--(INDIRECT(\"WP!$\"&$BK$41&\"$\"&$DO46&\":$\"&$BK$41&\"$\"&$DP46)<>\"\"),--(INDIRECT(\"WP!$K\"&$DO46&\":$K\"&$DP46)>0))<>0,SUMPRODUCT(--(INDIRECT(\"WP!$C$\"&$DO46&\":$C$\"&$DP46)=$C46),--(INDIRECT(\"WP!$B\"&$DO46&\":$B\"&$DP46)=\"Y\"),--(INDIRECT(\"WP!$\"&$BK$41&\"$\"&$DO46&\":$\"&$BK$41&\"$\"&$DP46)<>\"\"),INDIRECT(\"WP!$K\"&$DO46&\":$K\"&$DP46)),\"\"),\"\"),\"\")","v":""},{"$f":"IFERROR(IF(WpAreaB_Sub2_exist,IF(SUMPRODUCT(--(INDIRECT(\"WP!$C$\"&$DO46&\":$C$\"&$DP46)=$C46),--(INDIRECT(\"WP!$\"&$BN$41&\"$\"&$DO46&\":$\"&$BN$41&\"$\"&$DP46)<>\"\"),--(INDIRECT(\"WP!$K$\"&$DO46&\":$K$\"&$DP46)>0))>0,SUMPRODUCT(--(INDIRECT(\"WP!$C$\"&$DO46&\":$C$\"&$DP46)=$C46),--(INDIRECT(\"WP!$\"&$BN$41&\"$\"&$DO46&\":$\"&$BN$41&\"$\"&$DP46)<>\"\"),INDIRECT(\"WP!$K\"&$DO46&\":$K\"&$DP46),INDIRECT(\"WP!$\"&$BN$41&\"$\"&$DO46&\":$\"&$BN$41&\"$\"&$DP46))/SUMPRODUCT(--(INDIRECT(\"WP!$C$\"&$DO46&\":$C$\"&$DP46)=$C46),--(INDIRECT(\"WP!$\"&$BN$41&\"$\"&$DO46&\":$\"&$BN$41&\"$\"&$DP46)<>\"\"),INDIRECT(\"WP!$K\"&$DO46&\":$K\"&$DP46)),\"\"),\"\"),\"\")","v":""},{"$f":"IFERROR(IF(WpAreaB_Sub2_exist,IF(SUMPRODUCT(--(INDIRECT(\"WP!$C$\"&$DO46&\":$C$\"&$DP46)=$C46),--(INDIRECT(\"WP!$B\"&$DO46&\":$B\"&$DP46)=\"Y\"),--(INDIRECT(\"WP!$\"&$BN$41&\"$\"&$DO46&\":$\"&$BN$41&\"$\"&$DP46)=1),--(INDIRECT(\"WP!$K\"&$DO46&\":$K\"&$DP46)>0))<>0,SUMPRODUCT(--(INDIRECT(\"WP!$C$\"&$DO46&\":$C$\"&$DP46)=$C46),--(INDIRECT(\"WP!$B\"&$DO46&\":$B\"&$DP46)=\"Y\"),--(INDIRECT(\"WP!$\"&$BN$41&\"$\"&$DO46&\":$\"&$BN$41&\"$\"&$DP46)=1),INDIRECT(\"WP!$K\"&$DO46&\":$K\"&$DP46)),IF(BP46<>\"\",0,\"\")),\"\"),\"\")","v":""},{"$f":"IFERROR(IF(WpAreaB_Sub2_exist,IF(SUMPRODUCT(--(INDIRECT(\"WP!$C$\"&$DO46&\":$C$\"&$DP46)=$C46),--(INDIRECT(\"WP!$B\"&$DO46&\":$B\"&$DP46)=\"Y\"),--(INDIRECT(\"WP!$\"&$BN$41&\"$\"&$DO46&\":$\"&$BN$41&\"$\"&$DP46)<>\"\"),--(INDIRECT(\"WP!$K\"&$DO46&\":$K\"&$DP46)>0))<>0,SUMPRODUCT(--(INDIRECT(\"WP!$C$\"&$DO46&\":$C$\"&$DP46)=$C46),--(INDIRECT(\"WP!$B\"&$DO46&\":$B\"&$DP46)=\"Y\"),--(INDIRECT(\"WP!$\"&$BN$41&\"$\"&$DO46&\":$\"&$BN$41&\"$\"&$DP46)<>\"\"),INDIRECT(\"WP!$K\"&$DO46&\":$K\"&$DP46)),\"\"),\"\"),\"\")","v":""},{"$f":"IFERROR(IF(WpAreaB_Sub3_exist,IF(SUMPRODUCT(--(INDIRECT(\"WP!$C$\"&$DO46&\":$C$\"&$DP46)=$C46),--(INDIRECT(\"WP!$\"&$BQ$41&\"$\"&$DO46&\":$\"&$BQ$41&\"$\"&$DP46)<>\"\"),--(INDIRECT(\"WP!$K$\"&$DO46&\":$K$\"&$DP46)>0))>0,SUMPRODUCT(--(INDIRECT(\"WP!$C$\"&$DO46&\":$C$\"&$DP46)=$C46),--(INDIRECT(\"WP!$\"&$BQ$41&\"$\"&$DO46&\":$\"&$BQ$41&\"$\"&$DP46)<>\"\"),INDIRECT(\"WP!$K\"&$DO46&\":$K\"&$DP46),INDIRECT(\"WP!$\"&$BQ$41&\"$\"&$DO46&\":$\"&$BQ$41&\"$\"&$DP46))/SUMPRODUCT(--(INDIRECT(\"WP!$C$\"&$DO46&\":$C$\"&$DP46)=$C46),--(INDIRECT(\"WP!$\"&$BQ$41&\"$\"&$DO46&\":$\"&$BQ$41&\"$\"&$DP46)<>\"\"),INDIRECT(\"WP!$K\"&$DO46&\":$K\"&$DP46)),\"\"),\"\"),\"\")","v":""},{"$f":"IFERROR(IF(WpAreaB_Sub3_exist,IF(SUMPRODUCT(--(INDIRECT(\"WP!$C$\"&$DO46&\":$C$\"&$DP46)=$C46),--(INDIRECT(\"WP!$B\"&$DO46&\":$B\"&$DP46)=\"Y\"),--(INDIRECT(\"WP!$\"&$BQ$41&\"$\"&$DO46&\":$\"&$BQ$41&\"$\"&$DP46)=1),--(INDIRECT(\"WP!$K\"&$DO46&\":$K\"&$DP46)>0))<>0,SUMPRODUCT(--(INDIRECT(\"WP!$C$\"&$DO46&\":$C$\"&$DP46)=$C46),--(INDIRECT(\"WP!$B\"&$DO46&\":$B\"&$DP46)=\"Y\"),--(INDIRECT(\"WP!$\"&$BQ$41&\"$\"&$DO46&\":$\"&$BQ$41&\"$\"&$DP46)=1),INDIRECT(\"WP!$K\"&$DO46&\":$K\"&$DP46)),IF(BS46<>\"\",0,\"\")),\"\"),\"\")","v":""},{"$f":"IFERROR(IF(WpAreaB_Sub3_exist,IF(SUMPRODUCT(--(INDIRECT(\"WP!$C$\"&$DO46&\":$C$\"&$DP46)=$C46),--(INDIRECT(\"WP!$B\"&$DO46&\":$B\"&$DP46)=\"Y\"),--(INDIRECT(\"WP!$\"&$BQ$41&\"$\"&$DO46&\":$\"&$BQ$41&\"$\"&$DP46)<>\"\"),--(INDIRECT(\"WP!$K\"&$DO46&\":$K\"&$DP46)>0))<>0,SUMPRODUCT(--(INDIRECT(\"WP!$C$\"&$DO46&\":$C$\"&$DP46)=$C46),--(INDIRECT(\"WP!$B\"&$DO46&\":$B\"&$DP46)=\"Y\"),--(INDIRECT(\"WP!$\"&$BQ$41&\"$\"&$DO46&\":$\"&$BQ$41&\"$\"&$DP46)<>\"\"),INDIRECT(\"WP!$K\"&$DO46&\":$K\"&$DP46)),\"\"),\"\"),\"\")","v":""},null,{"$f":"IFERROR(IF(WpAreaC_Sub1_exist,IF(SUMPRODUCT(--(INDIRECT(\"WP!$C$\"&$DO46&\":$C$\"&$DP46)=$C46),--(INDIRECT(\"WP!$\"&$BU$41&\"$\"&$DO46&\":$\"&$BU$41&\"$\"&$DP46)<>\"\"),--(INDIRECT(\"WP!$K$\"&$DO46&\":$K$\"&$DP46)>0))>0,SUMPRODUCT(--(INDIRECT(\"WP!$C$\"&$DO46&\":$C$\"&$DP46)=$C46),--(INDIRECT(\"WP!$\"&$BU$41&\"$\"&$DO46&\":$\"&$BU$41&\"$\"&$DP46)<>\"\"),INDIRECT(\"WP!$K\"&$DO46&\":$K\"&$DP46),INDIRECT(\"WP!$\"&$BU$41&\"$\"&$DO46&\":$\"&$BU$41&\"$\"&$DP46))/SUMPRODUCT(--(INDIRECT(\"WP!$C$\"&$DO46&\":$C$\"&$DP46)=$C46),--(INDIRECT(\"WP!$\"&$BU$41&\"$\"&$DO46&\":$\"&$BU$41&\"$\"&$DP46)<>\"\"),INDIRECT(\"WP!$K\"&$DO46&\":$K\"&$DP46)),\"\"),\"\"),\"\")","v":""},{"$f":"IFERROR(IF(WpAreaC_Sub1_exist,IF(SUMPRODUCT(--(INDIRECT(\"WP!$C$\"&$DO46&\":$C$\"&$DP46)=$C46),--(INDIRECT(\"WP!$B\"&$DO46&\":$B\"&$DP46)=\"Y\"),--(INDIRECT(\"WP!$\"&$BU$41&\"$\"&$DO46&\":$\"&$BU$41&\"$\"&$DP46)=1),--(INDIRECT(\"WP!$K\"&$DO46&\":$K\"&$DP46)>0))<>0,SUMPRODUCT(--(INDIRECT(\"WP!$C$\"&$DO46&\":$C$\"&$DP46)=$C46),--(INDIRECT(\"WP!$B\"&$DO46&\":$B\"&$DP46)=\"Y\"),--(INDIRECT(\"WP!$\"&$BU$41&\"$\"&$DO46&\":$\"&$BU$41&\"$\"&$DP46)=1),INDIRECT(\"WP!$K\"&$DO46&\":$K\"&$DP46)),IF(BW46<>\"\",0,\"\")),\"\"),\"\")","v":""},{"$f":"IFERROR(IF(WpAreaC_Sub1_exist,IF(SUMPRODUCT(--(INDIRECT(\"WP!$C$\"&$DO46&\":$C$\"&$DP46)=$C46),--(INDIRECT(\"WP!$B\"&$DO46&\":$B\"&$DP46)=\"Y\"),--(INDIRECT(\"WP!$\"&$BU$41&\"$\"&$DO46&\":$\"&$BU$41&\"$\"&$DP46)<>\"\"),--(INDIRECT(\"WP!$K\"&$DO46&\":$K\"&$DP46)>0))<>0,SUMPRODUCT(--(INDIRECT(\"WP!$C$\"&$DO46&\":$C$\"&$DP46)=$C46),--(INDIRECT(\"WP!$B\"&$DO46&\":$B\"&$DP46)=\"Y\"),--(INDIRECT(\"WP!$\"&$BU$41&\"$\"&$DO46&\":$\"&$BU$41&\"$\"&$DP46)<>\"\"),INDIRECT(\"WP!$K\"&$DO46&\":$K\"&$DP46)),\"\"),\"\"),\"\")","v":""},{"$f":"IFERROR(IF(WpAreaC_Sub2_exist,IF(SUMPRODUCT(--(INDIRECT(\"WP!$C$\"&$DO46&\":$C$\"&$DP46)=$C46),--(INDIRECT(\"WP!$\"&$BX$41&\"$\"&$DO46&\":$\"&$BX$41&\"$\"&$DP46)<>\"\"),--(INDIRECT(\"WP!$K$\"&$DO46&\":$K$\"&$DP46)>0))>0,SUMPRODUCT(--(INDIRECT(\"WP!$C$\"&$DO46&\":$C$\"&$DP46)=$C46),--(INDIRECT(\"WP!$\"&$BX$41&\"$\"&$DO46&\":$\"&$BX$41&\"$\"&$DP46)<>\"\"),INDIRECT(\"WP!$K\"&$DO46&\":$K\"&$DP46),INDIRECT(\"WP!$\"&$BX$41&\"$\"&$DO46&\":$\"&$BX$41&\"$\"&$DP46))/SUMPRODUCT(--(INDIRECT(\"WP!$C$\"&$DO46&\":$C$\"&$DP46)=$C46),--(INDIRECT(\"WP!$\"&$BX$41&\"$\"&$DO46&\":$\"&$BX$41&\"$\"&$DP46)<>\"\"),INDIRECT(\"WP!$K\"&$DO46&\":$K\"&$DP46)),\"\"),\"\"),\"\")","v":""},{"$f":"IFERROR(IF(WpAreaC_Sub2_exist,IF(SUMPRODUCT(--(INDIRECT(\"WP!$C$\"&$DO46&\":$C$\"&$DP46)=$C46),--(INDIRECT(\"WP!$B\"&$DO46&\":$B\"&$DP46)=\"Y\"),--(INDIRECT(\"WP!$\"&$BX$41&\"$\"&$DO46&\":$\"&$BX$41&\"$\"&$DP46)=1),--(INDIRECT(\"WP!$K\"&$DO46&\":$K\"&$DP46)>0))<>0,SUMPRODUCT(--(INDIRECT(\"WP!$C$\"&$DO46&\":$C$\"&$DP46)=$C46),--(INDIRECT(\"WP!$B\"&$DO46&\":$B\"&$DP46)=\"Y\"),--(INDIRECT(\"WP!$\"&$BX$41&\"$\"&$DO46&\":$\"&$BX$41&\"$\"&$DP46)=1),INDIRECT(\"WP!$K\"&$DO46&\":$K\"&$DP46)),IF(BZ46<>\"\",0,\"\")),\"\"),\"\")","v":""},{"$f":"IFERROR(IF(WpAreaC_Sub2_exist,IF(SUMPRODUCT(--(INDIRECT(\"WP!$C$\"&$DO46&\":$C$\"&$DP46)=$C46),--(INDIRECT(\"WP!$B\"&$DO46&\":$B\"&$DP46)=\"Y\"),--(INDIRECT(\"WP!$\"&$BX$41&\"$\"&$DO46&\":$\"&$BX$41&\"$\"&$DP46)<>\"\"),--(INDIRECT(\"WP!$K\"&$DO46&\":$K\"&$DP46)>0))<>0,SUMPRODUCT(--(INDIRECT(\"WP!$C$\"&$DO46&\":$C$\"&$DP46)=$C46),--(INDIRECT(\"WP!$B\"&$DO46&\":$B\"&$DP46)=\"Y\"),--(INDIRECT(\"WP!$\"&$BX$41&\"$\"&$DO46&\":$\"&$BX$41&\"$\"&$DP46)<>\"\"),INDIRECT(\"WP!$K\"&$DO46&\":$K\"&$DP46)),\"\"),\"\"),\"\")","v":""},{"$f":"IFERROR(IF(WpAreaC_Sub3_exist,IF(SUMPRODUCT(--(INDIRECT(\"WP!$C$\"&$DO46&\":$C$\"&$DP46)=$C46),--(INDIRECT(\"WP!$\"&$CA$41&\"$\"&$DO46&\":$\"&$CA$41&\"$\"&$DP46)<>\"\"),--(INDIRECT(\"WP!$K$\"&$DO46&\":$K$\"&$DP46)>0))>0,SUMPRODUCT(--(INDIRECT(\"WP!$C$\"&$DO46&\":$C$\"&$DP46)=$C46),--(INDIRECT(\"WP!$\"&$CA$41&\"$\"&$DO46&\":$\"&$CA$41&\"$\"&$DP46)<>\"\"),INDIRECT(\"WP!$K\"&$DO46&\":$K\"&$DP46),INDIRECT(\"WP!$\"&$CA$41&\"$\"&$DO46&\":$\"&$CA$41&\"$\"&$DP46))/SUMPRODUCT(--(INDIRECT(\"WP!$C$\"&$DO46&\":$C$\"&$DP46)=$C46),--(INDIRECT(\"WP!$\"&$CA$41&\"$\"&$DO46&\":$\"&$CA$41&\"$\"&$DP46)<>\"\"),INDIRECT(\"WP!$K\"&$DO46&\":$K\"&$DP46)),\"\"),\"\"),\"\")","v":""},{"$f":"IFERROR(IF(WpAreaC_Sub3_exist,IF(SUMPRODUCT(--(INDIRECT(\"WP!$C$\"&$DO46&\":$C$\"&$DP46)=$C46),--(INDIRECT(\"WP!$B\"&$DO46&\":$B\"&$DP46)=\"Y\"),--(INDIRECT(\"WP!$\"&$CA$41&\"$\"&$DO46&\":$\"&$CA$41&\"$\"&$DP46)=1),--(INDIRECT(\"WP!$K\"&$DO46&\":$K\"&$DP46)>0))<>0,SUMPRODUCT(--(INDIRECT(\"WP!$C$\"&$DO46&\":$C$\"&$DP46)=$C46),--(INDIRECT(\"WP!$B\"&$DO46&\":$B\"&$DP46)=\"Y\"),--(INDIRECT(\"WP!$\"&$CA$41&\"$\"&$DO46&\":$\"&$CA$41&\"$\"&$DP46)=1),INDIRECT(\"WP!$K\"&$DO46&\":$K\"&$DP46)),IF(CC46<>\"\",0,\"\")),\"\"),\"\")","v":""},{"$f":"IFERROR(IF(WpAreaC_Sub3_exist,IF(SUMPRODUCT(--(INDIRECT(\"WP!$C$\"&$DO46&\":$C$\"&$DP46)=$C46),--(INDIRECT(\"WP!$B\"&$DO46&\":$B\"&$DP46)=\"Y\"),--(INDIRECT(\"WP!$\"&$CA$41&\"$\"&$DO46&\":$\"&$CA$41&\"$\"&$DP46)<>\"\"),--(INDIRECT(\"WP!$K\"&$DO46&\":$K\"&$DP46)>0))<>0,SUMPRODUCT(--(INDIRECT(\"WP!$C$\"&$DO46&\":$C$\"&$DP46)=$C46),--(INDIRECT(\"WP!$B\"&$DO46&\":$B\"&$DP46)=\"Y\"),--(INDIRECT(\"WP!$\"&$CA$41&\"$\"&$DO46&\":$\"&$CA$41&\"$\"&$DP46)<>\"\"),INDIRECT(\"WP!$K\"&$DO46&\":$K\"&$DP46)),\"\"),\"\"),\"\")","v":""},null,null,null,null,"","","","","","","","","","","","",null,"","","","","","","","","",null,"","","","","","","","","",null,{"$f":"MIN(IF(WP!$C$12:$C$79=$C46,ROW(WP!$C$12:$C$79),\"\"))","v":0},{"$f":"MAX(IF(WP!$C$12:$C$79=$C46,ROW(WP!$C$12:$C$79),\"\"))","v":0}]
[null,"RF Demod test cases","36.521-4 Demod",{"$f":"getProgress(AX47,CH47,\"%\",1,1)","v":""},{"$f":"getProgress(AY47,CI47,,,1)","v":""},{"$f":"getProgress(AZ47,CJ47,,,1)","v":""},null,{"$f":"getProgress(BA47,CK47,\"%\",1,1,WpAreaA_Sub1_exist)","v":""},{"$f":"getProgress(BB47,CL47,,,1,WpAreaA_Sub1_exist)","v":""},{"$f":"getProgress(BC47,CM47,,,1,WpAreaA_Sub1_exist)","v":""},{"$f":"getProgress(BD47,CN47,\"%\",1,1,WpAreaA_Sub2_exist)","v":""},{"$f":"getProgress(BE47,CO47,,,1,WpAreaA_Sub2_exist)","v":""},{"$f":"getProgress(BF47,CP47,,,1,WpAreaA_Sub2_exist)","v":""},{"$f":"getProgress(BG47,CQ47,\"%\",1,1,WpAreaA_Sub3_exist)","v":""},{"$f":"getProgress(BH47,CR47,,,1,WpAreaA_Sub3_exist)","v":""},{"$f":"getProgress(BI47,CS47,,,1,WpAreaA_Sub3_exist)","v":""},null,{"$f":"getProgress(BK47,CU47,\"%\",1,1,WpAreaB_Sub1_exist)","v":""},{"$f":"getProgress(BL47,CV47,,,1,WpAreaB_Sub1_exist)","v":""},{"$f":"getProgress(BM47,CW47,,,1,WpAreaB_Sub1_exist)","v":""},{"$f":"getProgress(BN47,CX47,\"%\",1,1,WpAreaB_Sub2_exist)","v":""},{"$f":"getProgress(BO47,CY47,,,1,WpAreaB_Sub2_exist)","v":""},{"$f":"getProgress(BP47,CZ47,,,1,WpAreaB_Sub2_exist)","v":""},{"$f":"getProgress(BQ47,DA47,\"%\",1,1,WpAreaB_Sub3_exist)","v":""},{"$f":"getProgress(BR47,DB47,,,1,WpAreaB_Sub3_exist)","v":""},{"$f":"getProgress(BS47,DC47,,,1,WpAreaB_Sub3_exist)","v":""},null,{"$f":"getProgress(BU47,DE47,\"%\",1,1,WpAreaC_Sub1_exist)","v":""},{"$f":"getProgress(BV47,DF47,,,1,WpAreaC_Sub1_exist)","v":""},{"$f":"getProgress(BW47,DG47,,,1,WpAreaC_Sub1_exist)","v":""},{"$f":"getProgress(BX47,DH47,\"%\",1,1,WpAreaC_Sub2_exist)","v":""},{"$f":"getProgress(BY47,DI47,,,1,WpAreaC_Sub2_exist)","v":""},{"$f":"getProgress(BZ47,DJ47,,,1,WpAreaC_Sub2_exist)","v":""},{"$f":"getProgress(CA47,DK47,\"%\",1,1,WpAreaC_Sub3_exist)","v":""},{"$f":"getProgress(CB47,DL47,,,1,WpAreaC_Sub3_exist)","v":""},{"$f":"getProgress(CC47,DM47,,,1,WpAreaC_Sub3_exist)","v":""},null,null,null,null,null,null,null,null,null,null,null,null,null,{"$f":"IFERROR((IF(WpAreaA_exist,IF(BA47<>\"\",BA47*WP!$AB$9,0)+IF(BD47<>\"\",BD47*WP!$AC$9,0)+IF(BG47<>\"\",BG47*WP!$AD$9,0),0)+IF(WpAreaB_exist,IF(BK47<>\"\",BK47*WP!$AE$10)+IF(BN47<>\"\",BN47*WP!$AF$10,0)+IF(BQ47<>\"\",BQ47*WP!$AG$10,0),0)+IF(WpAreaC_exist,IF(BU47<>\"\",BU47*WP!$AH$10)+IF(BX47<>\"\",BX47*WP!$AI$10,0)+IF(CA47<>\"\",CA47*WP!$AJ$10,0),0))/(IF(WpAreaA_exist,IF(BA47<>\"\",WP!$AB$9,0)+IF(BD47<>\"\",WP!$AC$9,0)+IF(BG47<>\"\",WP!$AD$9,0),0)+IF(WpAreaB_exist,IF(BK47<>\"\",WP!$AE$10,0)+IF(BN47<>\"\",WP!$AF$10,0)+IF(BQ47<>\"\",WP!$AG$10,0),0)+IF(WpAreaC_exist,IF(BU47<>\"\",WP!$AH$10,0)+IF(BX47<>\"\",WP!$AI$10,0)+IF(CA47<>\"\",WP!$AJ$10,0),0)),\"\")","v":""},{"$f":"IFERROR(IF(SUMPRODUCT(--(INDIRECT(\"WP!$C$\"&$DO47&\":$C$\"&$DP47)=$C47),--(INDIRECT(\"WP!$B$\"&$DO47&\":$B$\"&$DP47)=\"Y\"),--(INDIRECT(\"WP!$\"&$AX$41&\"$\"&$DO47&\":$\"&$AX$41&\"$\"&$DP47)=1),--(INDIRECT(\"WP!$K$\"&$DO47&\":$K$\"&$DP47)>0))<>0,SUMPRODUCT(--(INDIRECT(\"WP!$C$\"&$DO47&\":$C$\"&$DP47)=$C47),--(INDIRECT(\"WP!$B$\"&$DO47&\":$B$\"&$DP47)=\"Y\"),--(INDIRECT(\"WP!$\"&$AX$41&\"$\"&$DO47&\":$\"&$AX$41&\"$\"&$DP47)=1),INDIRECT(\"WP!$K$\"&$DO47&\":$K$\"&$DP47)),IF(AZ47<>\"\",0,\"\")),\"\")","v":""},{"$f":"IFERROR(IF(SUMPRODUCT(--(INDIRECT(\"WP!$C$\"&$DO47&\":$C$\"&$DP47)=$C47),--(INDIRECT(\"WP!$B\"&$DO47&\":$B\"&$DP47)=\"Y\"),--(INDIRECT(\"WP!$\"&$AX$41&\"$\"&$DO47&\":$\"&$AX$41&\"$\"&$DP47)<>\"\"),--(INDIRECT(\"WP!$K\"&$DO47&\":$K\"&$DP47)>0))<>0,SUMPRODUCT(--(INDIRECT(\"WP!$C$\"&$DO47&\":$C$\"&$DP47)=$C47),--(INDIRECT(\"WP!$B\"&$DO47&\":$B\"&$DP47)=\"Y\"),--(INDIRECT(\"WP!$\"&$AX$41&\"$\"&$DO47&\":$\"&$AX$41&\"$\"&$DP47)<>\"\"),INDIRECT(\"WP!$K\"&$DO47&\":$K\"&$DP47)),\"\"),\"\")","v":""},{"$f":"IFERROR(IF(WpAreaA_Sub1_exist,IF(SUMPRODUCT(--(INDIRECT(\"WP!$C$\"&$DO47&\":$C$\"&$DP47)=$C47),--(INDIRECT(\"WP!$\"&$BA$41&\"$\"&$DO47&\":$\"&$BA$41&\"$\"&$DP47)<>\"\"),--(INDIRECT(\"WP!$K$\"&$DO47&\":$K$\"&$DP47)>0))>0,SUMPRODUCT(--(INDIRECT(\"WP!$C$\"&$DO47&\":$C$\"&$DP47)=$C47),--(INDIRECT(\"WP!$\"&$BA$41&\"$\"&$DO47&\":$\"&$BA$41&\"$\"&$DP47)<>\"\"),INDIRECT(\"WP!$K$\"&$DO47&\":$K$\"&$DP47),INDIRECT(\"WP!$\"&$BA$41&\"$\"&$DO47&\":$\"&$BA$41&\"$\"&$DP47))/SUMPRODUCT(--(INDIRECT(\"WP!$C$\"&$DO47&\":$C$\"&$DP47)=$C47),--(INDIRECT(\"WP!$\"&$BA$41&\"$\"&$DO47&\":$\"&$BA$41&\"$\"&$DP47)<>\"\"),INDIRECT(\"WP!$K$\"&$DO47&\":$K$\"&$DP47)),\"\"),\"\"),\"\")","v":""},{"$f":"IFERROR(IF(WpAreaA_Sub1_exist,IF(SUMPRODUCT(--(INDIRECT(\"WP!$C$\"&$DO47&\":$C$\"&$DP47)=$C47),--(INDIRECT(\"WP!$B$\"&$DO47&\":$B$\"&$DP47)=\"Y\"),--(INDIRECT(\"WP!$\"&$BA$41&\"$\"&$DO47&\":$\"&$BA$41&\"$\"&$DP47)=1),--(INDIRECT(\"WP!$K$\"&$DO47&\":$K$\"&$DP47)>0))<>0,SUMPRODUCT(--(INDIRECT(\"WP!$C$\"&$DO47&\":$C$\"&$DP47)=$C47),--(INDIRECT(\"WP!$B$\"&$DO47&\":$B$\"&$DP47)=\"Y\"),--(INDIRECT(\"WP!$\"&$BA$41&\"$\"&$DO47&\":$\"&$BA$41&\"$\"&$DP47)=1),INDIRECT(\"WP!$K$\"&$DO47&\":$K$\"&$DP47)),IF(BC47<>\"\",0,\"\")),\"\"),\"\")","v":""},{"$f":"IFERROR(IF(WpAreaA_Sub1_exist,IF(SUMPRODUCT(--(INDIRECT(\"WP!$C$\"&$DO47&\":$C$\"&$DP47)=$C47),--(INDIRECT(\"WP!$B\"&$DO47&\":$B\"&$DP47)=\"Y\"),--(INDIRECT(\"WP!$\"&$BA$41&\"$\"&$DO47&\":$\"&$BA$41&\"$\"&$DP47)<>\"\"),--(INDIRECT(\"WP!$K\"&$DO47&\":$K\"&$DP47)>0))<>0,SUMPRODUCT(--(INDIRECT(\"WP!$C$\"&$DO47&\":$C$\"&$DP47)=$C47),--(INDIRECT(\"WP!$B\"&$DO47&\":$B\"&$DP47)=\"Y\"),--(INDIRECT(\"WP!$\"&$BA$41&\"$\"&$DO47&\":$\"&$BA$41&\"$\"&$DP47)<>\"\"),INDIRECT(\"WP!$K\"&$DO47&\":$K\"&$DP47)),\"\"),\"\"),\"\")","v":""},{"$f":"IFERROR(IF(WpAreaA_Sub2_exist,IF(SUMPRODUCT(--(INDIRECT(\"WP!$C$\"&$DO47&\":$C$\"&$DP47)=$C47),--(INDIRECT(\"WP!$\"&$BD$41&\"$\"&$DO47&\":$\"&$BD$41&\"$\"&$DP47)<>\"\"),--(INDIRECT(\"WP!$K$\"&$DO47&\":$K$\"&$DP47)>0))>0,SUMPRODUCT(--(INDIRECT(\"WP!$C$\"&$DO47&\":$C$\"&$DP47)=$C47),--(INDIRECT(\"WP!$\"&$BD$41&\"$\"&$DO47&\":$\"&$BD$41&\"$\"&$DP47)<>\"\"),INDIRECT(\"WP!$K\"&$DO47&\":$K\"&$DP47),INDIRECT(\"WP!$\"&$BD$41&\"$\"&$DO47&\":$\"&$BD$41&\"$\"&$DP47))/SUMPRODUCT(--(INDIRECT(\"WP!$C$\"&$DO47&\":$C$\"&$DP47)=$C47),--(INDIRECT(\"WP!$\"&$BD$41&\"$\"&$DO47&\":$\"&$BD$41&\"$\"&$DP47)<>\"\"),INDIRECT(\"WP!$K\"&$DO47&\":$K\"&$DP47)),\"\"),\"\"),\"\")","v":""},{"$f":"IFERROR(IF(WpAreaA_Sub2_exist,IF(SUMPRODUCT(--(INDIRECT(\"WP!$C$\"&$DO47&\":$C$\"&$DP47)=$C47),--(INDIRECT(\"WP!$B\"&$DO47&\":$B\"&$DP47)=\"Y\"),--(INDIRECT(\"WP!$\"&$BD$41&\"$\"&$DO47&\":$\"&$BD$41&\"$\"&$DP47)=1),--(INDIRECT(\"WP!$K\"&$DO47&\":$K\"&$DP47)>0))<>0,SUMPRODUCT(--(INDIRECT(\"WP!$C$\"&$DO47&\":$C$\"&$DP47)=$C47),--(INDIRECT(\"WP!$B\"&$DO47&\":$B\"&$DP47)=\"Y\"),--(INDIRECT(\"WP!$\"&$BD$41&\"$\"&$DO47&\":$\"&$BD$41&\"$\"&$DP47)=1),INDIRECT(\"WP!$K\"&$DO47&\":$K\"&$DP47)),IF(BF47<>\"\",0,\"\")),\"\"),\"\")","v":""},{"$f":"IFERROR(IF(WpAreaA_Sub2_exist,IF(SUMPRODUCT(--(INDIRECT(\"WP!$C$\"&$DO47&\":$C$\"&$DP47)=$C47),--(INDIRECT(\"WP!$B\"&$DO47&\":$B\"&$DP47)=\"Y\"),--(INDIRECT(\"WP!$\"&$BD$41&\"$\"&$DO47&\":$\"&$BD$41&\"$\"&$DP47)<>\"\"),--(INDIRECT(\"WP!$K\"&$DO47&\":$K\"&$DP47)>0))<>0,SUMPRODUCT(--(INDIRECT(\"WP!$C$\"&$DO47&\":$C$\"&$DP47)=$C47),--(INDIRECT(\"WP!$B\"&$DO47&\":$B\"&$DP47)=\"Y\"),--(INDIRECT(\"WP!$\"&$BD$41&\"$\"&$DO47&\":$\"&$BD$41&\"$\"&$DP47)<>\"\"),INDIRECT(\"WP!$K\"&$DO47&\":$K\"&$DP47)),\"\"),\"\"),\"\")","v":""},{"$f":"IFERROR(IF(WpAreaA_Sub3_exist,IF(SUMPRODUCT(--(INDIRECT(\"WP!$C$\"&$DO47&\":$C$\"&$DP47)=$C47),--(INDIRECT(\"WP!$\"&$BG$41&\"$\"&$DO47&\":$\"&$BG$41&\"$\"&$DP47)<>\"\"),--(INDIRECT(\"WP!$K$\"&$DO47&\":$K$\"&$DP47)>0))>0,SUMPRODUCT(--(INDIRECT(\"WP!$C$\"&$DO47&\":$C$\"&$DP47)=$C47),--(INDIRECT(\"WP!$\"&$BG$41&\"$\"&$DO47&\":$\"&$BG$41&\"$\"&$DP47)<>\"\"),INDIRECT(\"WP!$K\"&$DO47&\":$K\"&$DP47),INDIRECT(\"WP!$\"&$BG$41&\"$\"&$DO47&\":$\"&$BG$41&\"$\"&$DP47))/SUMPRODUCT(--(INDIRECT(\"WP!$C$\"&$DO47&\":$C$\"&$DP47)=$C47),--(INDIRECT(\"WP!$\"&$BG$41&\"$\"&$DO47&\":$\"&$BG$41&\"$\"&$DP47)<>\"\"),INDIRECT(\"WP!$K\"&$DO47&\":$K\"&$DP47)),\"\"),\"\"),\"\")","v":""},{"$f":"IFERROR(IF(WpAreaA_Sub3_exist,IF(SUMPRODUCT(--(INDIRECT(\"WP!$C$\"&$DO47&\":$C$\"&$DP47)=$C47),--(INDIRECT(\"WP!$B\"&$DO47&\":$B\"&$DP47)=\"Y\"),--(INDIRECT(\"WP!$\"&$BG$41&\"$\"&$DO47&\":$\"&$BG$41&\"$\"&$DP47)=1),--(INDIRECT(\"WP!$K\"&$DO47&\":$K\"&$DP47)>0))<>0,SUMPRODUCT(--(INDIRECT(\"WP!$C$\"&$DO47&\":$C$\"&$DP47)=$C47),--(INDIRECT(\"WP!$B\"&$DO47&\":$B\"&$DP47)=\"Y\"),--(INDIRECT(\"WP!$\"&$BG$41&\"$\"&$DO47&\":$\"&$BG$41&\"$\"&$DP47)=1),INDIRECT(\"WP!$K\"&$DO47&\":$K\"&$DP47)),IF(BI47<>\"\",0,\"\")),\"\"),\"\")","v":""},{"$f":"IFERROR(IF(WpAreaA_Sub3_exist,IF(SUMPRODUCT(--(INDIRECT(\"WP!$C$\"&$DO47&\":$C$\"&$DP47)=$C47),--(INDIRECT(\"WP!$B\"&$DO47&\":$B\"&$DP47)=\"Y\"),--(INDIRECT(\"WP!$\"&$BG$41&\"$\"&$DO47&\":$\"&$BG$41&\"$\"&$DP47)<>\"\"),--(INDIRECT(\"WP!$K\"&$DO47&\":$K\"&$DP47)>0))<>0,SUMPRODUCT(--(INDIRECT(\"WP!$C$\"&$DO47&\":$C$\"&$DP47)=$C47),--(INDIRECT(\"WP!$B\"&$DO47&\":$B\"&$DP47)=\"Y\"),--(INDIRECT(\"WP!$\"&$BG$41&\"$\"&$DO47&\":$\"&$BG$41&\"$\"&$DP47)<>\"\"),INDIRECT(\"WP!$K\"&$DO47&\":$K\"&$DP47)),\"\"),\"\"),\"\")","v":""},null,{"$f":"IFERROR(IF(WpAreaB_Sub1_exist,IF(SUMPRODUCT(--(INDIRECT(\"WP!$C$\"&$DO47&\":$C$\"&$DP47)=$C47),--(INDIRECT(\"WP!$\"&$BK$41&\"$\"&$DO47&\":$\"&$BK$41&\"$\"&$DP47)<>\"\"),--(INDIRECT(\"WP!$K$\"&$DO47&\":$K$\"&$DP47)>0))>0,SUMPRODUCT(--(INDIRECT(\"WP!$C$\"&$DO47&\":$C$\"&$DP47)=$C47),--(INDIRECT(\"WP!$\"&$BK$41&\"$\"&$DO47&\":$\"&$BK$41&\"$\"&$DP47)<>\"\"),INDIRECT(\"WP!$K\"&$DO47&\":$K\"&$DP47),INDIRECT(\"WP!$\"&$BK$41&\"$\"&$DO47&\":$\"&$BK$41&\"$\"&$DP47))/SUMPRODUCT(--(INDIRECT(\"WP!$C$\"&$DO47&\":$C$\"&$DP47)=$C47),--(INDIRECT(\"WP!$\"&$BK$41&\"$\"&$DO47&\":$\"&$BK$41&\"$\"&$DP47)<>\"\"),INDIRECT(\"WP!$K\"&$DO47&\":$K\"&$DP47)),\"\"),\"\"),\"\")","v":""},{"$f":"IFERROR(IF(WpAreaB_Sub1_exist,IF(SUMPRODUCT(--(INDIRECT(\"WP!$C$\"&$DO47&\":$C$\"&$DP47)=$C47),--(INDIRECT(\"WP!$B\"&$DO47&\":$B\"&$DP47)=\"Y\"),--(INDIRECT(\"WP!$\"&$BK$41&\"$\"&$DO47&\":$\"&$BK$41&\"$\"&$DP47)=1),--(INDIRECT(\"WP!$K\"&$DO47&\":$K\"&$DP47)>0))<>0,SUMPRODUCT(--(INDIRECT(\"WP!$C$\"&$DO47&\":$C$\"&$DP47)=$C47),--(INDIRECT(\"WP!$B\"&$DO47&\":$B\"&$DP47)=\"Y\"),--(INDIRECT(\"WP!$\"&$BK$41&\"$\"&$DO47&\":$\"&$BK$41&\"$\"&$DP47)=1),INDIRECT(\"WP!$K\"&$DO47&\":$K\"&$DP47)),IF(BM47<>\"\",0,\"\")),\"\"),\"\")","v":""},{"$f":"IFERROR(IF(WpAreaB_Sub1_exist,IF(SUMPRODUCT(--(INDIRECT(\"WP!$C$\"&$DO47&\":$C$\"&$DP47)=$C47),--(INDIRECT(\"WP!$B\"&$DO47&\":$B\"&$DP47)=\"Y\"),--(INDIRECT(\"WP!$\"&$BK$41&\"$\"&$DO47&\":$\"&$BK$41&\"$\"&$DP47)<>\"\"),--(INDIRECT(\"WP!$K\"&$DO47&\":$K\"&$DP47)>0))<>0,SUMPRODUCT(--(INDIRECT(\"WP!$C$\"&$DO47&\":$C$\"&$DP47)=$C47),--(INDIRECT(\"WP!$B\"&$DO47&\":$B\"&$DP47)=\"Y\"),--(INDIRECT(\"WP!$\"&$BK$41&\"$\"&$DO47&\":$\"&$BK$41&\"$\"&$DP47)<>\"\"),INDIRECT(\"WP!$K\"&$DO47&\":$K\"&$DP47)),\"\"),\"\"),\"\")","v":""},{"$f":"IFERROR(IF(WpAreaB_Sub2_exist,IF(SUMPRODUCT(--(INDIRECT(\"WP!$C$\"&$DO47&\":$C$\"&$DP47)=$C47),--(INDIRECT(\"WP!$\"&$BN$41&\"$\"&$DO47&\":$\"&$BN$41&\"$\"&$DP47)<>\"\"),--(INDIRECT(\"WP!$K$\"&$DO47&\":$K$\"&$DP47)>0))>0,SUMPRODUCT(--(INDIRECT(\"WP!$C$\"&$DO47&\":$C$\"&$DP47)=$C47),--(INDIRECT(\"WP!$\"&$BN$41&\"$\"&$DO47&\":$\"&$BN$41&\"$\"&$DP47)<>\"\"),INDIRECT(\"WP!$K\"&$DO47&\":$K\"&$DP47),INDIRECT(\"WP!$\"&$BN$41&\"$\"&$DO47&\":$\"&$BN$41&\"$\"&$DP47))/SUMPRODUCT(--(INDIRECT(\"WP!$C$\"&$DO47&\":$C$\"&$DP47)=$C47),--(INDIRECT(\"WP!$\"&$BN$41&\"$\"&$DO47&\":$\"&$BN$41&\"$\"&$DP47)<>\"\"),INDIRECT(\"WP!$K\"&$DO47&\":$K\"&$DP47)),\"\"),\"\"),\"\")","v":""},{"$f":"IFERROR(IF(WpAreaB_Sub2_exist,IF(SUMPRODUCT(--(INDIRECT(\"WP!$C$\"&$DO47&\":$C$\"&$DP47)=$C47),--(INDIRECT(\"WP!$B\"&$DO47&\":$B\"&$DP47)=\"Y\"),--(INDIRECT(\"WP!$\"&$BN$41&\"$\"&$DO47&\":$\"&$BN$41&\"$\"&$DP47)=1),--(INDIRECT(\"WP!$K\"&$DO47&\":$K\"&$DP47)>0))<>0,SUMPRODUCT(--(INDIRECT(\"WP!$C$\"&$DO47&\":$C$\"&$DP47)=$C47),--(INDIRECT(\"WP!$B\"&$DO47&\":$B\"&$DP47)=\"Y\"),--(INDIRECT(\"WP!$\"&$BN$41&\"$\"&$DO47&\":$\"&$BN$41&\"$\"&$DP47)=1),INDIRECT(\"WP!$K\"&$DO47&\":$K\"&$DP47)),IF(BP47<>\"\",0,\"\")),\"\"),\"\")","v":""},{"$f":"IFERROR(IF(WpAreaB_Sub2_exist,IF(SUMPRODUCT(--(INDIRECT(\"WP!$C$\"&$DO47&\":$C$\"&$DP47)=$C47),--(INDIRECT(\"WP!$B\"&$DO47&\":$B\"&$DP47)=\"Y\"),--(INDIRECT(\"WP!$\"&$BN$41&\"$\"&$DO47&\":$\"&$BN$41&\"$\"&$DP47)<>\"\"),--(INDIRECT(\"WP!$K\"&$DO47&\":$K\"&$DP47)>0))<>0,SUMPRODUCT(--(INDIRECT(\"WP!$C$\"&$DO47&\":$C$\"&$DP47)=$C47),--(INDIRECT(\"WP!$B\"&$DO47&\":$B\"&$DP47)=\"Y\"),--(INDIRECT(\"WP!$\"&$BN$41&\"$\"&$DO47&\":$\"&$BN$41&\"$\"&$DP47)<>\"\"),INDIRECT(\"WP!$K\"&$DO47&\":$K\"&$DP47)),\"\"),\"\"),\"\")","v":""},{"$f":"IFERROR(IF(WpAreaB_Sub3_exist,IF(SUMPRODUCT(--(INDIRECT(\"WP!$C$\"&$DO47&\":$C$\"&$DP47)=$C47),--(INDIRECT(\"WP!$\"&$BQ$41&\"$\"&$DO47&\":$\"&$BQ$41&\"$\"&$DP47)<>\"\"),--(INDIRECT(\"WP!$K$\"&$DO47&\":$K$\"&$DP47)>0))>0,SUMPRODUCT(--(INDIRECT(\"WP!$C$\"&$DO47&\":$C$\"&$DP47)=$C47),--(INDIRECT(\"WP!$\"&$BQ$41&\"$\"&$DO47&\":$\"&$BQ$41&\"$\"&$DP47)<>\"\"),INDIRECT(\"WP!$K\"&$DO47&\":$K\"&$DP47),INDIRECT(\"WP!$\"&$BQ$41&\"$\"&$DO47&\":$\"&$BQ$41&\"$\"&$DP47))/SUMPRODUCT(--(INDIRECT(\"WP!$C$\"&$DO47&\":$C$\"&$DP47)=$C47),--(INDIRECT(\"WP!$\"&$BQ$41&\"$\"&$DO47&\":$\"&$BQ$41&\"$\"&$DP47)<>\"\"),INDIRECT(\"WP!$K\"&$DO47&\":$K\"&$DP47)),\"\"),\"\"),\"\")","v":""},{"$f":"IFERROR(IF(WpAreaB_Sub3_exist,IF(SUMPRODUCT(--(INDIRECT(\"WP!$C$\"&$DO47&\":$C$\"&$DP47)=$C47),--(INDIRECT(\"WP!$B\"&$DO47&\":$B\"&$DP47)=\"Y\"),--(INDIRECT(\"WP!$\"&$BQ$41&\"$\"&$DO47&\":$\"&$BQ$41&\"$\"&$DP47)=1),--(INDIRECT(\"WP!$K\"&$DO47&\":$K\"&$DP47)>0))<>0,SUMPRODUCT(--(INDIRECT(\"WP!$C$\"&$DO47&\":$C$\"&$DP47)=$C47),--(INDIRECT(\"WP!$B\"&$DO47&\":$B\"&$DP47)=\"Y\"),--(INDIRECT(\"WP!$\"&$BQ$41&\"$\"&$DO47&\":$\"&$BQ$41&\"$\"&$DP47)=1),INDIRECT(\"WP!$K\"&$DO47&\":$K\"&$DP47)),IF(BS47<>\"\",0,\"\")),\"\"),\"\")","v":""},{"$f":"IFERROR(IF(WpAreaB_Sub3_exist,IF(SUMPRODUCT(--(INDIRECT(\"WP!$C$\"&$DO47&\":$C$\"&$DP47)=$C47),--(INDIRECT(\"WP!$B\"&$DO47&\":$B\"&$DP47)=\"Y\"),--(INDIRECT(\"WP!$\"&$BQ$41&\"$\"&$DO47&\":$\"&$BQ$41&\"$\"&$DP47)<>\"\"),--(INDIRECT(\"WP!$K\"&$DO47&\":$K\"&$DP47)>0))<>0,SUMPRODUCT(--(INDIRECT(\"WP!$C$\"&$DO47&\":$C$\"&$DP47)=$C47),--(INDIRECT(\"WP!$B\"&$DO47&\":$B\"&$DP47)=\"Y\"),--(INDIRECT(\"WP!$\"&$BQ$41&\"$\"&$DO47&\":$\"&$BQ$41&\"$\"&$DP47)<>\"\"),INDIRECT(\"WP!$K\"&$DO47&\":$K\"&$DP47)),\"\"),\"\"),\"\")","v":""},null,{"$f":"IFERROR(IF(WpAreaC_Sub1_exist,IF(SUMPRODUCT(--(INDIRECT(\"WP!$C$\"&$DO47&\":$C$\"&$DP47)=$C47),--(INDIRECT(\"WP!$\"&$BU$41&\"$\"&$DO47&\":$\"&$BU$41&\"$\"&$DP47)<>\"\"),--(INDIRECT(\"WP!$K$\"&$DO47&\":$K$\"&$DP47)>0))>0,SUMPRODUCT(--(INDIRECT(\"WP!$C$\"&$DO47&\":$C$\"&$DP47)=$C47),--(INDIRECT(\"WP!$\"&$BU$41&\"$\"&$DO47&\":$\"&$BU$41&\"$\"&$DP47)<>\"\"),INDIRECT(\"WP!$K\"&$DO47&\":$K\"&$DP47),INDIRECT(\"WP!$\"&$BU$41&\"$\"&$DO47&\":$\"&$BU$41&\"$\"&$DP47))/SUMPRODUCT(--(INDIRECT(\"WP!$C$\"&$DO47&\":$C$\"&$DP47)=$C47),--(INDIRECT(\"WP!$\"&$BU$41&\"$\"&$DO47&\":$\"&$BU$41&\"$\"&$DP47)<>\"\"),INDIRECT(\"WP!$K\"&$DO47&\":$K\"&$DP47)),\"\"),\"\"),\"\")","v":""},{"$f":"IFERROR(IF(WpAreaC_Sub1_exist,IF(SUMPRODUCT(--(INDIRECT(\"WP!$C$\"&$DO47&\":$C$\"&$DP47)=$C47),--(INDIRECT(\"WP!$B\"&$DO47&\":$B\"&$DP47)=\"Y\"),--(INDIRECT(\"WP!$\"&$BU$41&\"$\"&$DO47&\":$\"&$BU$41&\"$\"&$DP47)=1),--(INDIRECT(\"WP!$K\"&$DO47&\":$K\"&$DP47)>0))<>0,SUMPRODUCT(--(INDIRECT(\"WP!$C$\"&$DO47&\":$C$\"&$DP47)=$C47),--(INDIRECT(\"WP!$B\"&$DO47&\":$B\"&$DP47)=\"Y\"),--(INDIRECT(\"WP!$\"&$BU$41&\"$\"&$DO47&\":$\"&$BU$41&\"$\"&$DP47)=1),INDIRECT(\"WP!$K\"&$DO47&\":$K\"&$DP47)),IF(BW47<>\"\",0,\"\")),\"\"),\"\")","v":""},{"$f":"IFERROR(IF(WpAreaC_Sub1_exist,IF(SUMPRODUCT(--(INDIRECT(\"WP!$C$\"&$DO47&\":$C$\"&$DP47)=$C47),--(INDIRECT(\"WP!$B\"&$DO47&\":$B\"&$DP47)=\"Y\"),--(INDIRECT(\"WP!$\"&$BU$41&\"$\"&$DO47&\":$\"&$BU$41&\"$\"&$DP47)<>\"\"),--(INDIRECT(\"WP!$K\"&$DO47&\":$K\"&$DP47)>0))<>0,SUMPRODUCT(--(INDIRECT(\"WP!$C$\"&$DO47&\":$C$\"&$DP47)=$C47),--(INDIRECT(\"WP!$B\"&$DO47&\":$B\"&$DP47)=\"Y\"),--(INDIRECT(\"WP!$\"&$BU$41&\"$\"&$DO47&\":$\"&$BU$41&\"$\"&$DP47)<>\"\"),INDIRECT(\"WP!$K\"&$DO47&\":$K\"&$DP47)),\"\"),\"\"),\"\")","v":""},{"$f":"IFERROR(IF(WpAreaC_Sub2_exist,IF(SUMPRODUCT(--(INDIRECT(\"WP!$C$\"&$DO47&\":$C$\"&$DP47)=$C47),--(INDIRECT(\"WP!$\"&$BX$41&\"$\"&$DO47&\":$\"&$BX$41&\"$\"&$DP47)<>\"\"),--(INDIRECT(\"WP!$K$\"&$DO47&\":$K$\"&$DP47)>0))>0,SUMPRODUCT(--(INDIRECT(\"WP!$C$\"&$DO47&\":$C$\"&$DP47)=$C47),--(INDIRECT(\"WP!$\"&$BX$41&\"$\"&$DO47&\":$\"&$BX$41&\"$\"&$DP47)<>\"\"),INDIRECT(\"WP!$K\"&$DO47&\":$K\"&$DP47),INDIRECT(\"WP!$\"&$BX$41&\"$\"&$DO47&\":$\"&$BX$41&\"$\"&$DP47))/SUMPRODUCT(--(INDIRECT(\"WP!$C$\"&$DO47&\":$C$\"&$DP47)=$C47),--(INDIRECT(\"WP!$\"&$BX$41&\"$\"&$DO47&\":$\"&$BX$41&\"$\"&$DP47)<>\"\"),INDIRECT(\"WP!$K\"&$DO47&\":$K\"&$DP47)),\"\"),\"\"),\"\")","v":""},{"$f":"IFERROR(IF(WpAreaC_Sub2_exist,IF(SUMPRODUCT(--(INDIRECT(\"WP!$C$\"&$DO47&\":$C$\"&$DP47)=$C47),--(INDIRECT(\"WP!$B\"&$DO47&\":$B\"&$DP47)=\"Y\"),--(INDIRECT(\"WP!$\"&$BX$41&\"$\"&$DO47&\":$\"&$BX$41&\"$\"&$DP47)=1),--(INDIRECT(\"WP!$K\"&$DO47&\":$K\"&$DP47)>0))<>0,SUMPRODUCT(--(INDIRECT(\"WP!$C$\"&$DO47&\":$C$\"&$DP47)=$C47),--(INDIRECT(\"WP!$B\"&$DO47&\":$B\"&$DP47)=\"Y\"),--(INDIRECT(\"WP!$\"&$BX$41&\"$\"&$DO47&\":$\"&$BX$41&\"$\"&$DP47)=1),INDIRECT(\"WP!$K\"&$DO47&\":$K\"&$DP47)),IF(BZ47<>\"\",0,\"\")),\"\"),\"\")","v":""},{"$f":"IFERROR(IF(WpAreaC_Sub2_exist,IF(SUMPRODUCT(--(INDIRECT(\"WP!$C$\"&$DO47&\":$C$\"&$DP47)=$C47),--(INDIRECT(\"WP!$B\"&$DO47&\":$B\"&$DP47)=\"Y\"),--(INDIRECT(\"WP!$\"&$BX$41&\"$\"&$DO47&\":$\"&$BX$41&\"$\"&$DP47)<>\"\"),--(INDIRECT(\"WP!$K\"&$DO47&\":$K\"&$DP47)>0))<>0,SUMPRODUCT(--(INDIRECT(\"WP!$C$\"&$DO47&\":$C$\"&$DP47)=$C47),--(INDIRECT(\"WP!$B\"&$DO47&\":$B\"&$DP47)=\"Y\"),--(INDIRECT(\"WP!$\"&$BX$41&\"$\"&$DO47&\":$\"&$BX$41&\"$\"&$DP47)<>\"\"),INDIRECT(\"WP!$K\"&$DO47&\":$K\"&$DP47)),\"\"),\"\"),\"\")","v":""},{"$f":"IFERROR(IF(WpAreaC_Sub3_exist,IF(SUMPRODUCT(--(INDIRECT(\"WP!$C$\"&$DO47&\":$C$\"&$DP47)=$C47),--(INDIRECT(\"WP!$\"&$CA$41&\"$\"&$DO47&\":$\"&$CA$41&\"$\"&$DP47)<>\"\"),--(INDIRECT(\"WP!$K$\"&$DO47&\":$K$\"&$DP47)>0))>0,SUMPRODUCT(--(INDIRECT(\"WP!$C$\"&$DO47&\":$C$\"&$DP47)=$C47),--(INDIRECT(\"WP!$\"&$CA$41&\"$\"&$DO47&\":$\"&$CA$41&\"$\"&$DP47)<>\"\"),INDIRECT(\"WP!$K\"&$DO47&\":$K\"&$DP47),INDIRECT(\"WP!$\"&$CA$41&\"$\"&$DO47&\":$\"&$CA$41&\"$\"&$DP47))/SUMPRODUCT(--(INDIRECT(\"WP!$C$\"&$DO47&\":$C$\"&$DP47)=$C47),--(INDIRECT(\"WP!$\"&$CA$41&\"$\"&$DO47&\":$\"&$CA$41&\"$\"&$DP47)<>\"\"),INDIRECT(\"WP!$K\"&$DO47&\":$K\"&$DP47)),\"\"),\"\"),\"\")","v":""},{"$f":"IFERROR(IF(WpAreaC_Sub3_exist,IF(SUMPRODUCT(--(INDIRECT(\"WP!$C$\"&$DO47&\":$C$\"&$DP47)=$C47),--(INDIRECT(\"WP!$B\"&$DO47&\":$B\"&$DP47)=\"Y\"),--(INDIRECT(\"WP!$\"&$CA$41&\"$\"&$DO47&\":$\"&$CA$41&\"$\"&$DP47)=1),--(INDIRECT(\"WP!$K\"&$DO47&\":$K\"&$DP47)>0))<>0,SUMPRODUCT(--(INDIRECT(\"WP!$C$\"&$DO47&\":$C$\"&$DP47)=$C47),--(INDIRECT(\"WP!$B\"&$DO47&\":$B\"&$DP47)=\"Y\"),--(INDIRECT(\"WP!$\"&$CA$41&\"$\"&$DO47&\":$\"&$CA$41&\"$\"&$DP47)=1),INDIRECT(\"WP!$K\"&$DO47&\":$K\"&$DP47)),IF(CC47<>\"\",0,\"\")),\"\"),\"\")","v":""},{"$f":"IFERROR(IF(WpAreaC_Sub3_exist,IF(SUMPRODUCT(--(INDIRECT(\"WP!$C$\"&$DO47&\":$C$\"&$DP47)=$C47),--(INDIRECT(\"WP!$B\"&$DO47&\":$B\"&$DP47)=\"Y\"),--(INDIRECT(\"WP!$\"&$CA$41&\"$\"&$DO47&\":$\"&$CA$41&\"$\"&$DP47)<>\"\"),--(INDIRECT(\"WP!$K\"&$DO47&\":$K\"&$DP47)>0))<>0,SUMPRODUCT(--(INDIRECT(\"WP!$C$\"&$DO47&\":$C$\"&$DP47)=$C47),--(INDIRECT(\"WP!$B\"&$DO47&\":$B\"&$DP47)=\"Y\"),--(INDIRECT(\"WP!$\"&$CA$41&\"$\"&$DO47&\":$\"&$CA$41&\"$\"&$DP47)<>\"\"),INDIRECT(\"WP!$K\"&$DO47&\":$K\"&$DP47)),\"\"),\"\"),\"\")","v":""},null,null,null,null,"","","","","","","","","","","","",null,"","","","","","","","","",null,"","","","","","","","","",null,{"$f":"MIN(IF(WP!$C$12:$C$79=$C47,ROW(WP!$C$12:$C$79),\"\"))","v":0},{"$f":"MAX(IF(WP!$C$12:$C$79=$C47,ROW(WP!$C$12:$C$79),\"\"))","v":0}]
[null,"Applicability RF. Demod/QSI and RRM test cases","36.521-2",{"$f":"getProgress(AX48,CH48,\"%\",1,1)","v":"0%"},{"$f":"getProgress(AY48,CI48,,,1)","v":""},{"$f":"getProgress(AZ48,CJ48,,,1)","v":""},null,{"$f":"getProgress(BA48,CK48,\"%\",1,1,WpAreaA_Sub1_exist)","v":"0%"},{"$f":"getProgress(BB48,CL48,,,1,WpAreaA_Sub1_exist)","v":""},{"$f":"getProgress(BC48,CM48,,,1,WpAreaA_Sub1_exist)","v":""},{"$f":"getProgress(BD48,CN48,\"%\",1,1,WpAreaA_Sub2_exist)","v":""},{"$f":"getProgress(BE48,CO48,,,1,WpAreaA_Sub2_exist)","v":""},{"$f":"getProgress(BF48,CP48,,,1,WpAreaA_Sub2_exist)","v":""},{"$f":"getProgress(BG48,CQ48,\"%\",1,1,WpAreaA_Sub3_exist)","v":""},{"$f":"getProgress(BH48,CR48,,,1,WpAreaA_Sub3_exist)","v":""},{"$f":"getProgress(BI48,CS48,,,1,WpAreaA_Sub3_exist)","v":""},null,{"$f":"getProgress(BK48,CU48,\"%\",1,1,WpAreaB_Sub1_exist)","v":""},{"$f":"getProgress(BL48,CV48,,,1,WpAreaB_Sub1_exist)","v":""},{"$f":"getProgress(BM48,CW48,,,1,WpAreaB_Sub1_exist)","v":""},{"$f":"getProgress(BN48,CX48,\"%\",1,1,WpAreaB_Sub2_exist)","v":""},{"$f":"getProgress(BO48,CY48,,,1,WpAreaB_Sub2_exist)","v":""},{"$f":"getProgress(BP48,CZ48,,,1,WpAreaB_Sub2_exist)","v":""},{"$f":"getProgress(BQ48,DA48,\"%\",1,1,WpAreaB_Sub3_exist)","v":""},{"$f":"getProgress(BR48,DB48,,,1,WpAreaB_Sub3_exist)","v":""},{"$f":"getProgress(BS48,DC48,,,1,WpAreaB_Sub3_exist)","v":""},null,{"$f":"getProgress(BU48,DE48,\"%\",1,1,WpAreaC_Sub1_exist)","v":""},{"$f":"getProgress(BV48,DF48,,,1,WpAreaC_Sub1_exist)","v":""},{"$f":"getProgress(BW48,DG48,,,1,WpAreaC_Sub1_exist)","v":""},{"$f":"getProgress(BX48,DH48,\"%\",1,1,WpAreaC_Sub2_exist)","v":""},{"$f":"getProgress(BY48,DI48,,,1,WpAreaC_Sub2_exist)","v":""},{"$f":"getProgress(BZ48,DJ48,,,1,WpAreaC_Sub2_exist)","v":""},{"$f":"getProgress(CA48,DK48,\"%\",1,1,WpAreaC_Sub3_exist)","v":""},{"$f":"getProgress(CB48,DL48,,,1,WpAreaC_Sub3_exist)","v":""},{"$f":"getProgress(CC48,DM48,,,1,WpAreaC_Sub3_exist)","v":""},null,null,null,null,null,null,null,null,null,null,null,null,null,{"$f":"IFERROR((IF(WpAreaA_exist,IF(BA48<>\"\",BA48*WP!$AB$9,0)+IF(BD48<>\"\",BD48*WP!$AC$9,0)+IF(BG48<>\"\",BG48*WP!$AD$9,0),0)+IF(WpAreaB_exist,IF(BK48<>\"\",BK48*WP!$AE$10)+IF(BN48<>\"\",BN48*WP!$AF$10,0)+IF(BQ48<>\"\",BQ48*WP!$AG$10,0),0)+IF(WpAreaC_exist,IF(BU48<>\"\",BU48*WP!$AH$10)+IF(BX48<>\"\",BX48*WP!$AI$10,0)+IF(CA48<>\"\",CA48*WP!$AJ$10,0),0))/(IF(WpAreaA_exist,IF(BA48<>\"\",WP!$AB$9,0)+IF(BD48<>\"\",WP!$AC$9,0)+IF(BG48<>\"\",WP!$AD$9,0),0)+IF(WpAreaB_exist,IF(BK48<>\"\",WP!$AE$10,0)+IF(BN48<>\"\",WP!$AF$10,0)+IF(BQ48<>\"\",WP!$AG$10,0),0)+IF(WpAreaC_exist,IF(BU48<>\"\",WP!$AH$10,0)+IF(BX48<>\"\",WP!$AI$10,0)+IF(CA48<>\"\",WP!$AJ$10,0),0)),\"\")","v":0},{"$f":"IFERROR(IF(SUMPRODUCT(--(INDIRECT(\"WP!$C$\"&$DO48&\":$C$\"&$DP48)=$C48),--(INDIRECT(\"WP!$B$\"&$DO48&\":$B$\"&$DP48)=\"Y\"),--(INDIRECT(\"WP!$\"&$AX$41&\"$\"&$DO48&\":$\"&$AX$41&\"$\"&$DP48)=1),--(INDIRECT(\"WP!$K$\"&$DO48&\":$K$\"&$DP48)>0))<>0,SUMPRODUCT(--(INDIRECT(\"WP!$C$\"&$DO48&\":$C$\"&$DP48)=$C48),--(INDIRECT(\"WP!$B$\"&$DO48&\":$B$\"&$DP48)=\"Y\"),--(INDIRECT(\"WP!$\"&$AX$41&\"$\"&$DO48&\":$\"&$AX$41&\"$\"&$DP48)=1),INDIRECT(\"WP!$K$\"&$DO48&\":$K$\"&$DP48)),IF(AZ48<>\"\",0,\"\")),\"\")","v":""},{"$f":"IFERROR(IF(SUMPRODUCT(--(INDIRECT(\"WP!$C$\"&$DO48&\":$C$\"&$DP48)=$C48),--(INDIRECT(\"WP!$B\"&$DO48&\":$B\"&$DP48)=\"Y\"),--(INDIRECT(\"WP!$\"&$AX$41&\"$\"&$DO48&\":$\"&$AX$41&\"$\"&$DP48)<>\"\"),--(INDIRECT(\"WP!$K\"&$DO48&\":$K\"&$DP48)>0))<>0,SUMPRODUCT(--(INDIRECT(\"WP!$C$\"&$DO48&\":$C$\"&$DP48)=$C48),--(INDIRECT(\"WP!$B\"&$DO48&\":$B\"&$DP48)=\"Y\"),--(INDIRECT(\"WP!$\"&$AX$41&\"$\"&$DO48&\":$\"&$AX$41&\"$\"&$DP48)<>\"\"),INDIRECT(\"WP!$K\"&$DO48&\":$K\"&$DP48)),\"\"),\"\")","v":""},{"$f":"IFERROR(IF(WpAreaA_Sub1_exist,IF(SUMPRODUCT(--(INDIRECT(\"WP!$C$\"&$DO48&\":$C$\"&$DP48)=$C48),--(INDIRECT(\"WP!$\"&$BA$41&\"$\"&$DO48&\":$\"&$BA$41&\"$\"&$DP48)<>\"\"),--(INDIRECT(\"WP!$K$\"&$DO48&\":$K$\"&$DP48)>0))>0,SUMPRODUCT(--(INDIRECT(\"WP!$C$\"&$DO48&\":$C$\"&$DP48)=$C48),--(INDIRECT(\"WP!$\"&$BA$41&\"$\"&$DO48&\":$\"&$BA$41&\"$\"&$DP48)<>\"\"),INDIRECT(\"WP!$K$\"&$DO48&\":$K$\"&$DP48),INDIRECT(\"WP!$\"&$BA$41&\"$\"&$DO48&\":$\"&$BA$41&\"$\"&$DP48))/SUMPRODUCT(--(INDIRECT(\"WP!$C$\"&$DO48&\":$C$\"&$DP48)=$C48),--(INDIRECT(\"WP!$\"&$BA$41&\"$\"&$DO48&\":$\"&$BA$41&\"$\"&$DP48)<>\"\"),INDIRECT(\"WP!$K$\"&$DO48&\":$K$\"&$DP48)),\"\"),\"\"),\"\")","v":0},{"$f":"IFERROR(IF(WpAreaA_Sub1_exist,IF(SUMPRODUCT(--(INDIRECT(\"WP!$C$\"&$DO48&\":$C$\"&$DP48)=$C48),--(INDIRECT(\"WP!$B$\"&$DO48&\":$B$\"&$DP48)=\"Y\"),--(INDIRECT(\"WP!$\"&$BA$41&\"$\"&$DO48&\":$\"&$BA$41&\"$\"&$DP48)=1),--(INDIRECT(\"WP!$K$\"&$DO48&\":$K$\"&$DP48)>0))<>0,SUMPRODUCT(--(INDIRECT(\"WP!$C$\"&$DO48&\":$C$\"&$DP48)=$C48),--(INDIRECT(\"WP!$B$\"&$DO48&\":$B$\"&$DP48)=\"Y\"),--(INDIRECT(\"WP!$\"&$BA$41&\"$\"&$DO48&\":$\"&$BA$41&\"$\"&$DP48)=1),INDIRECT(\"WP!$K$\"&$DO48&\":$K$\"&$DP48)),IF(BC48<>\"\",0,\"\")),\"\"),\"\")","v":""},{"$f":"IFERROR(IF(WpAreaA_Sub1_exist,IF(SUMPRODUCT(--(INDIRECT(\"WP!$C$\"&$DO48&\":$C$\"&$DP48)=$C48),--(INDIRECT(\"WP!$B\"&$DO48&\":$B\"&$DP48)=\"Y\"),--(INDIRECT(\"WP!$\"&$BA$41&\"$\"&$DO48&\":$\"&$BA$41&\"$\"&$DP48)<>\"\"),--(INDIRECT(\"WP!$K\"&$DO48&\":$K\"&$DP48)>0))<>0,SUMPRODUCT(--(INDIRECT(\"WP!$C$\"&$DO48&\":$C$\"&$DP48)=$C48),--(INDIRECT(\"WP!$B\"&$DO48&\":$B\"&$DP48)=\"Y\"),--(INDIRECT(\"WP!$\"&$BA$41&\"$\"&$DO48&\":$\"&$BA$41&\"$\"&$DP48)<>\"\"),INDIRECT(\"WP!$K\"&$DO48&\":$K\"&$DP48)),\"\"),\"\"),\"\")","v":""},{"$f":"IFERROR(IF(WpAreaA_Sub2_exist,IF(SUMPRODUCT(--(INDIRECT(\"WP!$C$\"&$DO48&\":$C$\"&$DP48)=$C48),--(INDIRECT(\"WP!$\"&$BD$41&\"$\"&$DO48&\":$\"&$BD$41&\"$\"&$DP48)<>\"\"),--(INDIRECT(\"WP!$K$\"&$DO48&\":$K$\"&$DP48)>0))>0,SUMPRODUCT(--(INDIRECT(\"WP!$C$\"&$DO48&\":$C$\"&$DP48)=$C48),--(INDIRECT(\"WP!$\"&$BD$41&\"$\"&$DO48&\":$\"&$BD$41&\"$\"&$DP48)<>\"\"),INDIRECT(\"WP!$K\"&$DO48&\":$K\"&$DP48),INDIRECT(\"WP!$\"&$BD$41&\"$\"&$DO48&\":$\"&$BD$41&\"$\"&$DP48))/SUMPRODUCT(--(INDIRECT(\"WP!$C$\"&$DO48&\":$C$\"&$DP48)=$C48),--(INDIRECT(\"WP!$\"&$BD$41&\"$\"&$DO48&\":$\"&$BD$41&\"$\"&$DP48)<>\"\"),INDIRECT(\"WP!$K\"&$DO48&\":$K\"&$DP48)),\"\"),\"\"),\"\")","v":""},{"$f":"IFERROR(IF(WpAreaA_Sub2_exist,IF(SUMPRODUCT(--(INDIRECT(\"WP!$C$\"&$DO48&\":$C$\"&$DP48)=$C48),--(INDIRECT(\"WP!$B\"&$DO48&\":$B\"&$DP48)=\"Y\"),--(INDIRECT(\"WP!$\"&$BD$41&\"$\"&$DO48&\":$\"&$BD$41&\"$\"&$DP48)=1),--(INDIRECT(\"WP!$K\"&$DO48&\":$K\"&$DP48)>0))<>0,SUMPRODUCT(--(INDIRECT(\"WP!$C$\"&$DO48&\":$C$\"&$DP48)=$C48),--(INDIRECT(\"WP!$B\"&$DO48&\":$B\"&$DP48)=\"Y\"),--(INDIRECT(\"WP!$\"&$BD$41&\"$\"&$DO48&\":$\"&$BD$41&\"$\"&$DP48)=1),INDIRECT(\"WP!$K\"&$DO48&\":$K\"&$DP48)),IF(BF48<>\"\",0,\"\")),\"\"),\"\")","v":""},{"$f":"IFERROR(IF(WpAreaA_Sub2_exist,IF(SUMPRODUCT(--(INDIRECT(\"WP!$C$\"&$DO48&\":$C$\"&$DP48)=$C48),--(INDIRECT(\"WP!$B\"&$DO48&\":$B\"&$DP48)=\"Y\"),--(INDIRECT(\"WP!$\"&$BD$41&\"$\"&$DO48&\":$\"&$BD$41&\"$\"&$DP48)<>\"\"),--(INDIRECT(\"WP!$K\"&$DO48&\":$K\"&$DP48)>0))<>0,SUMPRODUCT(--(INDIRECT(\"WP!$C$\"&$DO48&\":$C$\"&$DP48)=$C48),--(INDIRECT(\"WP!$B\"&$DO48&\":$B\"&$DP48)=\"Y\"),--(INDIRECT(\"WP!$\"&$BD$41&\"$\"&$DO48&\":$\"&$BD$41&\"$\"&$DP48)<>\"\"),INDIRECT(\"WP!$K\"&$DO48&\":$K\"&$DP48)),\"\"),\"\"),\"\")","v":""},{"$f":"IFERROR(IF(WpAreaA_Sub3_exist,IF(SUMPRODUCT(--(INDIRECT(\"WP!$C$\"&$DO48&\":$C$\"&$DP48)=$C48),--(INDIRECT(\"WP!$\"&$BG$41&\"$\"&$DO48&\":$\"&$BG$41&\"$\"&$DP48)<>\"\"),--(INDIRECT(\"WP!$K$\"&$DO48&\":$K$\"&$DP48)>0))>0,SUMPRODUCT(--(INDIRECT(\"WP!$C$\"&$DO48&\":$C$\"&$DP48)=$C48),--(INDIRECT(\"WP!$\"&$BG$41&\"$\"&$DO48&\":$\"&$BG$41&\"$\"&$DP48)<>\"\"),INDIRECT(\"WP!$K\"&$DO48&\":$K\"&$DP48),INDIRECT(\"WP!$\"&$BG$41&\"$\"&$DO48&\":$\"&$BG$41&\"$\"&$DP48))/SUMPRODUCT(--(INDIRECT(\"WP!$C$\"&$DO48&\":$C$\"&$DP48)=$C48),--(INDIRECT(\"WP!$\"&$BG$41&\"$\"&$DO48&\":$\"&$BG$41&\"$\"&$DP48)<>\"\"),INDIRECT(\"WP!$K\"&$DO48&\":$K\"&$DP48)),\"\"),\"\"),\"\")","v":""},{"$f":"IFERROR(IF(WpAreaA_Sub3_exist,IF(SUMPRODUCT(--(INDIRECT(\"WP!$C$\"&$DO48&\":$C$\"&$DP48)=$C48),--(INDIRECT(\"WP!$B\"&$DO48&\":$B\"&$DP48)=\"Y\"),--(INDIRECT(\"WP!$\"&$BG$41&\"$\"&$DO48&\":$\"&$BG$41&\"$\"&$DP48)=1),--(INDIRECT(\"WP!$K\"&$DO48&\":$K\"&$DP48)>0))<>0,SUMPRODUCT(--(INDIRECT(\"WP!$C$\"&$DO48&\":$C$\"&$DP48)=$C48),--(INDIRECT(\"WP!$B\"&$DO48&\":$B\"&$DP48)=\"Y\"),--(INDIRECT(\"WP!$\"&$BG$41&\"$\"&$DO48&\":$\"&$BG$41&\"$\"&$DP48)=1),INDIRECT(\"WP!$K\"&$DO48&\":$K\"&$DP48)),IF(BI48<>\"\",0,\"\")),\"\"),\"\")","v":""},{"$f":"IFERROR(IF(WpAreaA_Sub3_exist,IF(SUMPRODUCT(--(INDIRECT(\"WP!$C$\"&$DO48&\":$C$\"&$DP48)=$C48),--(INDIRECT(\"WP!$B\"&$DO48&\":$B\"&$DP48)=\"Y\"),--(INDIRECT(\"WP!$\"&$BG$41&\"$\"&$DO48&\":$\"&$BG$41&\"$\"&$DP48)<>\"\"),--(INDIRECT(\"WP!$K\"&$DO48&\":$K\"&$DP48)>0))<>0,SUMPRODUCT(--(INDIRECT(\"WP!$C$\"&$DO48&\":$C$\"&$DP48)=$C48),--(INDIRECT(\"WP!$B\"&$DO48&\":$B\"&$DP48)=\"Y\"),--(INDIRECT(\"WP!$\"&$BG$41&\"$\"&$DO48&\":$\"&$BG$41&\"$\"&$DP48)<>\"\"),INDIRECT(\"WP!$K\"&$DO48&\":$K\"&$DP48)),\"\"),\"\"),\"\")","v":""},null,{"$f":"IFERROR(IF(WpAreaB_Sub1_exist,IF(SUMPRODUCT(--(INDIRECT(\"WP!$C$\"&$DO48&\":$C$\"&$DP48)=$C48),--(INDIRECT(\"WP!$\"&$BK$41&\"$\"&$DO48&\":$\"&$BK$41&\"$\"&$DP48)<>\"\"),--(INDIRECT(\"WP!$K$\"&$DO48&\":$K$\"&$DP48)>0))>0,SUMPRODUCT(--(INDIRECT(\"WP!$C$\"&$DO48&\":$C$\"&$DP48)=$C48),--(INDIRECT(\"WP!$\"&$BK$41&\"$\"&$DO48&\":$\"&$BK$41&\"$\"&$DP48)<>\"\"),INDIRECT(\"WP!$K\"&$DO48&\":$K\"&$DP48),INDIRECT(\"WP!$\"&$BK$41&\"$\"&$DO48&\":$\"&$BK$41&\"$\"&$DP48))/SUMPRODUCT(--(INDIRECT(\"WP!$C$\"&$DO48&\":$C$\"&$DP48)=$C48),--(INDIRECT(\"WP!$\"&$BK$41&\"$\"&$DO48&\":$\"&$BK$41&\"$\"&$DP48)<>\"\"),INDIRECT(\"WP!$K\"&$DO48&\":$K\"&$DP48)),\"\"),\"\"),\"\")","v":""},{"$f":"IFERROR(IF(WpAreaB_Sub1_exist,IF(SUMPRODUCT(--(INDIRECT(\"WP!$C$\"&$DO48&\":$C$\"&$DP48)=$C48),--(INDIRECT(\"WP!$B\"&$DO48&\":$B\"&$DP48)=\"Y\"),--(INDIRECT(\"WP!$\"&$BK$41&\"$\"&$DO48&\":$\"&$BK$41&\"$\"&$DP48)=1),--(INDIRECT(\"WP!$K\"&$DO48&\":$K\"&$DP48)>0))<>0,SUMPRODUCT(--(INDIRECT(\"WP!$C$\"&$DO48&\":$C$\"&$DP48)=$C48),--(INDIRECT(\"WP!$B\"&$DO48&\":$B\"&$DP48)=\"Y\"),--(INDIRECT(\"WP!$\"&$BK$41&\"$\"&$DO48&\":$\"&$BK$41&\"$\"&$DP48)=1),INDIRECT(\"WP!$K\"&$DO48&\":$K\"&$DP48)),IF(BM48<>\"\",0,\"\")),\"\"),\"\")","v":""},{"$f":"IFERROR(IF(WpAreaB_Sub1_exist,IF(SUMPRODUCT(--(INDIRECT(\"WP!$C$\"&$DO48&\":$C$\"&$DP48)=$C48),--(INDIRECT(\"WP!$B\"&$DO48&\":$B\"&$DP48)=\"Y\"),--(INDIRECT(\"WP!$\"&$BK$41&\"$\"&$DO48&\":$\"&$BK$41&\"$\"&$DP48)<>\"\"),--(INDIRECT(\"WP!$K\"&$DO48&\":$K\"&$DP48)>0))<>0,SUMPRODUCT(--(INDIRECT(\"WP!$C$\"&$DO48&\":$C$\"&$DP48)=$C48),--(INDIRECT(\"WP!$B\"&$DO48&\":$B\"&$DP48)=\"Y\"),--(INDIRECT(\"WP!$\"&$BK$41&\"$\"&$DO48&\":$\"&$BK$41&\"$\"&$DP48)<>\"\"),INDIRECT(\"WP!$K\"&$DO48&\":$K\"&$DP48)),\"\"),\"\"),\"\")","v":""},{"$f":"IFERROR(IF(WpAreaB_Sub2_exist,IF(SUMPRODUCT(--(INDIRECT(\"WP!$C$\"&$DO48&\":$C$\"&$DP48)=$C48),--(INDIRECT(\"WP!$\"&$BN$41&\"$\"&$DO48&\":$\"&$BN$41&\"$\"&$DP48)<>\"\"),--(INDIRECT(\"WP!$K$\"&$DO48&\":$K$\"&$DP48)>0))>0,SUMPRODUCT(--(INDIRECT(\"WP!$C$\"&$DO48&\":$C$\"&$DP48)=$C48),--(INDIRECT(\"WP!$\"&$BN$41&\"$\"&$DO48&\":$\"&$BN$41&\"$\"&$DP48)<>\"\"),INDIRECT(\"WP!$K\"&$DO48&\":$K\"&$DP48),INDIRECT(\"WP!$\"&$BN$41&\"$\"&$DO48&\":$\"&$BN$41&\"$\"&$DP48))/SUMPRODUCT(--(INDIRECT(\"WP!$C$\"&$DO48&\":$C$\"&$DP48)=$C48),--(INDIRECT(\"WP!$\"&$BN$41&\"$\"&$DO48&\":$\"&$BN$41&\"$\"&$DP48)<>\"\"),INDIRECT(\"WP!$K\"&$DO48&\":$K\"&$DP48)),\"\"),\"\"),\"\")","v":""},{"$f":"IFERROR(IF(WpAreaB_Sub2_exist,IF(SUMPRODUCT(--(INDIRECT(\"WP!$C$\"&$DO48&\":$C$\"&$DP48)=$C48),--(INDIRECT(\"WP!$B\"&$DO48&\":$B\"&$DP48)=\"Y\"),--(INDIRECT(\"WP!$\"&$BN$41&\"$\"&$DO48&\":$\"&$BN$41&\"$\"&$DP48)=1),--(INDIRECT(\"WP!$K\"&$DO48&\":$K\"&$DP48)>0))<>0,SUMPRODUCT(--(INDIRECT(\"WP!$C$\"&$DO48&\":$C$\"&$DP48)=$C48),--(INDIRECT(\"WP!$B\"&$DO48&\":$B\"&$DP48)=\"Y\"),--(INDIRECT(\"WP!$\"&$BN$41&\"$\"&$DO48&\":$\"&$BN$41&\"$\"&$DP48)=1),INDIRECT(\"WP!$K\"&$DO48&\":$K\"&$DP48)),IF(BP48<>\"\",0,\"\")),\"\"),\"\")","v":""},{"$f":"IFERROR(IF(WpAreaB_Sub2_exist,IF(SUMPRODUCT(--(INDIRECT(\"WP!$C$\"&$DO48&\":$C$\"&$DP48)=$C48),--(INDIRECT(\"WP!$B\"&$DO48&\":$B\"&$DP48)=\"Y\"),--(INDIRECT(\"WP!$\"&$BN$41&\"$\"&$DO48&\":$\"&$BN$41&\"$\"&$DP48)<>\"\"),--(INDIRECT(\"WP!$K\"&$DO48&\":$K\"&$DP48)>0))<>0,SUMPRODUCT(--(INDIRECT(\"WP!$C$\"&$DO48&\":$C$\"&$DP48)=$C48),--(INDIRECT(\"WP!$B\"&$DO48&\":$B\"&$DP48)=\"Y\"),--(INDIRECT(\"WP!$\"&$BN$41&\"$\"&$DO48&\":$\"&$BN$41&\"$\"&$DP48)<>\"\"),INDIRECT(\"WP!$K\"&$DO48&\":$K\"&$DP48)),\"\"),\"\"),\"\")","v":""},{"$f":"IFERROR(IF(WpAreaB_Sub3_exist,IF(SUMPRODUCT(--(INDIRECT(\"WP!$C$\"&$DO48&\":$C$\"&$DP48)=$C48),--(INDIRECT(\"WP!$\"&$BQ$41&\"$\"&$DO48&\":$\"&$BQ$41&\"$\"&$DP48)<>\"\"),--(INDIRECT(\"WP!$K$\"&$DO48&\":$K$\"&$DP48)>0))>0,SUMPRODUCT(--(INDIRECT(\"WP!$C$\"&$DO48&\":$C$\"&$DP48)=$C48),--(INDIRECT(\"WP!$\"&$BQ$41&\"$\"&$DO48&\":$\"&$BQ$41&\"$\"&$DP48)<>\"\"),INDIRECT(\"WP!$K\"&$DO48&\":$K\"&$DP48),INDIRECT(\"WP!$\"&$BQ$41&\"$\"&$DO48&\":$\"&$BQ$41&\"$\"&$DP48))/SUMPRODUCT(--(INDIRECT(\"WP!$C$\"&$DO48&\":$C$\"&$DP48)=$C48),--(INDIRECT(\"WP!$\"&$BQ$41&\"$\"&$DO48&\":$\"&$BQ$41&\"$\"&$DP48)<>\"\"),INDIRECT(\"WP!$K\"&$DO48&\":$K\"&$DP48)),\"\"),\"\"),\"\")","v":""},{"$f":"IFERROR(IF(WpAreaB_Sub3_exist,IF(SUMPRODUCT(--(INDIRECT(\"WP!$C$\"&$DO48&\":$C$\"&$DP48)=$C48),--(INDIRECT(\"WP!$B\"&$DO48&\":$B\"&$DP48)=\"Y\"),--(INDIRECT(\"WP!$\"&$BQ$41&\"$\"&$DO48&\":$\"&$BQ$41&\"$\"&$DP48)=1),--(INDIRECT(\"WP!$K\"&$DO48&\":$K\"&$DP48)>0))<>0,SUMPRODUCT(--(INDIRECT(\"WP!$C$\"&$DO48&\":$C$\"&$DP48)=$C48),--(INDIRECT(\"WP!$B\"&$DO48&\":$B\"&$DP48)=\"Y\"),--(INDIRECT(\"WP!$\"&$BQ$41&\"$\"&$DO48&\":$\"&$BQ$41&\"$\"&$DP48)=1),INDIRECT(\"WP!$K\"&$DO48&\":$K\"&$DP48)),IF(BS48<>\"\",0,\"\")),\"\"),\"\")","v":""},{"$f":"IFERROR(IF(WpAreaB_Sub3_exist,IF(SUMPRODUCT(--(INDIRECT(\"WP!$C$\"&$DO48&\":$C$\"&$DP48)=$C48),--(INDIRECT(\"WP!$B\"&$DO48&\":$B\"&$DP48)=\"Y\"),--(INDIRECT(\"WP!$\"&$BQ$41&\"$\"&$DO48&\":$\"&$BQ$41&\"$\"&$DP48)<>\"\"),--(INDIRECT(\"WP!$K\"&$DO48&\":$K\"&$DP48)>0))<>0,SUMPRODUCT(--(INDIRECT(\"WP!$C$\"&$DO48&\":$C$\"&$DP48)=$C48),--(INDIRECT(\"WP!$B\"&$DO48&\":$B\"&$DP48)=\"Y\"),--(INDIRECT(\"WP!$\"&$BQ$41&\"$\"&$DO48&\":$\"&$BQ$41&\"$\"&$DP48)<>\"\"),INDIRECT(\"WP!$K\"&$DO48&\":$K\"&$DP48)),\"\"),\"\"),\"\")","v":""},null,{"$f":"IFERROR(IF(WpAreaC_Sub1_exist,IF(SUMPRODUCT(--(INDIRECT(\"WP!$C$\"&$DO48&\":$C$\"&$DP48)=$C48),--(INDIRECT(\"WP!$\"&$BU$41&\"$\"&$DO48&\":$\"&$BU$41&\"$\"&$DP48)<>\"\"),--(INDIRECT(\"WP!$K$\"&$DO48&\":$K$\"&$DP48)>0))>0,SUMPRODUCT(--(INDIRECT(\"WP!$C$\"&$DO48&\":$C$\"&$DP48)=$C48),--(INDIRECT(\"WP!$\"&$BU$41&\"$\"&$DO48&\":$\"&$BU$41&\"$\"&$DP48)<>\"\"),INDIRECT(\"WP!$K\"&$DO48&\":$K\"&$DP48),INDIRECT(\"WP!$\"&$BU$41&\"$\"&$DO48&\":$\"&$BU$41&\"$\"&$DP48))/SUMPRODUCT(--(INDIRECT(\"WP!$C$\"&$DO48&\":$C$\"&$DP48)=$C48),--(INDIRECT(\"WP!$\"&$BU$41&\"$\"&$DO48&\":$\"&$BU$41&\"$\"&$DP48)<>\"\"),INDIRECT(\"WP!$K\"&$DO48&\":$K\"&$DP48)),\"\"),\"\"),\"\")","v":""},{"$f":"IFERROR(IF(WpAreaC_Sub1_exist,IF(SUMPRODUCT(--(INDIRECT(\"WP!$C$\"&$DO48&\":$C$\"&$DP48)=$C48),--(INDIRECT(\"WP!$B\"&$DO48&\":$B\"&$DP48)=\"Y\"),--(INDIRECT(\"WP!$\"&$BU$41&\"$\"&$DO48&\":$\"&$BU$41&\"$\"&$DP48)=1),--(INDIRECT(\"WP!$K\"&$DO48&\":$K\"&$DP48)>0))<>0,SUMPRODUCT(--(INDIRECT(\"WP!$C$\"&$DO48&\":$C$\"&$DP48)=$C48),--(INDIRECT(\"WP!$B\"&$DO48&\":$B\"&$DP48)=\"Y\"),--(INDIRECT(\"WP!$\"&$BU$41&\"$\"&$DO48&\":$\"&$BU$41&\"$\"&$DP48)=1),INDIRECT(\"WP!$K\"&$DO48&\":$K\"&$DP48)),IF(BW48<>\"\",0,\"\")),\"\"),\"\")","v":""},{"$f":"IFERROR(IF(WpAreaC_Sub1_exist,IF(SUMPRODUCT(--(INDIRECT(\"WP!$C$\"&$DO48&\":$C$\"&$DP48)=$C48),--(INDIRECT(\"WP!$B\"&$DO48&\":$B\"&$DP48)=\"Y\"),--(INDIRECT(\"WP!$\"&$BU$41&\"$\"&$DO48&\":$\"&$BU$41&\"$\"&$DP48)<>\"\"),--(INDIRECT(\"WP!$K\"&$DO48&\":$K\"&$DP48)>0))<>0,SUMPRODUCT(--(INDIRECT(\"WP!$C$\"&$DO48&\":$C$\"&$DP48)=$C48),--(INDIRECT(\"WP!$B\"&$DO48&\":$B\"&$DP48)=\"Y\"),--(INDIRECT(\"WP!$\"&$BU$41&\"$\"&$DO48&\":$\"&$BU$41&\"$\"&$DP48)<>\"\"),INDIRECT(\"WP!$K\"&$DO48&\":$K\"&$DP48)),\"\"),\"\"),\"\")","v":""},{"$f":"IFERROR(IF(WpAreaC_Sub2_exist,IF(SUMPRODUCT(--(INDIRECT(\"WP!$C$\"&$DO48&\":$C$\"&$DP48)=$C48),--(INDIRECT(\"WP!$\"&$BX$41&\"$\"&$DO48&\":$\"&$BX$41&\"$\"&$DP48)<>\"\"),--(INDIRECT(\"WP!$K$\"&$DO48&\":$K$\"&$DP48)>0))>0,SUMPRODUCT(--(INDIRECT(\"WP!$C$\"&$DO48&\":$C$\"&$DP48)=$C48),--(INDIRECT(\"WP!$\"&$BX$41&\"$\"&$DO48&\":$\"&$BX$41&\"$\"&$DP48)<>\"\"),INDIRECT(\"WP!$K\"&$DO48&\":$K\"&$DP48),INDIRECT(\"WP!$\"&$BX$41&\"$\"&$DO48&\":$\"&$BX$41&\"$\"&$DP48))/SUMPRODUCT(--(INDIRECT(\"WP!$C$\"&$DO48&\":$C$\"&$DP48)=$C48),--(INDIRECT(\"WP!$\"&$BX$41&\"$\"&$DO48&\":$\"&$BX$41&\"$\"&$DP48)<>\"\"),INDIRECT(\"WP!$K\"&$DO48&\":$K\"&$DP48)),\"\"),\"\"),\"\")","v":""},{"$f":"IFERROR(IF(WpAreaC_Sub2_exist,IF(SUMPRODUCT(--(INDIRECT(\"WP!$C$\"&$DO48&\":$C$\"&$DP48)=$C48),--(INDIRECT(\"WP!$B\"&$DO48&\":$B\"&$DP48)=\"Y\"),--(INDIRECT(\"WP!$\"&$BX$41&\"$\"&$DO48&\":$\"&$BX$41&\"$\"&$DP48)=1),--(INDIRECT(\"WP!$K\"&$DO48&\":$K\"&$DP48)>0))<>0,SUMPRODUCT(--(INDIRECT(\"WP!$C$\"&$DO48&\":$C$\"&$DP48)=$C48),--(INDIRECT(\"WP!$B\"&$DO48&\":$B\"&$DP48)=\"Y\"),--(INDIRECT(\"WP!$\"&$BX$41&\"$\"&$DO48&\":$\"&$BX$41&\"$\"&$DP48)=1),INDIRECT(\"WP!$K\"&$DO48&\":$K\"&$DP48)),IF(BZ48<>\"\",0,\"\")),\"\"),\"\")","v":""},{"$f":"IFERROR(IF(WpAreaC_Sub2_exist,IF(SUMPRODUCT(--(INDIRECT(\"WP!$C$\"&$DO48&\":$C$\"&$DP48)=$C48),--(INDIRECT(\"WP!$B\"&$DO48&\":$B\"&$DP48)=\"Y\"),--(INDIRECT(\"WP!$\"&$BX$41&\"$\"&$DO48&\":$\"&$BX$41&\"$\"&$DP48)<>\"\"),--(INDIRECT(\"WP!$K\"&$DO48&\":$K\"&$DP48)>0))<>0,SUMPRODUCT(--(INDIRECT(\"WP!$C$\"&$DO48&\":$C$\"&$DP48)=$C48),--(INDIRECT(\"WP!$B\"&$DO48&\":$B\"&$DP48)=\"Y\"),--(INDIRECT(\"WP!$\"&$BX$41&\"$\"&$DO48&\":$\"&$BX$41&\"$\"&$DP48)<>\"\"),INDIRECT(\"WP!$K\"&$DO48&\":$K\"&$DP48)),\"\"),\"\"),\"\")","v":""},{"$f":"IFERROR(IF(WpAreaC_Sub3_exist,IF(SUMPRODUCT(--(INDIRECT(\"WP!$C$\"&$DO48&\":$C$\"&$DP48)=$C48),--(INDIRECT(\"WP!$\"&$CA$41&\"$\"&$DO48&\":$\"&$CA$41&\"$\"&$DP48)<>\"\"),--(INDIRECT(\"WP!$K$\"&$DO48&\":$K$\"&$DP48)>0))>0,SUMPRODUCT(--(INDIRECT(\"WP!$C$\"&$DO48&\":$C$\"&$DP48)=$C48),--(INDIRECT(\"WP!$\"&$CA$41&\"$\"&$DO48&\":$\"&$CA$41&\"$\"&$DP48)<>\"\"),INDIRECT(\"WP!$K\"&$DO48&\":$K\"&$DP48),INDIRECT(\"WP!$\"&$CA$41&\"$\"&$DO48&\":$\"&$CA$41&\"$\"&$DP48))/SUMPRODUCT(--(INDIRECT(\"WP!$C$\"&$DO48&\":$C$\"&$DP48)=$C48),--(INDIRECT(\"WP!$\"&$CA$41&\"$\"&$DO48&\":$\"&$CA$41&\"$\"&$DP48)<>\"\"),INDIRECT(\"WP!$K\"&$DO48&\":$K\"&$DP48)),\"\"),\"\"),\"\")","v":""},{"$f":"IFERROR(IF(WpAreaC_Sub3_exist,IF(SUMPRODUCT(--(INDIRECT(\"WP!$C$\"&$DO48&\":$C$\"&$DP48)=$C48),--(INDIRECT(\"WP!$B\"&$DO48&\":$B\"&$DP48)=\"Y\"),--(INDIRECT(\"WP!$\"&$CA$41&\"$\"&$DO48&\":$\"&$CA$41&\"$\"&$DP48)=1),--(INDIRECT(\"WP!$K\"&$DO48&\":$K\"&$DP48)>0))<>0,SUMPRODUCT(--(INDIRECT(\"WP!$C$\"&$DO48&\":$C$\"&$DP48)=$C48),--(INDIRECT(\"WP!$B\"&$DO48&\":$B\"&$DP48)=\"Y\"),--(INDIRECT(\"WP!$\"&$CA$41&\"$\"&$DO48&\":$\"&$CA$41&\"$\"&$DP48)=1),INDIRECT(\"WP!$K\"&$DO48&\":$K\"&$DP48)),IF(CC48<>\"\",0,\"\")),\"\"),\"\")","v":""},{"$f":"IFERROR(IF(WpAreaC_Sub3_exist,IF(SUMPRODUCT(--(INDIRECT(\"WP!$C$\"&$DO48&\":$C$\"&$DP48)=$C48),--(INDIRECT(\"WP!$B\"&$DO48&\":$B\"&$DP48)=\"Y\"),--(INDIRECT(\"WP!$\"&$CA$41&\"$\"&$DO48&\":$\"&$CA$41&\"$\"&$DP48)<>\"\"),--(INDIRECT(\"WP!$K\"&$DO48&\":$K\"&$DP48)>0))<>0,SUMPRODUCT(--(INDIRECT(\"WP!$C$\"&$DO48&\":$C$\"&$DP48)=$C48),--(INDIRECT(\"WP!$B\"&$DO48&\":$B\"&$DP48)=\"Y\"),--(INDIRECT(\"WP!$\"&$CA$41&\"$\"&$DO48&\":$\"&$CA$41&\"$\"&$DP48)<>\"\"),INDIRECT(\"WP!$K\"&$DO48&\":$K\"&$DP48)),\"\"),\"\"),\"\")","v":""},null,null,null,null,"","","","","","","","","","","","",null,"","","","","","","","","",null,"","","","","","","","","",null,{"$f":"MIN(IF(WP!$C$12:$C$79=$C48,ROW(WP!$C$12:$C$79),\"\"))","v":29},{"$f":"MAX(IF(WP!$C$12:$C$79=$C48,ROW(WP!$C$12:$C$79),\"\"))","v":31}]
[null,"RRM test cases","36.521-3",{"$f":"getProgress(AX49,CH49,\"%\",1,1)","v":"0%"},{"$f":"getProgress(AY49,CI49,,,1)","v":"0"},{"$f":"getProgress(AZ49,CJ49,,,1)","v":"7\n(+7)"},null,{"$f":"getProgress(BA49,CK49,\"%\",1,1,WpAreaA_Sub1_exist)","v":"0%"},{"$f":"getProgress(BB49,CL49,,,1,WpAreaA_Sub1_exist)","v":"0"},{"$f":"getProgress(BC49,CM49,,,1,WpAreaA_Sub1_exist)","v":"7\n(+7)"},{"$f":"getProgress(BD49,CN49,\"%\",1,1,WpAreaA_Sub2_exist)","v":""},{"$f":"getProgress(BE49,CO49,,,1,WpAreaA_Sub2_exist)","v":""},{"$f":"getProgress(BF49,CP49,,,1,WpAreaA_Sub2_exist)","v":""},{"$f":"getProgress(BG49,CQ49,\"%\",1,1,WpAreaA_Sub3_exist)","v":""},{"$f":"getProgress(BH49,CR49,,,1,WpAreaA_Sub3_exist)","v":""},{"$f":"getProgress(BI49,CS49,,,1,WpAreaA_Sub3_exist)","v":""},null,{"$f":"getProgress(BK49,CU49,\"%\",1,1,WpAreaB_Sub1_exist)","v":""},{"$f":"getProgress(BL49,CV49,,,1,WpAreaB_Sub1_exist)","v":""},{"$f":"getProgress(BM49,CW49,,,1,WpAreaB_Sub1_exist)","v":""},{"$f":"getProgress(BN49,CX49,\"%\",1,1,WpAreaB_Sub2_exist)","v":""},{"$f":"getProgress(BO49,CY49,,,1,WpAreaB_Sub2_exist)","v":""},{"$f":"getProgress(BP49,CZ49,,,1,WpAreaB_Sub2_exist)","v":""},{"$f":"getProgress(BQ49,DA49,\"%\",1,1,WpAreaB_Sub3_exist)","v":""},{"$f":"getProgress(BR49,DB49,,,1,WpAreaB_Sub3_exist)","v":""},{"$f":"getProgress(BS49,DC49,,,1,WpAreaB_Sub3_exist)","v":""},null,{"$f":"getProgress(BU49,DE49,\"%\",1,1,WpAreaC_Sub1_exist)","v":""},{"$f":"getProgress(BV49,DF49,,,1,WpAreaC_Sub1_exist)","v":""},{"$f":"getProgress(BW49,DG49,,,1,WpAreaC_Sub1_exist)","v":""},{"$f":"getProgress(BX49,DH49,\"%\",1,1,WpAreaC_Sub2_exist)","v":""},{"$f":"getProgress(BY49,DI49,,,1,WpAreaC_Sub2_exist)","v":""},{"$f":"getProgress(BZ49,DJ49,,,1,WpAreaC_Sub2_exist)","v":""},{"$f":"getProgress(CA49,DK49,\"%\",1,1,WpAreaC_Sub3_exist)","v":""},{"$f":"getProgress(CB49,DL49,,,1,WpAreaC_Sub3_exist)","v":""},{"$f":"getProgress(CC49,DM49,,,1,WpAreaC_Sub3_exist)","v":""},null,null,null,null,null,null,null,null,null,null,null,null,null,{"$f":"IFERROR((IF(WpAreaA_exist,IF(BA49<>\"\",BA49*WP!$AB$9,0)+IF(BD49<>\"\",BD49*WP!$AC$9,0)+IF(BG49<>\"\",BG49*WP!$AD$9,0),0)+IF(WpAreaB_exist,IF(BK49<>\"\",BK49*WP!$AE$10)+IF(BN49<>\"\",BN49*WP!$AF$10,0)+IF(BQ49<>\"\",BQ49*WP!$AG$10,0),0)+IF(WpAreaC_exist,IF(BU49<>\"\",BU49*WP!$AH$10)+IF(BX49<>\"\",BX49*WP!$AI$10,0)+IF(CA49<>\"\",CA49*WP!$AJ$10,0),0))/(IF(WpAreaA_exist,IF(BA49<>\"\",WP!$AB$9,0)+IF(BD49<>\"\",WP!$AC$9,0)+IF(BG49<>\"\",WP!$AD$9,0),0)+IF(WpAreaB_exist,IF(BK49<>\"\",WP!$AE$10,0)+IF(BN49<>\"\",WP!$AF$10,0)+IF(BQ49<>\"\",WP!$AG$10,0),0)+IF(WpAreaC_exist,IF(BU49<>\"\",WP!$AH$10,0)+IF(BX49<>\"\",WP!$AI$10,0)+IF(CA49<>\"\",WP!$AJ$10,0),0)),\"\")","v":0},{"$f":"IFERROR(IF(SUMPRODUCT(--(INDIRECT(\"WP!$C$\"&$DO49&\":$C$\"&$DP49)=$C49),--(INDIRECT(\"WP!$B$\"&$DO49&\":$B$\"&$DP49)=\"Y\"),--(INDIRECT(\"WP!$\"&$AX$41&\"$\"&$DO49&\":$\"&$AX$41&\"$\"&$DP49)=1),--(INDIRECT(\"WP!$K$\"&$DO49&\":$K$\"&$DP49)>0))<>0,SUMPRODUCT(--(INDIRECT(\"WP!$C$\"&$DO49&\":$C$\"&$DP49)=$C49),--(INDIRECT(\"WP!$B$\"&$DO49&\":$B$\"&$DP49)=\"Y\"),--(INDIRECT(\"WP!$\"&$AX$41&\"$\"&$DO49&\":$\"&$AX$41&\"$\"&$DP49)=1),INDIRECT(\"WP!$K$\"&$DO49&\":$K$\"&$DP49)),IF(AZ49<>\"\",0,\"\")),\"\")","v":0},{"$f":"IFERROR(IF(SUMPRODUCT(--(INDIRECT(\"WP!$C$\"&$DO49&\":$C$\"&$DP49)=$C49),--(INDIRECT(\"WP!$B\"&$DO49&\":$B\"&$DP49)=\"Y\"),--(INDIRECT(\"WP!$\"&$AX$41&\"$\"&$DO49&\":$\"&$AX$41&\"$\"&$DP49)<>\"\"),--(INDIRECT(\"WP!$K\"&$DO49&\":$K\"&$DP49)>0))<>0,SUMPRODUCT(--(INDIRECT(\"WP!$C$\"&$DO49&\":$C$\"&$DP49)=$C49),--(INDIRECT(\"WP!$B\"&$DO49&\":$B\"&$DP49)=\"Y\"),--(INDIRECT(\"WP!$\"&$AX$41&\"$\"&$DO49&\":$\"&$AX$41&\"$\"&$DP49)<>\"\"),INDIRECT(\"WP!$K\"&$DO49&\":$K\"&$DP49)),\"\"),\"\")","v":7},{"$f":"IFERROR(IF(WpAreaA_Sub1_exist,IF(SUMPRODUCT(--(INDIRECT(\"WP!$C$\"&$DO49&\":$C$\"&$DP49)=$C49),--(INDIRECT(\"WP!$\"&$BA$41&\"$\"&$DO49&\":$\"&$BA$41&\"$\"&$DP49)<>\"\"),--(INDIRECT(\"WP!$K$\"&$DO49&\":$K$\"&$DP49)>0))>0,SUMPRODUCT(--(INDIRECT(\"WP!$C$\"&$DO49&\":$C$\"&$DP49)=$C49),--(INDIRECT(\"WP!$\"&$BA$41&\"$\"&$DO49&\":$\"&$BA$41&\"$\"&$DP49)<>\"\"),INDIRECT(\"WP!$K$\"&$DO49&\":$K$\"&$DP49),INDIRECT(\"WP!$\"&$BA$41&\"$\"&$DO49&\":$\"&$BA$41&\"$\"&$DP49))/SUMPRODUCT(--(INDIRECT(\"WP!$C$\"&$DO49&\":$C$\"&$DP49)=$C49),--(INDIRECT(\"WP!$\"&$BA$41&\"$\"&$DO49&\":$\"&$BA$41&\"$\"&$DP49)<>\"\"),INDIRECT(\"WP!$K$\"&$DO49&\":$K$\"&$DP49)),\"\"),\"\"),\"\")","v":0},{"$f":"IFERROR(IF(WpAreaA_Sub1_exist,IF(SUMPRODUCT(--(INDIRECT(\"WP!$C$\"&$DO49&\":$C$\"&$DP49)=$C49),--(INDIRECT(\"WP!$B$\"&$DO49&\":$B$\"&$DP49)=\"Y\"),--(INDIRECT(\"WP!$\"&$BA$41&\"$\"&$DO49&\":$\"&$BA$41&\"$\"&$DP49)=1),--(INDIRECT(\"WP!$K$\"&$DO49&\":$K$\"&$DP49)>0))<>0,SUMPRODUCT(--(INDIRECT(\"WP!$C$\"&$DO49&\":$C$\"&$DP49)=$C49),--(INDIRECT(\"WP!$B$\"&$DO49&\":$B$\"&$DP49)=\"Y\"),--(INDIRECT(\"WP!$\"&$BA$41&\"$\"&$DO49&\":$\"&$BA$41&\"$\"&$DP49)=1),INDIRECT(\"WP!$K$\"&$DO49&\":$K$\"&$DP49)),IF(BC49<>\"\",0,\"\")),\"\"),\"\")","v":0},{"$f":"IFERROR(IF(WpAreaA_Sub1_exist,IF(SUMPRODUCT(--(INDIRECT(\"WP!$C$\"&$DO49&\":$C$\"&$DP49)=$C49),--(INDIRECT(\"WP!$B\"&$DO49&\":$B\"&$DP49)=\"Y\"),--(INDIRECT(\"WP!$\"&$BA$41&\"$\"&$DO49&\":$\"&$BA$41&\"$\"&$DP49)<>\"\"),--(INDIRECT(\"WP!$K\"&$DO49&\":$K\"&$DP49)>0))<>0,SUMPRODUCT(--(INDIRECT(\"WP!$C$\"&$DO49&\":$C$\"&$DP49)=$C49),--(INDIRECT(\"WP!$B\"&$DO49&\":$B\"&$DP49)=\"Y\"),--(INDIRECT(\"WP!$\"&$BA$41&\"$\"&$DO49&\":$\"&$BA$41&\"$\"&$DP49)<>\"\"),INDIRECT(\"WP!$K\"&$DO49&\":$K\"&$DP49)),\"\"),\"\"),\"\")","v":7},{"$f":"IFERROR(IF(WpAreaA_Sub2_exist,IF(SUMPRODUCT(--(INDIRECT(\"WP!$C$\"&$DO49&\":$C$\"&$DP49)=$C49),--(INDIRECT(\"WP!$\"&$BD$41&\"$\"&$DO49&\":$\"&$BD$41&\"$\"&$DP49)<>\"\"),--(INDIRECT(\"WP!$K$\"&$DO49&\":$K$\"&$DP49)>0))>0,SUMPRODUCT(--(INDIRECT(\"WP!$C$\"&$DO49&\":$C$\"&$DP49)=$C49),--(INDIRECT(\"WP!$\"&$BD$41&\"$\"&$DO49&\":$\"&$BD$41&\"$\"&$DP49)<>\"\"),INDIRECT(\"WP!$K\"&$DO49&\":$K\"&$DP49),INDIRECT(\"WP!$\"&$BD$41&\"$\"&$DO49&\":$\"&$BD$41&\"$\"&$DP49))/SUMPRODUCT(--(INDIRECT(\"WP!$C$\"&$DO49&\":$C$\"&$DP49)=$C49),--(INDIRECT(\"WP!$\"&$BD$41&\"$\"&$DO49&\":$\"&$BD$41&\"$\"&$DP49)<>\"\"),INDIRECT(\"WP!$K\"&$DO49&\":$K\"&$DP49)),\"\"),\"\"),\"\")","v":""},{"$f":"IFERROR(IF(WpAreaA_Sub2_exist,IF(SUMPRODUCT(--(INDIRECT(\"WP!$C$\"&$DO49&\":$C$\"&$DP49)=$C49),--(INDIRECT(\"WP!$B\"&$DO49&\":$B\"&$DP49)=\"Y\"),--(INDIRECT(\"WP!$\"&$BD$41&\"$\"&$DO49&\":$\"&$BD$41&\"$\"&$DP49)=1),--(INDIRECT(\"WP!$K\"&$DO49&\":$K\"&$DP49)>0))<>0,SUMPRODUCT(--(INDIRECT(\"WP!$C$\"&$DO49&\":$C$\"&$DP49)=$C49),--(INDIRECT(\"WP!$B\"&$DO49&\":$B\"&$DP49)=\"Y\"),--(INDIRECT(\"WP!$\"&$BD$41&\"$\"&$DO49&\":$\"&$BD$41&\"$\"&$DP49)=1),INDIRECT(\"WP!$K\"&$DO49&\":$K\"&$DP49)),IF(BF49<>\"\",0,\"\")),\"\"),\"\")","v":""},{"$f":"IFERROR(IF(WpAreaA_Sub2_exist,IF(SUMPRODUCT(--(INDIRECT(\"WP!$C$\"&$DO49&\":$C$\"&$DP49)=$C49),--(INDIRECT(\"WP!$B\"&$DO49&\":$B\"&$DP49)=\"Y\"),--(INDIRECT(\"WP!$\"&$BD$41&\"$\"&$DO49&\":$\"&$BD$41&\"$\"&$DP49)<>\"\"),--(INDIRECT(\"WP!$K\"&$DO49&\":$K\"&$DP49)>0))<>0,SUMPRODUCT(--(INDIRECT(\"WP!$C$\"&$DO49&\":$C$\"&$DP49)=$C49),--(INDIRECT(\"WP!$B\"&$DO49&\":$B\"&$DP49)=\"Y\"),--(INDIRECT(\"WP!$\"&$BD$41&\"$\"&$DO49&\":$\"&$BD$41&\"$\"&$DP49)<>\"\"),INDIRECT(\"WP!$K\"&$DO49&\":$K\"&$DP49)),\"\"),\"\"),\"\")","v":""},{"$f":"IFERROR(IF(WpAreaA_Sub3_exist,IF(SUMPRODUCT(--(INDIRECT(\"WP!$C$\"&$DO49&\":$C$\"&$DP49)=$C49),--(INDIRECT(\"WP!$\"&$BG$41&\"$\"&$DO49&\":$\"&$BG$41&\"$\"&$DP49)<>\"\"),--(INDIRECT(\"WP!$K$\"&$DO49&\":$K$\"&$DP49)>0))>0,SUMPRODUCT(--(INDIRECT(\"WP!$C$\"&$DO49&\":$C$\"&$DP49)=$C49),--(INDIRECT(\"WP!$\"&$BG$41&\"$\"&$DO49&\":$\"&$BG$41&\"$\"&$DP49)<>\"\"),INDIRECT(\"WP!$K\"&$DO49&\":$K\"&$DP49),INDIRECT(\"WP!$\"&$BG$41&\"$\"&$DO49&\":$\"&$BG$41&\"$\"&$DP49))/SUMPRODUCT(--(INDIRECT(\"WP!$C$\"&$DO49&\":$C$\"&$DP49)=$C49),--(INDIRECT(\"WP!$\"&$BG$41&\"$\"&$DO49&\":$\"&$BG$41&\"$\"&$DP49)<>\"\"),INDIRECT(\"WP!$K\"&$DO49&\":$K\"&$DP49)),\"\"),\"\"),\"\")","v":""},{"$f":"IFERROR(IF(WpAreaA_Sub3_exist,IF(SUMPRODUCT(--(INDIRECT(\"WP!$C$\"&$DO49&\":$C$\"&$DP49)=$C49),--(INDIRECT(\"WP!$B\"&$DO49&\":$B\"&$DP49)=\"Y\"),--(INDIRECT(\"WP!$\"&$BG$41&\"$\"&$DO49&\":$\"&$BG$41&\"$\"&$DP49)=1),--(INDIRECT(\"WP!$K\"&$DO49&\":$K\"&$DP49)>0))<>0,SUMPRODUCT(--(INDIRECT(\"WP!$C$\"&$DO49&\":$C$\"&$DP49)=$C49),--(INDIRECT(\"WP!$B\"&$DO49&\":$B\"&$DP49)=\"Y\"),--(INDIRECT(\"WP!$\"&$BG$41&\"$\"&$DO49&\":$\"&$BG$41&\"$\"&$DP49)=1),INDIRECT(\"WP!$K\"&$DO49&\":$K\"&$DP49)),IF(BI49<>\"\",0,\"\")),\"\"),\"\")","v":""},{"$f":"IFERROR(IF(WpAreaA_Sub3_exist,IF(SUMPRODUCT(--(INDIRECT(\"WP!$C$\"&$DO49&\":$C$\"&$DP49)=$C49),--(INDIRECT(\"WP!$B\"&$DO49&\":$B\"&$DP49)=\"Y\"),--(INDIRECT(\"WP!$\"&$BG$41&\"$\"&$DO49&\":$\"&$BG$41&\"$\"&$DP49)<>\"\"),--(INDIRECT(\"WP!$K\"&$DO49&\":$K\"&$DP49)>0))<>0,SUMPRODUCT(--(INDIRECT(\"WP!$C$\"&$DO49&\":$C$\"&$DP49)=$C49),--(INDIRECT(\"WP!$B\"&$DO49&\":$B\"&$DP49)=\"Y\"),--(INDIRECT(\"WP!$\"&$BG$41&\"$\"&$DO49&\":$\"&$BG$41&\"$\"&$DP49)<>\"\"),INDIRECT(\"WP!$K\"&$DO49&\":$K\"&$DP49)),\"\"),\"\"),\"\")","v":""},null,{"$f":"IFERROR(IF(WpAreaB_Sub1_exist,IF(SUMPRODUCT(--(INDIRECT(\"WP!$C$\"&$DO49&\":$C$\"&$DP49)=$C49),--(INDIRECT(\"WP!$\"&$BK$41&\"$\"&$DO49&\":$\"&$BK$41&\"$\"&$DP49)<>\"\"),--(INDIRECT(\"WP!$K$\"&$DO49&\":$K$\"&$DP49)>0))>0,SUMPRODUCT(--(INDIRECT(\"WP!$C$\"&$DO49&\":$C$\"&$DP49)=$C49),--(INDIRECT(\"WP!$\"&$BK$41&\"$\"&$DO49&\":$\"&$BK$41&\"$\"&$DP49)<>\"\"),INDIRECT(\"WP!$K\"&$DO49&\":$K\"&$DP49),INDIRECT(\"WP!$\"&$BK$41&\"$\"&$DO49&\":$\"&$BK$41&\"$\"&$DP49))/SUMPRODUCT(--(INDIRECT(\"WP!$C$\"&$DO49&\":$C$\"&$DP49)=$C49),--(INDIRECT(\"WP!$\"&$BK$41&\"$\"&$DO49&\":$\"&$BK$41&\"$\"&$DP49)<>\"\"),INDIRECT(\"WP!$K\"&$DO49&\":$K\"&$DP49)),\"\"),\"\"),\"\")","v":""},{"$f":"IFERROR(IF(WpAreaB_Sub1_exist,IF(SUMPRODUCT(--(INDIRECT(\"WP!$C$\"&$DO49&\":$C$\"&$DP49)=$C49),--(INDIRECT(\"WP!$B\"&$DO49&\":$B\"&$DP49)=\"Y\"),--(INDIRECT(\"WP!$\"&$BK$41&\"$\"&$DO49&\":$\"&$BK$41&\"$\"&$DP49)=1),--(INDIRECT(\"WP!$K\"&$DO49&\":$K\"&$DP49)>0))<>0,SUMPRODUCT(--(INDIRECT(\"WP!$C$\"&$DO49&\":$C$\"&$DP49)=$C49),--(INDIRECT(\"WP!$B\"&$DO49&\":$B\"&$DP49)=\"Y\"),--(INDIRECT(\"WP!$\"&$BK$41&\"$\"&$DO49&\":$\"&$BK$41&\"$\"&$DP49)=1),INDIRECT(\"WP!$K\"&$DO49&\":$K\"&$DP49)),IF(BM49<>\"\",0,\"\")),\"\"),\"\")","v":""},{"$f":"IFERROR(IF(WpAreaB_Sub1_exist,IF(SUMPRODUCT(--(INDIRECT(\"WP!$C$\"&$DO49&\":$C$\"&$DP49)=$C49),--(INDIRECT(\"WP!$B\"&$DO49&\":$B\"&$DP49)=\"Y\"),--(INDIRECT(\"WP!$\"&$BK$41&\"$\"&$DO49&\":$\"&$BK$41&\"$\"&$DP49)<>\"\"),--(INDIRECT(\"WP!$K\"&$DO49&\":$K\"&$DP49)>0))<>0,SUMPRODUCT(--(INDIRECT(\"WP!$C$\"&$DO49&\":$C$\"&$DP49)=$C49),--(INDIRECT(\"WP!$B\"&$DO49&\":$B\"&$DP49)=\"Y\"),--(INDIRECT(\"WP!$\"&$BK$41&\"$\"&$DO49&\":$\"&$BK$41&\"$\"&$DP49)<>\"\"),INDIRECT(\"WP!$K\"&$DO49&\":$K\"&$DP49)),\"\"),\"\"),\"\")","v":""},{"$f":"IFERROR(IF(WpAreaB_Sub2_exist,IF(SUMPRODUCT(--(INDIRECT(\"WP!$C$\"&$DO49&\":$C$\"&$DP49)=$C49),--(INDIRECT(\"WP!$\"&$BN$41&\"$\"&$DO49&\":$\"&$BN$41&\"$\"&$DP49)<>\"\"),--(INDIRECT(\"WP!$K$\"&$DO49&\":$K$\"&$DP49)>0))>0,SUMPRODUCT(--(INDIRECT(\"WP!$C$\"&$DO49&\":$C$\"&$DP49)=$C49),--(INDIRECT(\"WP!$\"&$BN$41&\"$\"&$DO49&\":$\"&$BN$41&\"$\"&$DP49)<>\"\"),INDIRECT(\"WP!$K\"&$DO49&\":$K\"&$DP49),INDIRECT(\"WP!$\"&$BN$41&\"$\"&$DO49&\":$\"&$BN$41&\"$\"&$DP49))/SUMPRODUCT(--(INDIRECT(\"WP!$C$\"&$DO49&\":$C$\"&$DP49)=$C49),--(INDIRECT(\"WP!$\"&$BN$41&\"$\"&$DO49&\":$\"&$BN$41&\"$\"&$DP49)<>\"\"),INDIRECT(\"WP!$K\"&$DO49&\":$K\"&$DP49)),\"\"),\"\"),\"\")","v":""},{"$f":"IFERROR(IF(WpAreaB_Sub2_exist,IF(SUMPRODUCT(--(INDIRECT(\"WP!$C$\"&$DO49&\":$C$\"&$DP49)=$C49),--(INDIRECT(\"WP!$B\"&$DO49&\":$B\"&$DP49)=\"Y\"),--(INDIRECT(\"WP!$\"&$BN$41&\"$\"&$DO49&\":$\"&$BN$41&\"$\"&$DP49)=1),--(INDIRECT(\"WP!$K\"&$DO49&\":$K\"&$DP49)>0))<>0,SUMPRODUCT(--(INDIRECT(\"WP!$C$\"&$DO49&\":$C$\"&$DP49)=$C49),--(INDIRECT(\"WP!$B\"&$DO49&\":$B\"&$DP49)=\"Y\"),--(INDIRECT(\"WP!$\"&$BN$41&\"$\"&$DO49&\":$\"&$BN$41&\"$\"&$DP49)=1),INDIRECT(\"WP!$K\"&$DO49&\":$K\"&$DP49)),IF(BP49<>\"\",0,\"\")),\"\"),\"\")","v":""},{"$f":"IFERROR(IF(WpAreaB_Sub2_exist,IF(SUMPRODUCT(--(INDIRECT(\"WP!$C$\"&$DO49&\":$C$\"&$DP49)=$C49),--(INDIRECT(\"WP!$B\"&$DO49&\":$B\"&$DP49)=\"Y\"),--(INDIRECT(\"WP!$\"&$BN$41&\"$\"&$DO49&\":$\"&$BN$41&\"$\"&$DP49)<>\"\"),--(INDIRECT(\"WP!$K\"&$DO49&\":$K\"&$DP49)>0))<>0,SUMPRODUCT(--(INDIRECT(\"WP!$C$\"&$DO49&\":$C$\"&$DP49)=$C49),--(INDIRECT(\"WP!$B\"&$DO49&\":$B\"&$DP49)=\"Y\"),--(INDIRECT(\"WP!$\"&$BN$41&\"$\"&$DO49&\":$\"&$BN$41&\"$\"&$DP49)<>\"\"),INDIRECT(\"WP!$K\"&$DO49&\":$K\"&$DP49)),\"\"),\"\"),\"\")","v":""},{"$f":"IFERROR(IF(WpAreaB_Sub3_exist,IF(SUMPRODUCT(--(INDIRECT(\"WP!$C$\"&$DO49&\":$C$\"&$DP49)=$C49),--(INDIRECT(\"WP!$\"&$BQ$41&\"$\"&$DO49&\":$\"&$BQ$41&\"$\"&$DP49)<>\"\"),--(INDIRECT(\"WP!$K$\"&$DO49&\":$K$\"&$DP49)>0))>0,SUMPRODUCT(--(INDIRECT(\"WP!$C$\"&$DO49&\":$C$\"&$DP49)=$C49),--(INDIRECT(\"WP!$\"&$BQ$41&\"$\"&$DO49&\":$\"&$BQ$41&\"$\"&$DP49)<>\"\"),INDIRECT(\"WP!$K\"&$DO49&\":$K\"&$DP49),INDIRECT(\"WP!$\"&$BQ$41&\"$\"&$DO49&\":$\"&$BQ$41&\"$\"&$DP49))/SUMPRODUCT(--(INDIRECT(\"WP!$C$\"&$DO49&\":$C$\"&$DP49)=$C49),--(INDIRECT(\"WP!$\"&$BQ$41&\"$\"&$DO49&\":$\"&$BQ$41&\"$\"&$DP49)<>\"\"),INDIRECT(\"WP!$K\"&$DO49&\":$K\"&$DP49)),\"\"),\"\"),\"\")","v":""},{"$f":"IFERROR(IF(WpAreaB_Sub3_exist,IF(SUMPRODUCT(--(INDIRECT(\"WP!$C$\"&$DO49&\":$C$\"&$DP49)=$C49),--(INDIRECT(\"WP!$B\"&$DO49&\":$B\"&$DP49)=\"Y\"),--(INDIRECT(\"WP!$\"&$BQ$41&\"$\"&$DO49&\":$\"&$BQ$41&\"$\"&$DP49)=1),--(INDIRECT(\"WP!$K\"&$DO49&\":$K\"&$DP49)>0))<>0,SUMPRODUCT(--(INDIRECT(\"WP!$C$\"&$DO49&\":$C$\"&$DP49)=$C49),--(INDIRECT(\"WP!$B\"&$DO49&\":$B\"&$DP49)=\"Y\"),--(INDIRECT(\"WP!$\"&$BQ$41&\"$\"&$DO49&\":$\"&$BQ$41&\"$\"&$DP49)=1),INDIRECT(\"WP!$K\"&$DO49&\":$K\"&$DP49)),IF(BS49<>\"\",0,\"\")),\"\"),\"\")","v":""},{"$f":"IFERROR(IF(WpAreaB_Sub3_exist,IF(SUMPRODUCT(--(INDIRECT(\"WP!$C$\"&$DO49&\":$C$\"&$DP49)=$C49),--(INDIRECT(\"WP!$B\"&$DO49&\":$B\"&$DP49)=\"Y\"),--(INDIRECT(\"WP!$\"&$BQ$41&\"$\"&$DO49&\":$\"&$BQ$41&\"$\"&$DP49)<>\"\"),--(INDIRECT(\"WP!$K\"&$DO49&\":$K\"&$DP49)>0))<>0,SUMPRODUCT(--(INDIRECT(\"WP!$C$\"&$DO49&\":$C$\"&$DP49)=$C49),--(INDIRECT(\"WP!$B\"&$DO49&\":$B\"&$DP49)=\"Y\"),--(INDIRECT(\"WP!$\"&$BQ$41&\"$\"&$DO49&\":$\"&$BQ$41&\"$\"&$DP49)<>\"\"),INDIRECT(\"WP!$K\"&$DO49&\":$K\"&$DP49)),\"\"),\"\"),\"\")","v":""},null,{"$f":"IFERROR(IF(WpAreaC_Sub1_exist,IF(SUMPRODUCT(--(INDIRECT(\"WP!$C$\"&$DO49&\":$C$\"&$DP49)=$C49),--(INDIRECT(\"WP!$\"&$BU$41&\"$\"&$DO49&\":$\"&$BU$41&\"$\"&$DP49)<>\"\"),--(INDIRECT(\"WP!$K$\"&$DO49&\":$K$\"&$DP49)>0))>0,SUMPRODUCT(--(INDIRECT(\"WP!$C$\"&$DO49&\":$C$\"&$DP49)=$C49),--(INDIRECT(\"WP!$\"&$BU$41&\"$\"&$DO49&\":$\"&$BU$41&\"$\"&$DP49)<>\"\"),INDIRECT(\"WP!$K\"&$DO49&\":$K\"&$DP49),INDIRECT(\"WP!$\"&$BU$41&\"$\"&$DO49&\":$\"&$BU$41&\"$\"&$DP49))/SUMPRODUCT(--(INDIRECT(\"WP!$C$\"&$DO49&\":$C$\"&$DP49)=$C49),--(INDIRECT(\"WP!$\"&$BU$41&\"$\"&$DO49&\":$\"&$BU$41&\"$\"&$DP49)<>\"\"),INDIRECT(\"WP!$K\"&$DO49&\":$K\"&$DP49)),\"\"),\"\"),\"\")","v":""},{"$f":"IFERROR(IF(WpAreaC_Sub1_exist,IF(SUMPRODUCT(--(INDIRECT(\"WP!$C$\"&$DO49&\":$C$\"&$DP49)=$C49),--(INDIRECT(\"WP!$B\"&$DO49&\":$B\"&$DP49)=\"Y\"),--(INDIRECT(\"WP!$\"&$BU$41&\"$\"&$DO49&\":$\"&$BU$41&\"$\"&$DP49)=1),--(INDIRECT(\"WP!$K\"&$DO49&\":$K\"&$DP49)>0))<>0,SUMPRODUCT(--(INDIRECT(\"WP!$C$\"&$DO49&\":$C$\"&$DP49)=$C49),--(INDIRECT(\"WP!$B\"&$DO49&\":$B\"&$DP49)=\"Y\"),--(INDIRECT(\"WP!$\"&$BU$41&\"$\"&$DO49&\":$\"&$BU$41&\"$\"&$DP49)=1),INDIRECT(\"WP!$K\"&$DO49&\":$K\"&$DP49)),IF(BW49<>\"\",0,\"\")),\"\"),\"\")","v":""},{"$f":"IFERROR(IF(WpAreaC_Sub1_exist,IF(SUMPRODUCT(--(INDIRECT(\"WP!$C$\"&$DO49&\":$C$\"&$DP49)=$C49),--(INDIRECT(\"WP!$B\"&$DO49&\":$B\"&$DP49)=\"Y\"),--(INDIRECT(\"WP!$\"&$BU$41&\"$\"&$DO49&\":$\"&$BU$41&\"$\"&$DP49)<>\"\"),--(INDIRECT(\"WP!$K\"&$DO49&\":$K\"&$DP49)>0))<>0,SUMPRODUCT(--(INDIRECT(\"WP!$C$\"&$DO49&\":$C$\"&$DP49)=$C49),--(INDIRECT(\"WP!$B\"&$DO49&\":$B\"&$DP49)=\"Y\"),--(INDIRECT(\"WP!$\"&$BU$41&\"$\"&$DO49&\":$\"&$BU$41&\"$\"&$DP49)<>\"\"),INDIRECT(\"WP!$K\"&$DO49&\":$K\"&$DP49)),\"\"),\"\"),\"\")","v":""},{"$f":"IFERROR(IF(WpAreaC_Sub2_exist,IF(SUMPRODUCT(--(INDIRECT(\"WP!$C$\"&$DO49&\":$C$\"&$DP49)=$C49),--(INDIRECT(\"WP!$\"&$BX$41&\"$\"&$DO49&\":$\"&$BX$41&\"$\"&$DP49)<>\"\"),--(INDIRECT(\"WP!$K$\"&$DO49&\":$K$\"&$DP49)>0))>0,SUMPRODUCT(--(INDIRECT(\"WP!$C$\"&$DO49&\":$C$\"&$DP49)=$C49),--(INDIRECT(\"WP!$\"&$BX$41&\"$\"&$DO49&\":$\"&$BX$41&\"$\"&$DP49)<>\"\"),INDIRECT(\"WP!$K\"&$DO49&\":$K\"&$DP49),INDIRECT(\"WP!$\"&$BX$41&\"$\"&$DO49&\":$\"&$BX$41&\"$\"&$DP49))/SUMPRODUCT(--(INDIRECT(\"WP!$C$\"&$DO49&\":$C$\"&$DP49)=$C49),--(INDIRECT(\"WP!$\"&$BX$41&\"$\"&$DO49&\":$\"&$BX$41&\"$\"&$DP49)<>\"\"),INDIRECT(\"WP!$K\"&$DO49&\":$K\"&$DP49)),\"\"),\"\"),\"\")","v":""},{"$f":"IFERROR(IF(WpAreaC_Sub2_exist,IF(SUMPRODUCT(--(INDIRECT(\"WP!$C$\"&$DO49&\":$C$\"&$DP49)=$C49),--(INDIRECT(\"WP!$B\"&$DO49&\":$B\"&$DP49)=\"Y\"),--(INDIRECT(\"WP!$\"&$BX$41&\"$\"&$DO49&\":$\"&$BX$41&\"$\"&$DP49)=1),--(INDIRECT(\"WP!$K\"&$DO49&\":$K\"&$DP49)>0))<>0,SUMPRODUCT(--(INDIRECT(\"WP!$C$\"&$DO49&\":$C$\"&$DP49)=$C49),--(INDIRECT(\"WP!$B\"&$DO49&\":$B\"&$DP49)=\"Y\"),--(INDIRECT(\"WP!$\"&$BX$41&\"$\"&$DO49&\":$\"&$BX$41&\"$\"&$DP49)=1),INDIRECT(\"WP!$K\"&$DO49&\":$K\"&$DP49)),IF(BZ49<>\"\",0,\"\")),\"\"),\"\")","v":""},{"$f":"IFERROR(IF(WpAreaC_Sub2_exist,IF(SUMPRODUCT(--(INDIRECT(\"WP!$C$\"&$DO49&\":$C$\"&$DP49)=$C49),--(INDIRECT(\"WP!$B\"&$DO49&\":$B\"&$DP49)=\"Y\"),--(INDIRECT(\"WP!$\"&$BX$41&\"$\"&$DO49&\":$\"&$BX$41&\"$\"&$DP49)<>\"\"),--(INDIRECT(\"WP!$K\"&$DO49&\":$K\"&$DP49)>0))<>0,SUMPRODUCT(--(INDIRECT(\"WP!$C$\"&$DO49&\":$C$\"&$DP49)=$C49),--(INDIRECT(\"WP!$B\"&$DO49&\":$B\"&$DP49)=\"Y\"),--(INDIRECT(\"WP!$\"&$BX$41&\"$\"&$DO49&\":$\"&$BX$41&\"$\"&$DP49)<>\"\"),INDIRECT(\"WP!$K\"&$DO49&\":$K\"&$DP49)),\"\"),\"\"),\"\")","v":""},{"$f":"IFERROR(IF(WpAreaC_Sub3_exist,IF(SUMPRODUCT(--(INDIRECT(\"WP!$C$\"&$DO49&\":$C$\"&$DP49)=$C49),--(INDIRECT(\"WP!$\"&$CA$41&\"$\"&$DO49&\":$\"&$CA$41&\"$\"&$DP49)<>\"\"),--(INDIRECT(\"WP!$K$\"&$DO49&\":$K$\"&$DP49)>0))>0,SUMPRODUCT(--(INDIRECT(\"WP!$C$\"&$DO49&\":$C$\"&$DP49)=$C49),--(INDIRECT(\"WP!$\"&$CA$41&\"$\"&$DO49&\":$\"&$CA$41&\"$\"&$DP49)<>\"\"),INDIRECT(\"WP!$K\"&$DO49&\":$K\"&$DP49),INDIRECT(\"WP!$\"&$CA$41&\"$\"&$DO49&\":$\"&$CA$41&\"$\"&$DP49))/SUMPRODUCT(--(INDIRECT(\"WP!$C$\"&$DO49&\":$C$\"&$DP49)=$C49),--(INDIRECT(\"WP!$\"&$CA$41&\"$\"&$DO49&\":$\"&$CA$41&\"$\"&$DP49)<>\"\"),INDIRECT(\"WP!$K\"&$DO49&\":$K\"&$DP49)),\"\"),\"\"),\"\")","v":""},{"$f":"IFERROR(IF(WpAreaC_Sub3_exist,IF(SUMPRODUCT(--(INDIRECT(\"WP!$C$\"&$DO49&\":$C$\"&$DP49)=$C49),--(INDIRECT(\"WP!$B\"&$DO49&\":$B\"&$DP49)=\"Y\"),--(INDIRECT(\"WP!$\"&$CA$41&\"$\"&$DO49&\":$\"&$CA$41&\"$\"&$DP49)=1),--(INDIRECT(\"WP!$K\"&$DO49&\":$K\"&$DP49)>0))<>0,SUMPRODUCT(--(INDIRECT(\"WP!$C$\"&$DO49&\":$C$\"&$DP49)=$C49),--(INDIRECT(\"WP!$B\"&$DO49&\":$B\"&$DP49)=\"Y\"),--(INDIRECT(\"WP!$\"&$CA$41&\"$\"&$DO49&\":$\"&$CA$41&\"$\"&$DP49)=1),INDIRECT(\"WP!$K\"&$DO49&\":$K\"&$DP49)),IF(CC49<>\"\",0,\"\")),\"\"),\"\")","v":""},{"$f":"IFERROR(IF(WpAreaC_Sub3_exist,IF(SUMPRODUCT(--(INDIRECT(\"WP!$C$\"&$DO49&\":$C$\"&$DP49)=$C49),--(INDIRECT(\"WP!$B\"&$DO49&\":$B\"&$DP49)=\"Y\"),--(INDIRECT(\"WP!$\"&$CA$41&\"$\"&$DO49&\":$\"&$CA$41&\"$\"&$DP49)<>\"\"),--(INDIRECT(\"WP!$K\"&$DO49&\":$K\"&$DP49)>0))<>0,SUMPRODUCT(--(INDIRECT(\"WP!$C$\"&$DO49&\":$C$\"&$DP49)=$C49),--(INDIRECT(\"WP!$B\"&$DO49&\":$B\"&$DP49)=\"Y\"),--(INDIRECT(\"WP!$\"&$CA$41&\"$\"&$DO49&\":$\"&$CA$41&\"$\"&$DP49)<>\"\"),INDIRECT(\"WP!$K\"&$DO49&\":$K\"&$DP49)),\"\"),\"\"),\"\")","v":""},null,null,null,null,"","","","","","","","","","","","",null,"","","","","","","","","",null,"","","","","","","","","",null,{"$f":"MIN(IF(WP!$C$12:$C$79=$C49,ROW(WP!$C$12:$C$79),\"\"))","v":33},{"$f":"MAX(IF(WP!$C$12:$C$79=$C49,ROW(WP!$C$12:$C$79),\"\"))","v":60}]
[null,"Test Tolerances analysis RRM test cases","36.903",{"$f":"getProgress(AX50,CH50,\"%\",1,1)","v":""},{"$f":"getProgress(AY50,CI50,,,1)","v":""},{"$f":"getProgress(AZ50,CJ50,,,1)","v":""},null,{"$f":"getProgress(BA50,CK50,\"%\",1,1,WpAreaA_Sub1_exist)","v":""},{"$f":"getProgress(BB50,CL50,,,1,WpAreaA_Sub1_exist)","v":""},{"$f":"getProgress(BC50,CM50,,,1,WpAreaA_Sub1_exist)","v":""},{"$f":"getProgress(BD50,CN50,\"%\",1,1,WpAreaA_Sub2_exist)","v":""},{"$f":"getProgress(BE50,CO50,,,1,WpAreaA_Sub2_exist)","v":""},{"$f":"getProgress(BF50,CP50,,,1,WpAreaA_Sub2_exist)","v":""},{"$f":"getProgress(BG50,CQ50,\"%\",1,1,WpAreaA_Sub3_exist)","v":""},{"$f":"getProgress(BH50,CR50,,,1,WpAreaA_Sub3_exist)","v":""},{"$f":"getProgress(BI50,CS50,,,1,WpAreaA_Sub3_exist)","v":""},null,{"$f":"getProgress(BK50,CU50,\"%\",1,1,WpAreaB_Sub1_exist)","v":""},{"$f":"getProgress(BL50,CV50,,,1,WpAreaB_Sub1_exist)","v":""},{"$f":"getProgress(BM50,CW50,,,1,WpAreaB_Sub1_exist)","v":""},{"$f":"getProgress(BN50,CX50,\"%\",1,1,WpAreaB_Sub2_exist)","v":""},{"$f":"getProgress(BO50,CY50,,,1,WpAreaB_Sub2_exist)","v":""},{"$f":"getProgress(BP50,CZ50,,,1,WpAreaB_Sub2_exist)","v":""},{"$f":"getProgress(BQ50,DA50,\"%\",1,1,WpAreaB_Sub3_exist)","v":""},{"$f":"getProgress(BR50,DB50,,,1,WpAreaB_Sub3_exist)","v":""},{"$f":"getProgress(BS50,DC50,,,1,WpAreaB_Sub3_exist)","v":""},null,{"$f":"getProgress(BU50,DE50,\"%\",1,1,WpAreaC_Sub1_exist)","v":""},{"$f":"getProgress(BV50,DF50,,,1,WpAreaC_Sub1_exist)","v":""},{"$f":"getProgress(BW50,DG50,,,1,WpAreaC_Sub1_exist)","v":""},{"$f":"getProgress(BX50,DH50,\"%\",1,1,WpAreaC_Sub2_exist)","v":""},{"$f":"getProgress(BY50,DI50,,,1,WpAreaC_Sub2_exist)","v":""},{"$f":"getProgress(BZ50,DJ50,,,1,WpAreaC_Sub2_exist)","v":""},{"$f":"getProgress(CA50,DK50,\"%\",1,1,WpAreaC_Sub3_exist)","v":""},{"$f":"getProgress(CB50,DL50,,,1,WpAreaC_Sub3_exist)","v":""},{"$f":"getProgress(CC50,DM50,,,1,WpAreaC_Sub3_exist)","v":""},null,null,null,null,null,null,null,null,null,null,null,null,null,{"$f":"IFERROR((IF(WpAreaA_exist,IF(BA50<>\"\",BA50*WP!$AB$9,0)+IF(BD50<>\"\",BD50*WP!$AC$9,0)+IF(BG50<>\"\",BG50*WP!$AD$9,0),0)+IF(WpAreaB_exist,IF(BK50<>\"\",BK50*WP!$AE$10)+IF(BN50<>\"\",BN50*WP!$AF$10,0)+IF(BQ50<>\"\",BQ50*WP!$AG$10,0),0)+IF(WpAreaC_exist,IF(BU50<>\"\",BU50*WP!$AH$10)+IF(BX50<>\"\",BX50*WP!$AI$10,0)+IF(CA50<>\"\",CA50*WP!$AJ$10,0),0))/(IF(WpAreaA_exist,IF(BA50<>\"\",WP!$AB$9,0)+IF(BD50<>\"\",WP!$AC$9,0)+IF(BG50<>\"\",WP!$AD$9,0),0)+IF(WpAreaB_exist,IF(BK50<>\"\",WP!$AE$10,0)+IF(BN50<>\"\",WP!$AF$10,0)+IF(BQ50<>\"\",WP!$AG$10,0),0)+IF(WpAreaC_exist,IF(BU50<>\"\",WP!$AH$10,0)+IF(BX50<>\"\",WP!$AI$10,0)+IF(CA50<>\"\",WP!$AJ$10,0),0)),\"\")","v":""},{"$f":"IFERROR(IF(SUMPRODUCT(--(INDIRECT(\"WP!$C$\"&$DO50&\":$C$\"&$DP50)=$C50),--(INDIRECT(\"WP!$B$\"&$DO50&\":$B$\"&$DP50)=\"Y\"),--(INDIRECT(\"WP!$\"&$AX$41&\"$\"&$DO50&\":$\"&$AX$41&\"$\"&$DP50)=1),--(INDIRECT(\"WP!$K$\"&$DO50&\":$K$\"&$DP50)>0))<>0,SUMPRODUCT(--(INDIRECT(\"WP!$C$\"&$DO50&\":$C$\"&$DP50)=$C50),--(INDIRECT(\"WP!$B$\"&$DO50&\":$B$\"&$DP50)=\"Y\"),--(INDIRECT(\"WP!$\"&$AX$41&\"$\"&$DO50&\":$\"&$AX$41&\"$\"&$DP50)=1),INDIRECT(\"WP!$K$\"&$DO50&\":$K$\"&$DP50)),IF(AZ50<>\"\",0,\"\")),\"\")","v":""},{"$f":"IFERROR(IF(SUMPRODUCT(--(INDIRECT(\"WP!$C$\"&$DO50&\":$C$\"&$DP50)=$C50),--(INDIRECT(\"WP!$B\"&$DO50&\":$B\"&$DP50)=\"Y\"),--(INDIRECT(\"WP!$\"&$AX$41&\"$\"&$DO50&\":$\"&$AX$41&\"$\"&$DP50)<>\"\"),--(INDIRECT(\"WP!$K\"&$DO50&\":$K\"&$DP50)>0))<>0,SUMPRODUCT(--(INDIRECT(\"WP!$C$\"&$DO50&\":$C$\"&$DP50)=$C50),--(INDIRECT(\"WP!$B\"&$DO50&\":$B\"&$DP50)=\"Y\"),--(INDIRECT(\"WP!$\"&$AX$41&\"$\"&$DO50&\":$\"&$AX$41&\"$\"&$DP50)<>\"\"),INDIRECT(\"WP!$K\"&$DO50&\":$K\"&$DP50)),\"\"),\"\")","v":""},{"$f":"IFERROR(IF(WpAreaA_Sub1_exist,IF(SUMPRODUCT(--(INDIRECT(\"WP!$C$\"&$DO50&\":$C$\"&$DP50)=$C50),--(INDIRECT(\"WP!$\"&$BA$41&\"$\"&$DO50&\":$\"&$BA$41&\"$\"&$DP50)<>\"\"),--(INDIRECT(\"WP!$K$\"&$DO50&\":$K$\"&$DP50)>0))>0,SUMPRODUCT(--(INDIRECT(\"WP!$C$\"&$DO50&\":$C$\"&$DP50)=$C50),--(INDIRECT(\"WP!$\"&$BA$41&\"$\"&$DO50&\":$\"&$BA$41&\"$\"&$DP50)<>\"\"),INDIRECT(\"WP!$K$\"&$DO50&\":$K$\"&$DP50),INDIRECT(\"WP!$\"&$BA$41&\"$\"&$DO50&\":$\"&$BA$41&\"$\"&$DP50))/SUMPRODUCT(--(INDIRECT(\"WP!$C$\"&$DO50&\":$C$\"&$DP50)=$C50),--(INDIRECT(\"WP!$\"&$BA$41&\"$\"&$DO50&\":$\"&$BA$41&\"$\"&$DP50)<>\"\"),INDIRECT(\"WP!$K$\"&$DO50&\":$K$\"&$DP50)),\"\"),\"\"),\"\")","v":""},{"$f":"IFERROR(IF(WpAreaA_Sub1_exist,IF(SUMPRODUCT(--(INDIRECT(\"WP!$C$\"&$DO50&\":$C$\"&$DP50)=$C50),--(INDIRECT(\"WP!$B$\"&$DO50&\":$B$\"&$DP50)=\"Y\"),--(INDIRECT(\"WP!$\"&$BA$41&\"$\"&$DO50&\":$\"&$BA$41&\"$\"&$DP50)=1),--(INDIRECT(\"WP!$K$\"&$DO50&\":$K$\"&$DP50)>0))<>0,SUMPRODUCT(--(INDIRECT(\"WP!$C$\"&$DO50&\":$C$\"&$DP50)=$C50),--(INDIRECT(\"WP!$B$\"&$DO50&\":$B$\"&$DP50)=\"Y\"),--(INDIRECT(\"WP!$\"&$BA$41&\"$\"&$DO50&\":$\"&$BA$41&\"$\"&$DP50)=1),INDIRECT(\"WP!$K$\"&$DO50&\":$K$\"&$DP50)),IF(BC50<>\"\",0,\"\")),\"\"),\"\")","v":""},{"$f":"IFERROR(IF(WpAreaA_Sub1_exist,IF(SUMPRODUCT(--(INDIRECT(\"WP!$C$\"&$DO50&\":$C$\"&$DP50)=$C50),--(INDIRECT(\"WP!$B\"&$DO50&\":$B\"&$DP50)=\"Y\"),--(INDIRECT(\"WP!$\"&$BA$41&\"$\"&$DO50&\":$\"&$BA$41&\"$\"&$DP50)<>\"\"),--(INDIRECT(\"WP!$K\"&$DO50&\":$K\"&$DP50)>0))<>0,SUMPRODUCT(--(INDIRECT(\"WP!$C$\"&$DO50&\":$C$\"&$DP50)=$C50),--(INDIRECT(\"WP!$B\"&$DO50&\":$B\"&$DP50)=\"Y\"),--(INDIRECT(\"WP!$\"&$BA$41&\"$\"&$DO50&\":$\"&$BA$41&\"$\"&$DP50)<>\"\"),INDIRECT(\"WP!$K\"&$DO50&\":$K\"&$DP50)),\"\"),\"\"),\"\")","v":""},{"$f":"IFERROR(IF(WpAreaA_Sub2_exist,IF(SUMPRODUCT(--(INDIRECT(\"WP!$C$\"&$DO50&\":$C$\"&$DP50)=$C50),--(INDIRECT(\"WP!$\"&$BD$41&\"$\"&$DO50&\":$\"&$BD$41&\"$\"&$DP50)<>\"\"),--(INDIRECT(\"WP!$K$\"&$DO50&\":$K$\"&$DP50)>0))>0,SUMPRODUCT(--(INDIRECT(\"WP!$C$\"&$DO50&\":$C$\"&$DP50)=$C50),--(INDIRECT(\"WP!$\"&$BD$41&\"$\"&$DO50&\":$\"&$BD$41&\"$\"&$DP50)<>\"\"),INDIRECT(\"WP!$K\"&$DO50&\":$K\"&$DP50),INDIRECT(\"WP!$\"&$BD$41&\"$\"&$DO50&\":$\"&$BD$41&\"$\"&$DP50))/SUMPRODUCT(--(INDIRECT(\"WP!$C$\"&$DO50&\":$C$\"&$DP50)=$C50),--(INDIRECT(\"WP!$\"&$BD$41&\"$\"&$DO50&\":$\"&$BD$41&\"$\"&$DP50)<>\"\"),INDIRECT(\"WP!$K\"&$DO50&\":$K\"&$DP50)),\"\"),\"\"),\"\")","v":""},{"$f":"IFERROR(IF(WpAreaA_Sub2_exist,IF(SUMPRODUCT(--(INDIRECT(\"WP!$C$\"&$DO50&\":$C$\"&$DP50)=$C50),--(INDIRECT(\"WP!$B\"&$DO50&\":$B\"&$DP50)=\"Y\"),--(INDIRECT(\"WP!$\"&$BD$41&\"$\"&$DO50&\":$\"&$BD$41&\"$\"&$DP50)=1),--(INDIRECT(\"WP!$K\"&$DO50&\":$K\"&$DP50)>0))<>0,SUMPRODUCT(--(INDIRECT(\"WP!$C$\"&$DO50&\":$C$\"&$DP50)=$C50),--(INDIRECT(\"WP!$B\"&$DO50&\":$B\"&$DP50)=\"Y\"),--(INDIRECT(\"WP!$\"&$BD$41&\"$\"&$DO50&\":$\"&$BD$41&\"$\"&$DP50)=1),INDIRECT(\"WP!$K\"&$DO50&\":$K\"&$DP50)),IF(BF50<>\"\",0,\"\")),\"\"),\"\")","v":""},{"$f":"IFERROR(IF(WpAreaA_Sub2_exist,IF(SUMPRODUCT(--(INDIRECT(\"WP!$C$\"&$DO50&\":$C$\"&$DP50)=$C50),--(INDIRECT(\"WP!$B\"&$DO50&\":$B\"&$DP50)=\"Y\"),--(INDIRECT(\"WP!$\"&$BD$41&\"$\"&$DO50&\":$\"&$BD$41&\"$\"&$DP50)<>\"\"),--(INDIRECT(\"WP!$K\"&$DO50&\":$K\"&$DP50)>0))<>0,SUMPRODUCT(--(INDIRECT(\"WP!$C$\"&$DO50&\":$C$\"&$DP50)=$C50),--(INDIRECT(\"WP!$B\"&$DO50&\":$B\"&$DP50)=\"Y\"),--(INDIRECT(\"WP!$\"&$BD$41&\"$\"&$DO50&\":$\"&$BD$41&\"$\"&$DP50)<>\"\"),INDIRECT(\"WP!$K\"&$DO50&\":$K\"&$DP50)),\"\"),\"\"),\"\")","v":""},{"$f":"IFERROR(IF(WpAreaA_Sub3_exist,IF(SUMPRODUCT(--(INDIRECT(\"WP!$C$\"&$DO50&\":$C$\"&$DP50)=$C50),--(INDIRECT(\"WP!$\"&$BG$41&\"$\"&$DO50&\":$\"&$BG$41&\"$\"&$DP50)<>\"\"),--(INDIRECT(\"WP!$K$\"&$DO50&\":$K$\"&$DP50)>0))>0,SUMPRODUCT(--(INDIRECT(\"WP!$C$\"&$DO50&\":$C$\"&$DP50)=$C50),--(INDIRECT(\"WP!$\"&$BG$41&\"$\"&$DO50&\":$\"&$BG$41&\"$\"&$DP50)<>\"\"),INDIRECT(\"WP!$K\"&$DO50&\":$K\"&$DP50),INDIRECT(\"WP!$\"&$BG$41&\"$\"&$DO50&\":$\"&$BG$41&\"$\"&$DP50))/SUMPRODUCT(--(INDIRECT(\"WP!$C$\"&$DO50&\":$C$\"&$DP50)=$C50),--(INDIRECT(\"WP!$\"&$BG$41&\"$\"&$DO50&\":$\"&$BG$41&\"$\"&$DP50)<>\"\"),INDIRECT(\"WP!$K\"&$DO50&\":$K\"&$DP50)),\"\"),\"\"),\"\")","v":""},{"$f":"IFERROR(IF(WpAreaA_Sub3_exist,IF(SUMPRODUCT(--(INDIRECT(\"WP!$C$\"&$DO50&\":$C$\"&$DP50)=$C50),--(INDIRECT(\"WP!$B\"&$DO50&\":$B\"&$DP50)=\"Y\"),--(INDIRECT(\"WP!$\"&$BG$41&\"$\"&$DO50&\":$\"&$BG$41&\"$\"&$DP50)=1),--(INDIRECT(\"WP!$K\"&$DO50&\":$K\"&$DP50)>0))<>0,SUMPRODUCT(--(INDIRECT(\"WP!$C$\"&$DO50&\":$C$\"&$DP50)=$C50),--(INDIRECT(\"WP!$B\"&$DO50&\":$B\"&$DP50)=\"Y\"),--(INDIRECT(\"WP!$\"&$BG$41&\"$\"&$DO50&\":$\"&$BG$41&\"$\"&$DP50)=1),INDIRECT(\"WP!$K\"&$DO50&\":$K\"&$DP50)),IF(BI50<>\"\",0,\"\")),\"\"),\"\")","v":""},{"$f":"IFERROR(IF(WpAreaA_Sub3_exist,IF(SUMPRODUCT(--(INDIRECT(\"WP!$C$\"&$DO50&\":$C$\"&$DP50)=$C50),--(INDIRECT(\"WP!$B\"&$DO50&\":$B\"&$DP50)=\"Y\"),--(INDIRECT(\"WP!$\"&$BG$41&\"$\"&$DO50&\":$\"&$BG$41&\"$\"&$DP50)<>\"\"),--(INDIRECT(\"WP!$K\"&$DO50&\":$K\"&$DP50)>0))<>0,SUMPRODUCT(--(INDIRECT(\"WP!$C$\"&$DO50&\":$C$\"&$DP50)=$C50),--(INDIRECT(\"WP!$B\"&$DO50&\":$B\"&$DP50)=\"Y\"),--(INDIRECT(\"WP!$\"&$BG$41&\"$\"&$DO50&\":$\"&$BG$41&\"$\"&$DP50)<>\"\"),INDIRECT(\"WP!$K\"&$DO50&\":$K\"&$DP50)),\"\"),\"\"),\"\")","v":""},null,{"$f":"IFERROR(IF(WpAreaB_Sub1_exist,IF(SUMPRODUCT(--(INDIRECT(\"WP!$C$\"&$DO50&\":$C$\"&$DP50)=$C50),--(INDIRECT(\"WP!$\"&$BK$41&\"$\"&$DO50&\":$\"&$BK$41&\"$\"&$DP50)<>\"\"),--(INDIRECT(\"WP!$K$\"&$DO50&\":$K$\"&$DP50)>0))>0,SUMPRODUCT(--(INDIRECT(\"WP!$C$\"&$DO50&\":$C$\"&$DP50)=$C50),--(INDIRECT(\"WP!$\"&$BK$41&\"$\"&$DO50&\":$\"&$BK$41&\"$\"&$DP50)<>\"\"),INDIRECT(\"WP!$K\"&$DO50&\":$K\"&$DP50),INDIRECT(\"WP!$\"&$BK$41&\"$\"&$DO50&\":$\"&$BK$41&\"$\"&$DP50))/SUMPRODUCT(--(INDIRECT(\"WP!$C$\"&$DO50&\":$C$\"&$DP50)=$C50),--(INDIRECT(\"WP!$\"&$BK$41&\"$\"&$DO50&\":$\"&$BK$41&\"$\"&$DP50)<>\"\"),INDIRECT(\"WP!$K\"&$DO50&\":$K\"&$DP50)),\"\"),\"\"),\"\")","v":""},{"$f":"IFERROR(IF(WpAreaB_Sub1_exist,IF(SUMPRODUCT(--(INDIRECT(\"WP!$C$\"&$DO50&\":$C$\"&$DP50)=$C50),--(INDIRECT(\"WP!$B\"&$DO50&\":$B\"&$DP50)=\"Y\"),--(INDIRECT(\"WP!$\"&$BK$41&\"$\"&$DO50&\":$\"&$BK$41&\"$\"&$DP50)=1),--(INDIRECT(\"WP!$K\"&$DO50&\":$K\"&$DP50)>0))<>0,SUMPRODUCT(--(INDIRECT(\"WP!$C$\"&$DO50&\":$C$\"&$DP50)=$C50),--(INDIRECT(\"WP!$B\"&$DO50&\":$B\"&$DP50)=\"Y\"),--(INDIRECT(\"WP!$\"&$BK$41&\"$\"&$DO50&\":$\"&$BK$41&\"$\"&$DP50)=1),INDIRECT(\"WP!$K\"&$DO50&\":$K\"&$DP50)),IF(BM50<>\"\",0,\"\")),\"\"),\"\")","v":""},{"$f":"IFERROR(IF(WpAreaB_Sub1_exist,IF(SUMPRODUCT(--(INDIRECT(\"WP!$C$\"&$DO50&\":$C$\"&$DP50)=$C50),--(INDIRECT(\"WP!$B\"&$DO50&\":$B\"&$DP50)=\"Y\"),--(INDIRECT(\"WP!$\"&$BK$41&\"$\"&$DO50&\":$\"&$BK$41&\"$\"&$DP50)<>\"\"),--(INDIRECT(\"WP!$K\"&$DO50&\":$K\"&$DP50)>0))<>0,SUMPRODUCT(--(INDIRECT(\"WP!$C$\"&$DO50&\":$C$\"&$DP50)=$C50),--(INDIRECT(\"WP!$B\"&$DO50&\":$B\"&$DP50)=\"Y\"),--(INDIRECT(\"WP!$\"&$BK$41&\"$\"&$DO50&\":$\"&$BK$41&\"$\"&$DP50)<>\"\"),INDIRECT(\"WP!$K\"&$DO50&\":$K\"&$DP50)),\"\"),\"\"),\"\")","v":""},{"$f":"IFERROR(IF(WpAreaB_Sub2_exist,IF(SUMPRODUCT(--(INDIRECT(\"WP!$C$\"&$DO50&\":$C$\"&$DP50)=$C50),--(INDIRECT(\"WP!$\"&$BN$41&\"$\"&$DO50&\":$\"&$BN$41&\"$\"&$DP50)<>\"\"),--(INDIRECT(\"WP!$K$\"&$DO50&\":$K$\"&$DP50)>0))>0,SUMPRODUCT(--(INDIRECT(\"WP!$C$\"&$DO50&\":$C$\"&$DP50)=$C50),--(INDIRECT(\"WP!$\"&$BN$41&\"$\"&$DO50&\":$\"&$BN$41&\"$\"&$DP50)<>\"\"),INDIRECT(\"WP!$K\"&$DO50&\":$K\"&$DP50),INDIRECT(\"WP!$\"&$BN$41&\"$\"&$DO50&\":$\"&$BN$41&\"$\"&$DP50))/SUMPRODUCT(--(INDIRECT(\"WP!$C$\"&$DO50&\":$C$\"&$DP50)=$C50),--(INDIRECT(\"WP!$\"&$BN$41&\"$\"&$DO50&\":$\"&$BN$41&\"$\"&$DP50)<>\"\"),INDIRECT(\"WP!$K\"&$DO50&\":$K\"&$DP50)),\"\"),\"\"),\"\")","v":""},{"$f":"IFERROR(IF(WpAreaB_Sub2_exist,IF(SUMPRODUCT(--(INDIRECT(\"WP!$C$\"&$DO50&\":$C$\"&$DP50)=$C50),--(INDIRECT(\"WP!$B\"&$DO50&\":$B\"&$DP50)=\"Y\"),--(INDIRECT(\"WP!$\"&$BN$41&\"$\"&$DO50&\":$\"&$BN$41&\"$\"&$DP50)=1),--(INDIRECT(\"WP!$K\"&$DO50&\":$K\"&$DP50)>0))<>0,SUMPRODUCT(--(INDIRECT(\"WP!$C$\"&$DO50&\":$C$\"&$DP50)=$C50),--(INDIRECT(\"WP!$B\"&$DO50&\":$B\"&$DP50)=\"Y\"),--(INDIRECT(\"WP!$\"&$BN$41&\"$\"&$DO50&\":$\"&$BN$41&\"$\"&$DP50)=1),INDIRECT(\"WP!$K\"&$DO50&\":$K\"&$DP50)),IF(BP50<>\"\",0,\"\")),\"\"),\"\")","v":""},{"$f":"IFERROR(IF(WpAreaB_Sub2_exist,IF(SUMPRODUCT(--(INDIRECT(\"WP!$C$\"&$DO50&\":$C$\"&$DP50)=$C50),--(INDIRECT(\"WP!$B\"&$DO50&\":$B\"&$DP50)=\"Y\"),--(INDIRECT(\"WP!$\"&$BN$41&\"$\"&$DO50&\":$\"&$BN$41&\"$\"&$DP50)<>\"\"),--(INDIRECT(\"WP!$K\"&$DO50&\":$K\"&$DP50)>0))<>0,SUMPRODUCT(--(INDIRECT(\"WP!$C$\"&$DO50&\":$C$\"&$DP50)=$C50),--(INDIRECT(\"WP!$B\"&$DO50&\":$B\"&$DP50)=\"Y\"),--(INDIRECT(\"WP!$\"&$BN$41&\"$\"&$DO50&\":$\"&$BN$41&\"$\"&$DP50)<>\"\"),INDIRECT(\"WP!$K\"&$DO50&\":$K\"&$DP50)),\"\"),\"\"),\"\")","v":""},{"$f":"IFERROR(IF(WpAreaB_Sub3_exist,IF(SUMPRODUCT(--(INDIRECT(\"WP!$C$\"&$DO50&\":$C$\"&$DP50)=$C50),--(INDIRECT(\"WP!$\"&$BQ$41&\"$\"&$DO50&\":$\"&$BQ$41&\"$\"&$DP50)<>\"\"),--(INDIRECT(\"WP!$K$\"&$DO50&\":$K$\"&$DP50)>0))>0,SUMPRODUCT(--(INDIRECT(\"WP!$C$\"&$DO50&\":$C$\"&$DP50)=$C50),--(INDIRECT(\"WP!$\"&$BQ$41&\"$\"&$DO50&\":$\"&$BQ$41&\"$\"&$DP50)<>\"\"),INDIRECT(\"WP!$K\"&$DO50&\":$K\"&$DP50),INDIRECT(\"WP!$\"&$BQ$41&\"$\"&$DO50&\":$\"&$BQ$41&\"$\"&$DP50))/SUMPRODUCT(--(INDIRECT(\"WP!$C$\"&$DO50&\":$C$\"&$DP50)=$C50),--(INDIRECT(\"WP!$\"&$BQ$41&\"$\"&$DO50&\":$\"&$BQ$41&\"$\"&$DP50)<>\"\"),INDIRECT(\"WP!$K\"&$DO50&\":$K\"&$DP50)),\"\"),\"\"),\"\")","v":""},{"$f":"IFERROR(IF(WpAreaB_Sub3_exist,IF(SUMPRODUCT(--(INDIRECT(\"WP!$C$\"&$DO50&\":$C$\"&$DP50)=$C50),--(INDIRECT(\"WP!$B\"&$DO50&\":$B\"&$DP50)=\"Y\"),--(INDIRECT(\"WP!$\"&$BQ$41&\"$\"&$DO50&\":$\"&$BQ$41&\"$\"&$DP50)=1),--(INDIRECT(\"WP!$K\"&$DO50&\":$K\"&$DP50)>0))<>0,SUMPRODUCT(--(INDIRECT(\"WP!$C$\"&$DO50&\":$C$\"&$DP50)=$C50),--(INDIRECT(\"WP!$B\"&$DO50&\":$B\"&$DP50)=\"Y\"),--(INDIRECT(\"WP!$\"&$BQ$41&\"$\"&$DO50&\":$\"&$BQ$41&\"$\"&$DP50)=1),INDIRECT(\"WP!$K\"&$DO50&\":$K\"&$DP50)),IF(BS50<>\"\",0,\"\")),\"\"),\"\")","v":""},{"$f":"IFERROR(IF(WpAreaB_Sub3_exist,IF(SUMPRODUCT(--(INDIRECT(\"WP!$C$\"&$DO50&\":$C$\"&$DP50)=$C50),--(INDIRECT(\"WP!$B\"&$DO50&\":$B\"&$DP50)=\"Y\"),--(INDIRECT(\"WP!$\"&$BQ$41&\"$\"&$DO50&\":$\"&$BQ$41&\"$\"&$DP50)<>\"\"),--(INDIRECT(\"WP!$K\"&$DO50&\":$K\"&$DP50)>0))<>0,SUMPRODUCT(--(INDIRECT(\"WP!$C$\"&$DO50&\":$C$\"&$DP50)=$C50),--(INDIRECT(\"WP!$B\"&$DO50&\":$B\"&$DP50)=\"Y\"),--(INDIRECT(\"WP!$\"&$BQ$41&\"$\"&$DO50&\":$\"&$BQ$41&\"$\"&$DP50)<>\"\"),INDIRECT(\"WP!$K\"&$DO50&\":$K\"&$DP50)),\"\"),\"\"),\"\")","v":""},null,{"$f":"IFERROR(IF(WpAreaC_Sub1_exist,IF(SUMPRODUCT(--(INDIRECT(\"WP!$C$\"&$DO50&\":$C$\"&$DP50)=$C50),--(INDIRECT(\"WP!$\"&$BU$41&\"$\"&$DO50&\":$\"&$BU$41&\"$\"&$DP50)<>\"\"),--(INDIRECT(\"WP!$K$\"&$DO50&\":$K$\"&$DP50)>0))>0,SUMPRODUCT(--(INDIRECT(\"WP!$C$\"&$DO50&\":$C$\"&$DP50)=$C50),--(INDIRECT(\"WP!$\"&$BU$41&\"$\"&$DO50&\":$\"&$BU$41&\"$\"&$DP50)<>\"\"),INDIRECT(\"WP!$K\"&$DO50&\":$K\"&$DP50),INDIRECT(\"WP!$\"&$BU$41&\"$\"&$DO50&\":$\"&$BU$41&\"$\"&$DP50))/SUMPRODUCT(--(INDIRECT(\"WP!$C$\"&$DO50&\":$C$\"&$DP50)=$C50),--(INDIRECT(\"WP!$\"&$BU$41&\"$\"&$DO50&\":$\"&$BU$41&\"$\"&$DP50)<>\"\"),INDIRECT(\"WP!$K\"&$DO50&\":$K\"&$DP50)),\"\"),\"\"),\"\")","v":""},{"$f":"IFERROR(IF(WpAreaC_Sub1_exist,IF(SUMPRODUCT(--(INDIRECT(\"WP!$C$\"&$DO50&\":$C$\"&$DP50)=$C50),--(INDIRECT(\"WP!$B\"&$DO50&\":$B\"&$DP50)=\"Y\"),--(INDIRECT(\"WP!$\"&$BU$41&\"$\"&$DO50&\":$\"&$BU$41&\"$\"&$DP50)=1),--(INDIRECT(\"WP!$K\"&$DO50&\":$K\"&$DP50)>0))<>0,SUMPRODUCT(--(INDIRECT(\"WP!$C$\"&$DO50&\":$C$\"&$DP50)=$C50),--(INDIRECT(\"WP!$B\"&$DO50&\":$B\"&$DP50)=\"Y\"),--(INDIRECT(\"WP!$\"&$BU$41&\"$\"&$DO50&\":$\"&$BU$41&\"$\"&$DP50)=1),INDIRECT(\"WP!$K\"&$DO50&\":$K\"&$DP50)),IF(BW50<>\"\",0,\"\")),\"\"),\"\")","v":""},{"$f":"IFERROR(IF(WpAreaC_Sub1_exist,IF(SUMPRODUCT(--(INDIRECT(\"WP!$C$\"&$DO50&\":$C$\"&$DP50)=$C50),--(INDIRECT(\"WP!$B\"&$DO50&\":$B\"&$DP50)=\"Y\"),--(INDIRECT(\"WP!$\"&$BU$41&\"$\"&$DO50&\":$\"&$BU$41&\"$\"&$DP50)<>\"\"),--(INDIRECT(\"WP!$K\"&$DO50&\":$K\"&$DP50)>0))<>0,SUMPRODUCT(--(INDIRECT(\"WP!$C$\"&$DO50&\":$C$\"&$DP50)=$C50),--(INDIRECT(\"WP!$B\"&$DO50&\":$B\"&$DP50)=\"Y\"),--(INDIRECT(\"WP!$\"&$BU$41&\"$\"&$DO50&\":$\"&$BU$41&\"$\"&$DP50)<>\"\"),INDIRECT(\"WP!$K\"&$DO50&\":$K\"&$DP50)),\"\"),\"\"),\"\")","v":""},{"$f":"IFERROR(IF(WpAreaC_Sub2_exist,IF(SUMPRODUCT(--(INDIRECT(\"WP!$C$\"&$DO50&\":$C$\"&$DP50)=$C50),--(INDIRECT(\"WP!$\"&$BX$41&\"$\"&$DO50&\":$\"&$BX$41&\"$\"&$DP50)<>\"\"),--(INDIRECT(\"WP!$K$\"&$DO50&\":$K$\"&$DP50)>0))>0,SUMPRODUCT(--(INDIRECT(\"WP!$C$\"&$DO50&\":$C$\"&$DP50)=$C50),--(INDIRECT(\"WP!$\"&$BX$41&\"$\"&$DO50&\":$\"&$BX$41&\"$\"&$DP50)<>\"\"),INDIRECT(\"WP!$K\"&$DO50&\":$K\"&$DP50),INDIRECT(\"WP!$\"&$BX$41&\"$\"&$DO50&\":$\"&$BX$41&\"$\"&$DP50))/SUMPRODUCT(--(INDIRECT(\"WP!$C$\"&$DO50&\":$C$\"&$DP50)=$C50),--(INDIRECT(\"WP!$\"&$BX$41&\"$\"&$DO50&\":$\"&$BX$41&\"$\"&$DP50)<>\"\"),INDIRECT(\"WP!$K\"&$DO50&\":$K\"&$DP50)),\"\"),\"\"),\"\")","v":""},{"$f":"IFERROR(IF(WpAreaC_Sub2_exist,IF(SUMPRODUCT(--(INDIRECT(\"WP!$C$\"&$DO50&\":$C$\"&$DP50)=$C50),--(INDIRECT(\"WP!$B\"&$DO50&\":$B\"&$DP50)=\"Y\"),--(INDIRECT(\"WP!$\"&$BX$41&\"$\"&$DO50&\":$\"&$BX$41&\"$\"&$DP50)=1),--(INDIRECT(\"WP!$K\"&$DO50&\":$K\"&$DP50)>0))<>0,SUMPRODUCT(--(INDIRECT(\"WP!$C$\"&$DO50&\":$C$\"&$DP50)=$C50),--(INDIRECT(\"WP!$B\"&$DO50&\":$B\"&$DP50)=\"Y\"),--(INDIRECT(\"WP!$\"&$BX$41&\"$\"&$DO50&\":$\"&$BX$41&\"$\"&$DP50)=1),INDIRECT(\"WP!$K\"&$DO50&\":$K\"&$DP50)),IF(BZ50<>\"\",0,\"\")),\"\"),\"\")","v":""},{"$f":"IFERROR(IF(WpAreaC_Sub2_exist,IF(SUMPRODUCT(--(INDIRECT(\"WP!$C$\"&$DO50&\":$C$\"&$DP50)=$C50),--(INDIRECT(\"WP!$B\"&$DO50&\":$B\"&$DP50)=\"Y\"),--(INDIRECT(\"WP!$\"&$BX$41&\"$\"&$DO50&\":$\"&$BX$41&\"$\"&$DP50)<>\"\"),--(INDIRECT(\"WP!$K\"&$DO50&\":$K\"&$DP50)>0))<>0,SUMPRODUCT(--(INDIRECT(\"WP!$C$\"&$DO50&\":$C$\"&$DP50)=$C50),--(INDIRECT(\"WP!$B\"&$DO50&\":$B\"&$DP50)=\"Y\"),--(INDIRECT(\"WP!$\"&$BX$41&\"$\"&$DO50&\":$\"&$BX$41&\"$\"&$DP50)<>\"\"),INDIRECT(\"WP!$K\"&$DO50&\":$K\"&$DP50)),\"\"),\"\"),\"\")","v":""},{"$f":"IFERROR(IF(WpAreaC_Sub3_exist,IF(SUMPRODUCT(--(INDIRECT(\"WP!$C$\"&$DO50&\":$C$\"&$DP50)=$C50),--(INDIRECT(\"WP!$\"&$CA$41&\"$\"&$DO50&\":$\"&$CA$41&\"$\"&$DP50)<>\"\"),--(INDIRECT(\"WP!$K$\"&$DO50&\":$K$\"&$DP50)>0))>0,SUMPRODUCT(--(INDIRECT(\"WP!$C$\"&$DO50&\":$C$\"&$DP50)=$C50),--(INDIRECT(\"WP!$\"&$CA$41&\"$\"&$DO50&\":$\"&$CA$41&\"$\"&$DP50)<>\"\"),INDIRECT(\"WP!$K\"&$DO50&\":$K\"&$DP50),INDIRECT(\"WP!$\"&$CA$41&\"$\"&$DO50&\":$\"&$CA$41&\"$\"&$DP50))/SUMPRODUCT(--(INDIRECT(\"WP!$C$\"&$DO50&\":$C$\"&$DP50)=$C50),--(INDIRECT(\"WP!$\"&$CA$41&\"$\"&$DO50&\":$\"&$CA$41&\"$\"&$DP50)<>\"\"),INDIRECT(\"WP!$K\"&$DO50&\":$K\"&$DP50)),\"\"),\"\"),\"\")","v":""},{"$f":"IFERROR(IF(WpAreaC_Sub3_exist,IF(SUMPRODUCT(--(INDIRECT(\"WP!$C$\"&$DO50&\":$C$\"&$DP50)=$C50),--(INDIRECT(\"WP!$B\"&$DO50&\":$B\"&$DP50)=\"Y\"),--(INDIRECT(\"WP!$\"&$CA$41&\"$\"&$DO50&\":$\"&$CA$41&\"$\"&$DP50)=1),--(INDIRECT(\"WP!$K\"&$DO50&\":$K\"&$DP50)>0))<>0,SUMPRODUCT(--(INDIRECT(\"WP!$C$\"&$DO50&\":$C$\"&$DP50)=$C50),--(INDIRECT(\"WP!$B\"&$DO50&\":$B\"&$DP50)=\"Y\"),--(INDIRECT(\"WP!$\"&$CA$41&\"$\"&$DO50&\":$\"&$CA$41&\"$\"&$DP50)=1),INDIRECT(\"WP!$K\"&$DO50&\":$K\"&$DP50)),IF(CC50<>\"\",0,\"\")),\"\"),\"\")","v":""},{"$f":"IFERROR(IF(WpAreaC_Sub3_exist,IF(SUMPRODUCT(--(INDIRECT(\"WP!$C$\"&$DO50&\":$C$\"&$DP50)=$C50),--(INDIRECT(\"WP!$B\"&$DO50&\":$B\"&$DP50)=\"Y\"),--(INDIRECT(\"WP!$\"&$CA$41&\"$\"&$DO50&\":$\"&$CA$41&\"$\"&$DP50)<>\"\"),--(INDIRECT(\"WP!$K\"&$DO50&\":$K\"&$DP50)>0))<>0,SUMPRODUCT(--(INDIRECT(\"WP!$C$\"&$DO50&\":$C$\"&$DP50)=$C50),--(INDIRECT(\"WP!$B\"&$DO50&\":$B\"&$DP50)=\"Y\"),--(INDIRECT(\"WP!$\"&$CA$41&\"$\"&$DO50&\":$\"&$CA$41&\"$\"&$DP50)<>\"\"),INDIRECT(\"WP!$K\"&$DO50&\":$K\"&$DP50)),\"\"),\"\"),\"\")","v":""},null,null,null,null,"","","","","","","","","","","","",null,"","","","","","","","","",null,"","","","","","","","","",null,{"$f":"MIN(IF(WP!$C$12:$C$79=$C50,ROW(WP!$C$12:$C$79),\"\"))","v":62},{"$f":"MAX(IF(WP!$C$12:$C$79=$C50,ROW(WP!$C$12:$C$79),\"\"))","v":62}]
[null,"Test Tolerances analysis receiver test cases","36.904",{"$f":"getProgress(AX51,CH51,\"%\",1,1)","v":""},{"$f":"getProgress(AY51,CI51,,,1)","v":""},{"$f":"getProgress(AZ51,CJ51,,,1)","v":""},null,{"$f":"getProgress(BA51,CK51,\"%\",1,1,WpAreaA_Sub1_exist)","v":""},{"$f":"getProgress(BB51,CL51,,,1,WpAreaA_Sub1_exist)","v":""},{"$f":"getProgress(BC51,CM51,,,1,WpAreaA_Sub1_exist)","v":""},{"$f":"getProgress(BD51,CN51,\"%\",1,1,WpAreaA_Sub2_exist)","v":""},{"$f":"getProgress(BE51,CO51,,,1,WpAreaA_Sub2_exist)","v":""},{"$f":"getProgress(BF51,CP51,,,1,WpAreaA_Sub2_exist)","v":""},{"$f":"getProgress(BG51,CQ51,\"%\",1,1,WpAreaA_Sub3_exist)","v":""},{"$f":"getProgress(BH51,CR51,,,1,WpAreaA_Sub3_exist)","v":""},{"$f":"getProgress(BI51,CS51,,,1,WpAreaA_Sub3_exist)","v":""},null,{"$f":"getProgress(BK51,CU51,\"%\",1,1,WpAreaB_Sub1_exist)","v":""},{"$f":"getProgress(BL51,CV51,,,1,WpAreaB_Sub1_exist)","v":""},{"$f":"getProgress(BM51,CW51,,,1,WpAreaB_Sub1_exist)","v":""},{"$f":"getProgress(BN51,CX51,\"%\",1,1,WpAreaB_Sub2_exist)","v":""},{"$f":"getProgress(BO51,CY51,,,1,WpAreaB_Sub2_exist)","v":""},{"$f":"getProgress(BP51,CZ51,,,1,WpAreaB_Sub2_exist)","v":""},{"$f":"getProgress(BQ51,DA51,\"%\",1,1,WpAreaB_Sub3_exist)","v":""},{"$f":"getProgress(BR51,DB51,,,1,WpAreaB_Sub3_exist)","v":""},{"$f":"getProgress(BS51,DC51,,,1,WpAreaB_Sub3_exist)","v":""},null,{"$f":"getProgress(BU51,DE51,\"%\",1,1,WpAreaC_Sub1_exist)","v":""},{"$f":"getProgress(BV51,DF51,,,1,WpAreaC_Sub1_exist)","v":""},{"$f":"getProgress(BW51,DG51,,,1,WpAreaC_Sub1_exist)","v":""},{"$f":"getProgress(BX51,DH51,\"%\",1,1,WpAreaC_Sub2_exist)","v":""},{"$f":"getProgress(BY51,DI51,,,1,WpAreaC_Sub2_exist)","v":""},{"$f":"getProgress(BZ51,DJ51,,,1,WpAreaC_Sub2_exist)","v":""},{"$f":"getProgress(CA51,DK51,\"%\",1,1,WpAreaC_Sub3_exist)","v":""},{"$f":"getProgress(CB51,DL51,,,1,WpAreaC_Sub3_exist)","v":""},{"$f":"getProgress(CC51,DM51,,,1,WpAreaC_Sub3_exist)","v":""},null,null,null,null,null,null,null,null,null,null,null,null,null,{"$f":"IFERROR((IF(WpAreaA_exist,IF(BA51<>\"\",BA51*WP!$AB$9,0)+IF(BD51<>\"\",BD51*WP!$AC$9,0)+IF(BG51<>\"\",BG51*WP!$AD$9,0),0)+IF(WpAreaB_exist,IF(BK51<>\"\",BK51*WP!$AE$10)+IF(BN51<>\"\",BN51*WP!$AF$10,0)+IF(BQ51<>\"\",BQ51*WP!$AG$10,0),0)+IF(WpAreaC_exist,IF(BU51<>\"\",BU51*WP!$AH$10)+IF(BX51<>\"\",BX51*WP!$AI$10,0)+IF(CA51<>\"\",CA51*WP!$AJ$10,0),0))/(IF(WpAreaA_exist,IF(BA51<>\"\",WP!$AB$9,0)+IF(BD51<>\"\",WP!$AC$9,0)+IF(BG51<>\"\",WP!$AD$9,0),0)+IF(WpAreaB_exist,IF(BK51<>\"\",WP!$AE$10,0)+IF(BN51<>\"\",WP!$AF$10,0)+IF(BQ51<>\"\",WP!$AG$10,0),0)+IF(WpAreaC_exist,IF(BU51<>\"\",WP!$AH$10,0)+IF(BX51<>\"\",WP!$AI$10,0)+IF(CA51<>\"\",WP!$AJ$10,0),0)),\"\")","v":""},{"$f":"IFERROR(IF(SUMPRODUCT(--(INDIRECT(\"WP!$C$\"&$DO51&\":$C$\"&$DP51)=$C51),--(INDIRECT(\"WP!$B$\"&$DO51&\":$B$\"&$DP51)=\"Y\"),--(INDIRECT(\"WP!$\"&$AX$41&\"$\"&$DO51&\":$\"&$AX$41&\"$\"&$DP51)=1),--(INDIRECT(\"WP!$K$\"&$DO51&\":$K$\"&$DP51)>0))<>0,SUMPRODUCT(--(INDIRECT(\"WP!$C$\"&$DO51&\":$C$\"&$DP51)=$C51),--(INDIRECT(\"WP!$B$\"&$DO51&\":$B$\"&$DP51)=\"Y\"),--(INDIRECT(\"WP!$\"&$AX$41&\"$\"&$DO51&\":$\"&$AX$41&\"$\"&$DP51)=1),INDIRECT(\"WP!$K$\"&$DO51&\":$K$\"&$DP51)),IF(AZ51<>\"\",0,\"\")),\"\")","v":""},{"$f":"IFERROR(IF(SUMPRODUCT(--(INDIRECT(\"WP!$C$\"&$DO51&\":$C$\"&$DP51)=$C51),--(INDIRECT(\"WP!$B\"&$DO51&\":$B\"&$DP51)=\"Y\"),--(INDIRECT(\"WP!$\"&$AX$41&\"$\"&$DO51&\":$\"&$AX$41&\"$\"&$DP51)<>\"\"),--(INDIRECT(\"WP!$K\"&$DO51&\":$K\"&$DP51)>0))<>0,SUMPRODUCT(--(INDIRECT(\"WP!$C$\"&$DO51&\":$C$\"&$DP51)=$C51),--(INDIRECT(\"WP!$B\"&$DO51&\":$B\"&$DP51)=\"Y\"),--(INDIRECT(\"WP!$\"&$AX$41&\"$\"&$DO51&\":$\"&$AX$41&\"$\"&$DP51)<>\"\"),INDIRECT(\"WP!$K\"&$DO51&\":$K\"&$DP51)),\"\"),\"\")","v":""},{"$f":"IFERROR(IF(WpAreaA_Sub1_exist,IF(SUMPRODUCT(--(INDIRECT(\"WP!$C$\"&$DO51&\":$C$\"&$DP51)=$C51),--(INDIRECT(\"WP!$\"&$BA$41&\"$\"&$DO51&\":$\"&$BA$41&\"$\"&$DP51)<>\"\"),--(INDIRECT(\"WP!$K$\"&$DO51&\":$K$\"&$DP51)>0))>0,SUMPRODUCT(--(INDIRECT(\"WP!$C$\"&$DO51&\":$C$\"&$DP51)=$C51),--(INDIRECT(\"WP!$\"&$BA$41&\"$\"&$DO51&\":$\"&$BA$41&\"$\"&$DP51)<>\"\"),INDIRECT(\"WP!$K$\"&$DO51&\":$K$\"&$DP51),INDIRECT(\"WP!$\"&$BA$41&\"$\"&$DO51&\":$\"&$BA$41&\"$\"&$DP51))/SUMPRODUCT(--(INDIRECT(\"WP!$C$\"&$DO51&\":$C$\"&$DP51)=$C51),--(INDIRECT(\"WP!$\"&$BA$41&\"$\"&$DO51&\":$\"&$BA$41&\"$\"&$DP51)<>\"\"),INDIRECT(\"WP!$K$\"&$DO51&\":$K$\"&$DP51)),\"\"),\"\"),\"\")","v":""},{"$f":"IFERROR(IF(WpAreaA_Sub1_exist,IF(SUMPRODUCT(--(INDIRECT(\"WP!$C$\"&$DO51&\":$C$\"&$DP51)=$C51),--(INDIRECT(\"WP!$B$\"&$DO51&\":$B$\"&$DP51)=\"Y\"),--(INDIRECT(\"WP!$\"&$BA$41&\"$\"&$DO51&\":$\"&$BA$41&\"$\"&$DP51)=1),--(INDIRECT(\"WP!$K$\"&$DO51&\":$K$\"&$DP51)>0))<>0,SUMPRODUCT(--(INDIRECT(\"WP!$C$\"&$DO51&\":$C$\"&$DP51)=$C51),--(INDIRECT(\"WP!$B$\"&$DO51&\":$B$\"&$DP51)=\"Y\"),--(INDIRECT(\"WP!$\"&$BA$41&\"$\"&$DO51&\":$\"&$BA$41&\"$\"&$DP51)=1),INDIRECT(\"WP!$K$\"&$DO51&\":$K$\"&$DP51)),IF(BC51<>\"\",0,\"\")),\"\"),\"\")","v":""},{"$f":"IFERROR(IF(WpAreaA_Sub1_exist,IF(SUMPRODUCT(--(INDIRECT(\"WP!$C$\"&$DO51&\":$C$\"&$DP51)=$C51),--(INDIRECT(\"WP!$B\"&$DO51&\":$B\"&$DP51)=\"Y\"),--(INDIRECT(\"WP!$\"&$BA$41&\"$\"&$DO51&\":$\"&$BA$41&\"$\"&$DP51)<>\"\"),--(INDIRECT(\"WP!$K\"&$DO51&\":$K\"&$DP51)>0))<>0,SUMPRODUCT(--(INDIRECT(\"WP!$C$\"&$DO51&\":$C$\"&$DP51)=$C51),--(INDIRECT(\"WP!$B\"&$DO51&\":$B\"&$DP51)=\"Y\"),--(INDIRECT(\"WP!$\"&$BA$41&\"$\"&$DO51&\":$\"&$BA$41&\"$\"&$DP51)<>\"\"),INDIRECT(\"WP!$K\"&$DO51&\":$K\"&$DP51)),\"\"),\"\"),\"\")","v":""},{"$f":"IFERROR(IF(WpAreaA_Sub2_exist,IF(SUMPRODUCT(--(INDIRECT(\"WP!$C$\"&$DO51&\":$C$\"&$DP51)=$C51),--(INDIRECT(\"WP!$\"&$BD$41&\"$\"&$DO51&\":$\"&$BD$41&\"$\"&$DP51)<>\"\"),--(INDIRECT(\"WP!$K$\"&$DO51&\":$K$\"&$DP51)>0))>0,SUMPRODUCT(--(INDIRECT(\"WP!$C$\"&$DO51&\":$C$\"&$DP51)=$C51),--(INDIRECT(\"WP!$\"&$BD$41&\"$\"&$DO51&\":$\"&$BD$41&\"$\"&$DP51)<>\"\"),INDIRECT(\"WP!$K\"&$DO51&\":$K\"&$DP51),INDIRECT(\"WP!$\"&$BD$41&\"$\"&$DO51&\":$\"&$BD$41&\"$\"&$DP51))/SUMPRODUCT(--(INDIRECT(\"WP!$C$\"&$DO51&\":$C$\"&$DP51)=$C51),--(INDIRECT(\"WP!$\"&$BD$41&\"$\"&$DO51&\":$\"&$BD$41&\"$\"&$DP51)<>\"\"),INDIRECT(\"WP!$K\"&$DO51&\":$K\"&$DP51)),\"\"),\"\"),\"\")","v":""},{"$f":"IFERROR(IF(WpAreaA_Sub2_exist,IF(SUMPRODUCT(--(INDIRECT(\"WP!$C$\"&$DO51&\":$C$\"&$DP51)=$C51),--(INDIRECT(\"WP!$B\"&$DO51&\":$B\"&$DP51)=\"Y\"),--(INDIRECT(\"WP!$\"&$BD$41&\"$\"&$DO51&\":$\"&$BD$41&\"$\"&$DP51)=1),--(INDIRECT(\"WP!$K\"&$DO51&\":$K\"&$DP51)>0))<>0,SUMPRODUCT(--(INDIRECT(\"WP!$C$\"&$DO51&\":$C$\"&$DP51)=$C51),--(INDIRECT(\"WP!$B\"&$DO51&\":$B\"&$DP51)=\"Y\"),--(INDIRECT(\"WP!$\"&$BD$41&\"$\"&$DO51&\":$\"&$BD$41&\"$\"&$DP51)=1),INDIRECT(\"WP!$K\"&$DO51&\":$K\"&$DP51)),IF(BF51<>\"\",0,\"\")),\"\"),\"\")","v":""},{"$f":"IFERROR(IF(WpAreaA_Sub2_exist,IF(SUMPRODUCT(--(INDIRECT(\"WP!$C$\"&$DO51&\":$C$\"&$DP51)=$C51),--(INDIRECT(\"WP!$B\"&$DO51&\":$B\"&$DP51)=\"Y\"),--(INDIRECT(\"WP!$\"&$BD$41&\"$\"&$DO51&\":$\"&$BD$41&\"$\"&$DP51)<>\"\"),--(INDIRECT(\"WP!$K\"&$DO51&\":$K\"&$DP51)>0))<>0,SUMPRODUCT(--(INDIRECT(\"WP!$C$\"&$DO51&\":$C$\"&$DP51)=$C51),--(INDIRECT(\"WP!$B\"&$DO51&\":$B\"&$DP51)=\"Y\"),--(INDIRECT(\"WP!$\"&$BD$41&\"$\"&$DO51&\":$\"&$BD$41&\"$\"&$DP51)<>\"\"),INDIRECT(\"WP!$K\"&$DO51&\":$K\"&$DP51)),\"\"),\"\"),\"\")","v":""},{"$f":"IFERROR(IF(WpAreaA_Sub3_exist,IF(SUMPRODUCT(--(INDIRECT(\"WP!$C$\"&$DO51&\":$C$\"&$DP51)=$C51),--(INDIRECT(\"WP!$\"&$BG$41&\"$\"&$DO51&\":$\"&$BG$41&\"$\"&$DP51)<>\"\"),--(INDIRECT(\"WP!$K$\"&$DO51&\":$K$\"&$DP51)>0))>0,SUMPRODUCT(--(INDIRECT(\"WP!$C$\"&$DO51&\":$C$\"&$DP51)=$C51),--(INDIRECT(\"WP!$\"&$BG$41&\"$\"&$DO51&\":$\"&$BG$41&\"$\"&$DP51)<>\"\"),INDIRECT(\"WP!$K\"&$DO51&\":$K\"&$DP51),INDIRECT(\"WP!$\"&$BG$41&\"$\"&$DO51&\":$\"&$BG$41&\"$\"&$DP51))/SUMPRODUCT(--(INDIRECT(\"WP!$C$\"&$DO51&\":$C$\"&$DP51)=$C51),--(INDIRECT(\"WP!$\"&$BG$41&\"$\"&$DO51&\":$\"&$BG$41&\"$\"&$DP51)<>\"\"),INDIRECT(\"WP!$K\"&$DO51&\":$K\"&$DP51)),\"\"),\"\"),\"\")","v":""},{"$f":"IFERROR(IF(WpAreaA_Sub3_exist,IF(SUMPRODUCT(--(INDIRECT(\"WP!$C$\"&$DO51&\":$C$\"&$DP51)=$C51),--(INDIRECT(\"WP!$B\"&$DO51&\":$B\"&$DP51)=\"Y\"),--(INDIRECT(\"WP!$\"&$BG$41&\"$\"&$DO51&\":$\"&$BG$41&\"$\"&$DP51)=1),--(INDIRECT(\"WP!$K\"&$DO51&\":$K\"&$DP51)>0))<>0,SUMPRODUCT(--(INDIRECT(\"WP!$C$\"&$DO51&\":$C$\"&$DP51)=$C51),--(INDIRECT(\"WP!$B\"&$DO51&\":$B\"&$DP51)=\"Y\"),--(INDIRECT(\"WP!$\"&$BG$41&\"$\"&$DO51&\":$\"&$BG$41&\"$\"&$DP51)=1),INDIRECT(\"WP!$K\"&$DO51&\":$K\"&$DP51)),IF(BI51<>\"\",0,\"\")),\"\"),\"\")","v":""},{"$f":"IFERROR(IF(WpAreaA_Sub3_exist,IF(SUMPRODUCT(--(INDIRECT(\"WP!$C$\"&$DO51&\":$C$\"&$DP51)=$C51),--(INDIRECT(\"WP!$B\"&$DO51&\":$B\"&$DP51)=\"Y\"),--(INDIRECT(\"WP!$\"&$BG$41&\"$\"&$DO51&\":$\"&$BG$41&\"$\"&$DP51)<>\"\"),--(INDIRECT(\"WP!$K\"&$DO51&\":$K\"&$DP51)>0))<>0,SUMPRODUCT(--(INDIRECT(\"WP!$C$\"&$DO51&\":$C$\"&$DP51)=$C51),--(INDIRECT(\"WP!$B\"&$DO51&\":$B\"&$DP51)=\"Y\"),--(INDIRECT(\"WP!$\"&$BG$41&\"$\"&$DO51&\":$\"&$BG$41&\"$\"&$DP51)<>\"\"),INDIRECT(\"WP!$K\"&$DO51&\":$K\"&$DP51)),\"\"),\"\"),\"\")","v":""},null,{"$f":"IFERROR(IF(WpAreaB_Sub1_exist,IF(SUMPRODUCT(--(INDIRECT(\"WP!$C$\"&$DO51&\":$C$\"&$DP51)=$C51),--(INDIRECT(\"WP!$\"&$BK$41&\"$\"&$DO51&\":$\"&$BK$41&\"$\"&$DP51)<>\"\"),--(INDIRECT(\"WP!$K$\"&$DO51&\":$K$\"&$DP51)>0))>0,SUMPRODUCT(--(INDIRECT(\"WP!$C$\"&$DO51&\":$C$\"&$DP51)=$C51),--(INDIRECT(\"WP!$\"&$BK$41&\"$\"&$DO51&\":$\"&$BK$41&\"$\"&$DP51)<>\"\"),INDIRECT(\"WP!$K\"&$DO51&\":$K\"&$DP51),INDIRECT(\"WP!$\"&$BK$41&\"$\"&$DO51&\":$\"&$BK$41&\"$\"&$DP51))/SUMPRODUCT(--(INDIRECT(\"WP!$C$\"&$DO51&\":$C$\"&$DP51)=$C51),--(INDIRECT(\"WP!$\"&$BK$41&\"$\"&$DO51&\":$\"&$BK$41&\"$\"&$DP51)<>\"\"),INDIRECT(\"WP!$K\"&$DO51&\":$K\"&$DP51)),\"\"),\"\"),\"\")","v":""},{"$f":"IFERROR(IF(WpAreaB_Sub1_exist,IF(SUMPRODUCT(--(INDIRECT(\"WP!$C$\"&$DO51&\":$C$\"&$DP51)=$C51),--(INDIRECT(\"WP!$B\"&$DO51&\":$B\"&$DP51)=\"Y\"),--(INDIRECT(\"WP!$\"&$BK$41&\"$\"&$DO51&\":$\"&$BK$41&\"$\"&$DP51)=1),--(INDIRECT(\"WP!$K\"&$DO51&\":$K\"&$DP51)>0))<>0,SUMPRODUCT(--(INDIRECT(\"WP!$C$\"&$DO51&\":$C$\"&$DP51)=$C51),--(INDIRECT(\"WP!$B\"&$DO51&\":$B\"&$DP51)=\"Y\"),--(INDIRECT(\"WP!$\"&$BK$41&\"$\"&$DO51&\":$\"&$BK$41&\"$\"&$DP51)=1),INDIRECT(\"WP!$K\"&$DO51&\":$K\"&$DP51)),IF(BM51<>\"\",0,\"\")),\"\"),\"\")","v":""},{"$f":"IFERROR(IF(WpAreaB_Sub1_exist,IF(SUMPRODUCT(--(INDIRECT(\"WP!$C$\"&$DO51&\":$C$\"&$DP51)=$C51),--(INDIRECT(\"WP!$B\"&$DO51&\":$B\"&$DP51)=\"Y\"),--(INDIRECT(\"WP!$\"&$BK$41&\"$\"&$DO51&\":$\"&$BK$41&\"$\"&$DP51)<>\"\"),--(INDIRECT(\"WP!$K\"&$DO51&\":$K\"&$DP51)>0))<>0,SUMPRODUCT(--(INDIRECT(\"WP!$C$\"&$DO51&\":$C$\"&$DP51)=$C51),--(INDIRECT(\"WP!$B\"&$DO51&\":$B\"&$DP51)=\"Y\"),--(INDIRECT(\"WP!$\"&$BK$41&\"$\"&$DO51&\":$\"&$BK$41&\"$\"&$DP51)<>\"\"),INDIRECT(\"WP!$K\"&$DO51&\":$K\"&$DP51)),\"\"),\"\"),\"\")","v":""},{"$f":"IFERROR(IF(WpAreaB_Sub2_exist,IF(SUMPRODUCT(--(INDIRECT(\"WP!$C$\"&$DO51&\":$C$\"&$DP51)=$C51),--(INDIRECT(\"WP!$\"&$BN$41&\"$\"&$DO51&\":$\"&$BN$41&\"$\"&$DP51)<>\"\"),--(INDIRECT(\"WP!$K$\"&$DO51&\":$K$\"&$DP51)>0))>0,SUMPRODUCT(--(INDIRECT(\"WP!$C$\"&$DO51&\":$C$\"&$DP51)=$C51),--(INDIRECT(\"WP!$\"&$BN$41&\"$\"&$DO51&\":$\"&$BN$41&\"$\"&$DP51)<>\"\"),INDIRECT(\"WP!$K\"&$DO51&\":$K\"&$DP51),INDIRECT(\"WP!$\"&$BN$41&\"$\"&$DO51&\":$\"&$BN$41&\"$\"&$DP51))/SUMPRODUCT(--(INDIRECT(\"WP!$C$\"&$DO51&\":$C$\"&$DP51)=$C51),--(INDIRECT(\"WP!$\"&$BN$41&\"$\"&$DO51&\":$\"&$BN$41&\"$\"&$DP51)<>\"\"),INDIRECT(\"WP!$K\"&$DO51&\":$K\"&$DP51)),\"\"),\"\"),\"\")","v":""},{"$f":"IFERROR(IF(WpAreaB_Sub2_exist,IF(SUMPRODUCT(--(INDIRECT(\"WP!$C$\"&$DO51&\":$C$\"&$DP51)=$C51),--(INDIRECT(\"WP!$B\"&$DO51&\":$B\"&$DP51)=\"Y\"),--(INDIRECT(\"WP!$\"&$BN$41&\"$\"&$DO51&\":$\"&$BN$41&\"$\"&$DP51)=1),--(INDIRECT(\"WP!$K\"&$DO51&\":$K\"&$DP51)>0))<>0,SUMPRODUCT(--(INDIRECT(\"WP!$C$\"&$DO51&\":$C$\"&$DP51)=$C51),--(INDIRECT(\"WP!$B\"&$DO51&\":$B\"&$DP51)=\"Y\"),--(INDIRECT(\"WP!$\"&$BN$41&\"$\"&$DO51&\":$\"&$BN$41&\"$\"&$DP51)=1),INDIRECT(\"WP!$K\"&$DO51&\":$K\"&$DP51)),IF(BP51<>\"\",0,\"\")),\"\"),\"\")","v":""},{"$f":"IFERROR(IF(WpAreaB_Sub2_exist,IF(SUMPRODUCT(--(INDIRECT(\"WP!$C$\"&$DO51&\":$C$\"&$DP51)=$C51),--(INDIRECT(\"WP!$B\"&$DO51&\":$B\"&$DP51)=\"Y\"),--(INDIRECT(\"WP!$\"&$BN$41&\"$\"&$DO51&\":$\"&$BN$41&\"$\"&$DP51)<>\"\"),--(INDIRECT(\"WP!$K\"&$DO51&\":$K\"&$DP51)>0))<>0,SUMPRODUCT(--(INDIRECT(\"WP!$C$\"&$DO51&\":$C$\"&$DP51)=$C51),--(INDIRECT(\"WP!$B\"&$DO51&\":$B\"&$DP51)=\"Y\"),--(INDIRECT(\"WP!$\"&$BN$41&\"$\"&$DO51&\":$\"&$BN$41&\"$\"&$DP51)<>\"\"),INDIRECT(\"WP!$K\"&$DO51&\":$K\"&$DP51)),\"\"),\"\"),\"\")","v":""},{"$f":"IFERROR(IF(WpAreaB_Sub3_exist,IF(SUMPRODUCT(--(INDIRECT(\"WP!$C$\"&$DO51&\":$C$\"&$DP51)=$C51),--(INDIRECT(\"WP!$\"&$BQ$41&\"$\"&$DO51&\":$\"&$BQ$41&\"$\"&$DP51)<>\"\"),--(INDIRECT(\"WP!$K$\"&$DO51&\":$K$\"&$DP51)>0))>0,SUMPRODUCT(--(INDIRECT(\"WP!$C$\"&$DO51&\":$C$\"&$DP51)=$C51),--(INDIRECT(\"WP!$\"&$BQ$41&\"$\"&$DO51&\":$\"&$BQ$41&\"$\"&$DP51)<>\"\"),INDIRECT(\"WP!$K\"&$DO51&\":$K\"&$DP51),INDIRECT(\"WP!$\"&$BQ$41&\"$\"&$DO51&\":$\"&$BQ$41&\"$\"&$DP51))/SUMPRODUCT(--(INDIRECT(\"WP!$C$\"&$DO51&\":$C$\"&$DP51)=$C51),--(INDIRECT(\"WP!$\"&$BQ$41&\"$\"&$DO51&\":$\"&$BQ$41&\"$\"&$DP51)<>\"\"),INDIRECT(\"WP!$K\"&$DO51&\":$K\"&$DP51)),\"\"),\"\"),\"\")","v":""},{"$f":"IFERROR(IF(WpAreaB_Sub3_exist,IF(SUMPRODUCT(--(INDIRECT(\"WP!$C$\"&$DO51&\":$C$\"&$DP51)=$C51),--(INDIRECT(\"WP!$B\"&$DO51&\":$B\"&$DP51)=\"Y\"),--(INDIRECT(\"WP!$\"&$BQ$41&\"$\"&$DO51&\":$\"&$BQ$41&\"$\"&$DP51)=1),--(INDIRECT(\"WP!$K\"&$DO51&\":$K\"&$DP51)>0))<>0,SUMPRODUCT(--(INDIRECT(\"WP!$C$\"&$DO51&\":$C$\"&$DP51)=$C51),--(INDIRECT(\"WP!$B\"&$DO51&\":$B\"&$DP51)=\"Y\"),--(INDIRECT(\"WP!$\"&$BQ$41&\"$\"&$DO51&\":$\"&$BQ$41&\"$\"&$DP51)=1),INDIRECT(\"WP!$K\"&$DO51&\":$K\"&$DP51)),IF(BS51<>\"\",0,\"\")),\"\"),\"\")","v":""},{"$f":"IFERROR(IF(WpAreaB_Sub3_exist,IF(SUMPRODUCT(--(INDIRECT(\"WP!$C$\"&$DO51&\":$C$\"&$DP51)=$C51),--(INDIRECT(\"WP!$B\"&$DO51&\":$B\"&$DP51)=\"Y\"),--(INDIRECT(\"WP!$\"&$BQ$41&\"$\"&$DO51&\":$\"&$BQ$41&\"$\"&$DP51)<>\"\"),--(INDIRECT(\"WP!$K\"&$DO51&\":$K\"&$DP51)>0))<>0,SUMPRODUCT(--(INDIRECT(\"WP!$C$\"&$DO51&\":$C$\"&$DP51)=$C51),--(INDIRECT(\"WP!$B\"&$DO51&\":$B\"&$DP51)=\"Y\"),--(INDIRECT(\"WP!$\"&$BQ$41&\"$\"&$DO51&\":$\"&$BQ$41&\"$\"&$DP51)<>\"\"),INDIRECT(\"WP!$K\"&$DO51&\":$K\"&$DP51)),\"\"),\"\"),\"\")","v":""},null,{"$f":"IFERROR(IF(WpAreaC_Sub1_exist,IF(SUMPRODUCT(--(INDIRECT(\"WP!$C$\"&$DO51&\":$C$\"&$DP51)=$C51),--(INDIRECT(\"WP!$\"&$BU$41&\"$\"&$DO51&\":$\"&$BU$41&\"$\"&$DP51)<>\"\"),--(INDIRECT(\"WP!$K$\"&$DO51&\":$K$\"&$DP51)>0))>0,SUMPRODUCT(--(INDIRECT(\"WP!$C$\"&$DO51&\":$C$\"&$DP51)=$C51),--(INDIRECT(\"WP!$\"&$BU$41&\"$\"&$DO51&\":$\"&$BU$41&\"$\"&$DP51)<>\"\"),INDIRECT(\"WP!$K\"&$DO51&\":$K\"&$DP51),INDIRECT(\"WP!$\"&$BU$41&\"$\"&$DO51&\":$\"&$BU$41&\"$\"&$DP51))/SUMPRODUCT(--(INDIRECT(\"WP!$C$\"&$DO51&\":$C$\"&$DP51)=$C51),--(INDIRECT(\"WP!$\"&$BU$41&\"$\"&$DO51&\":$\"&$BU$41&\"$\"&$DP51)<>\"\"),INDIRECT(\"WP!$K\"&$DO51&\":$K\"&$DP51)),\"\"),\"\"),\"\")","v":""},{"$f":"IFERROR(IF(WpAreaC_Sub1_exist,IF(SUMPRODUCT(--(INDIRECT(\"WP!$C$\"&$DO51&\":$C$\"&$DP51)=$C51),--(INDIRECT(\"WP!$B\"&$DO51&\":$B\"&$DP51)=\"Y\"),--(INDIRECT(\"WP!$\"&$BU$41&\"$\"&$DO51&\":$\"&$BU$41&\"$\"&$DP51)=1),--(INDIRECT(\"WP!$K\"&$DO51&\":$K\"&$DP51)>0))<>0,SUMPRODUCT(--(INDIRECT(\"WP!$C$\"&$DO51&\":$C$\"&$DP51)=$C51),--(INDIRECT(\"WP!$B\"&$DO51&\":$B\"&$DP51)=\"Y\"),--(INDIRECT(\"WP!$\"&$BU$41&\"$\"&$DO51&\":$\"&$BU$41&\"$\"&$DP51)=1),INDIRECT(\"WP!$K\"&$DO51&\":$K\"&$DP51)),IF(BW51<>\"\",0,\"\")),\"\"),\"\")","v":""},{"$f":"IFERROR(IF(WpAreaC_Sub1_exist,IF(SUMPRODUCT(--(INDIRECT(\"WP!$C$\"&$DO51&\":$C$\"&$DP51)=$C51),--(INDIRECT(\"WP!$B\"&$DO51&\":$B\"&$DP51)=\"Y\"),--(INDIRECT(\"WP!$\"&$BU$41&\"$\"&$DO51&\":$\"&$BU$41&\"$\"&$DP51)<>\"\"),--(INDIRECT(\"WP!$K\"&$DO51&\":$K\"&$DP51)>0))<>0,SUMPRODUCT(--(INDIRECT(\"WP!$C$\"&$DO51&\":$C$\"&$DP51)=$C51),--(INDIRECT(\"WP!$B\"&$DO51&\":$B\"&$DP51)=\"Y\"),--(INDIRECT(\"WP!$\"&$BU$41&\"$\"&$DO51&\":$\"&$BU$41&\"$\"&$DP51)<>\"\"),INDIRECT(\"WP!$K\"&$DO51&\":$K\"&$DP51)),\"\"),\"\"),\"\")","v":""},{"$f":"IFERROR(IF(WpAreaC_Sub2_exist,IF(SUMPRODUCT(--(INDIRECT(\"WP!$C$\"&$DO51&\":$C$\"&$DP51)=$C51),--(INDIRECT(\"WP!$\"&$BX$41&\"$\"&$DO51&\":$\"&$BX$41&\"$\"&$DP51)<>\"\"),--(INDIRECT(\"WP!$K$\"&$DO51&\":$K$\"&$DP51)>0))>0,SUMPRODUCT(--(INDIRECT(\"WP!$C$\"&$DO51&\":$C$\"&$DP51)=$C51),--(INDIRECT(\"WP!$\"&$BX$41&\"$\"&$DO51&\":$\"&$BX$41&\"$\"&$DP51)<>\"\"),INDIRECT(\"WP!$K\"&$DO51&\":$K\"&$DP51),INDIRECT(\"WP!$\"&$BX$41&\"$\"&$DO51&\":$\"&$BX$41&\"$\"&$DP51))/SUMPRODUCT(--(INDIRECT(\"WP!$C$\"&$DO51&\":$C$\"&$DP51)=$C51),--(INDIRECT(\"WP!$\"&$BX$41&\"$\"&$DO51&\":$\"&$BX$41&\"$\"&$DP51)<>\"\"),INDIRECT(\"WP!$K\"&$DO51&\":$K\"&$DP51)),\"\"),\"\"),\"\")","v":""},{"$f":"IFERROR(IF(WpAreaC_Sub2_exist,IF(SUMPRODUCT(--(INDIRECT(\"WP!$C$\"&$DO51&\":$C$\"&$DP51)=$C51),--(INDIRECT(\"WP!$B\"&$DO51&\":$B\"&$DP51)=\"Y\"),--(INDIRECT(\"WP!$\"&$BX$41&\"$\"&$DO51&\":$\"&$BX$41&\"$\"&$DP51)=1),--(INDIRECT(\"WP!$K\"&$DO51&\":$K\"&$DP51)>0))<>0,SUMPRODUCT(--(INDIRECT(\"WP!$C$\"&$DO51&\":$C$\"&$DP51)=$C51),--(INDIRECT(\"WP!$B\"&$DO51&\":$B\"&$DP51)=\"Y\"),--(INDIRECT(\"WP!$\"&$BX$41&\"$\"&$DO51&\":$\"&$BX$41&\"$\"&$DP51)=1),INDIRECT(\"WP!$K\"&$DO51&\":$K\"&$DP51)),IF(BZ51<>\"\",0,\"\")),\"\"),\"\")","v":""},{"$f":"IFERROR(IF(WpAreaC_Sub2_exist,IF(SUMPRODUCT(--(INDIRECT(\"WP!$C$\"&$DO51&\":$C$\"&$DP51)=$C51),--(INDIRECT(\"WP!$B\"&$DO51&\":$B\"&$DP51)=\"Y\"),--(INDIRECT(\"WP!$\"&$BX$41&\"$\"&$DO51&\":$\"&$BX$41&\"$\"&$DP51)<>\"\"),--(INDIRECT(\"WP!$K\"&$DO51&\":$K\"&$DP51)>0))<>0,SUMPRODUCT(--(INDIRECT(\"WP!$C$\"&$DO51&\":$C$\"&$DP51)=$C51),--(INDIRECT(\"WP!$B\"&$DO51&\":$B\"&$DP51)=\"Y\"),--(INDIRECT(\"WP!$\"&$BX$41&\"$\"&$DO51&\":$\"&$BX$41&\"$\"&$DP51)<>\"\"),INDIRECT(\"WP!$K\"&$DO51&\":$K\"&$DP51)),\"\"),\"\"),\"\")","v":""},{"$f":"IFERROR(IF(WpAreaC_Sub3_exist,IF(SUMPRODUCT(--(INDIRECT(\"WP!$C$\"&$DO51&\":$C$\"&$DP51)=$C51),--(INDIRECT(\"WP!$\"&$CA$41&\"$\"&$DO51&\":$\"&$CA$41&\"$\"&$DP51)<>\"\"),--(INDIRECT(\"WP!$K$\"&$DO51&\":$K$\"&$DP51)>0))>0,SUMPRODUCT(--(INDIRECT(\"WP!$C$\"&$DO51&\":$C$\"&$DP51)=$C51),--(INDIRECT(\"WP!$\"&$CA$41&\"$\"&$DO51&\":$\"&$CA$41&\"$\"&$DP51)<>\"\"),INDIRECT(\"WP!$K\"&$DO51&\":$K\"&$DP51),INDIRECT(\"WP!$\"&$CA$41&\"$\"&$DO51&\":$\"&$CA$41&\"$\"&$DP51))/SUMPRODUCT(--(INDIRECT(\"WP!$C$\"&$DO51&\":$C$\"&$DP51)=$C51),--(INDIRECT(\"WP!$\"&$CA$41&\"$\"&$DO51&\":$\"&$CA$41&\"$\"&$DP51)<>\"\"),INDIRECT(\"WP!$K\"&$DO51&\":$K\"&$DP51)),\"\"),\"\"),\"\")","v":""},{"$f":"IFERROR(IF(WpAreaC_Sub3_exist,IF(SUMPRODUCT(--(INDIRECT(\"WP!$C$\"&$DO51&\":$C$\"&$DP51)=$C51),--(INDIRECT(\"WP!$B\"&$DO51&\":$B\"&$DP51)=\"Y\"),--(INDIRECT(\"WP!$\"&$CA$41&\"$\"&$DO51&\":$\"&$CA$41&\"$\"&$DP51)=1),--(INDIRECT(\"WP!$K\"&$DO51&\":$K\"&$DP51)>0))<>0,SUMPRODUCT(--(INDIRECT(\"WP!$C$\"&$DO51&\":$C$\"&$DP51)=$C51),--(INDIRECT(\"WP!$B\"&$DO51&\":$B\"&$DP51)=\"Y\"),--(INDIRECT(\"WP!$\"&$CA$41&\"$\"&$DO51&\":$\"&$CA$41&\"$\"&$DP51)=1),INDIRECT(\"WP!$K\"&$DO51&\":$K\"&$DP51)),IF(CC51<>\"\",0,\"\")),\"\"),\"\")","v":""},{"$f":"IFERROR(IF(WpAreaC_Sub3_exist,IF(SUMPRODUCT(--(INDIRECT(\"WP!$C$\"&$DO51&\":$C$\"&$DP51)=$C51),--(INDIRECT(\"WP!$B\"&$DO51&\":$B\"&$DP51)=\"Y\"),--(INDIRECT(\"WP!$\"&$CA$41&\"$\"&$DO51&\":$\"&$CA$41&\"$\"&$DP51)<>\"\"),--(INDIRECT(\"WP!$K\"&$DO51&\":$K\"&$DP51)>0))<>0,SUMPRODUCT(--(INDIRECT(\"WP!$C$\"&$DO51&\":$C$\"&$DP51)=$C51),--(INDIRECT(\"WP!$B\"&$DO51&\":$B\"&$DP51)=\"Y\"),--(INDIRECT(\"WP!$\"&$CA$41&\"$\"&$DO51&\":$\"&$CA$41&\"$\"&$DP51)<>\"\"),INDIRECT(\"WP!$K\"&$DO51&\":$K\"&$DP51)),\"\"),\"\"),\"\")","v":""},null,null,null,null,"","","","","","","","","","","","",null,"","","","","","","","","",null,"","","","","","","","","",null,{"$f":"MIN(IF(WP!$C$12:$C$79=$C51,ROW(WP!$C$12:$C$79),\"\"))","v":0},{"$f":"MAX(IF(WP!$C$12:$C$79=$C51,ROW(WP!$C$12:$C$79),\"\"))","v":0}]
[null,"LTE RAN and CN protocols"]
[null,"Protocol test cases","36.523-1",{"$f":"getProgress(AX53,CH53,\"%\",1,1)","v":"0%"},{"$f":"getProgress(AY53,CI53,,,1)","v":"0"},{"$f":"getProgress(AZ53,CJ53,,,1)","v":"5\n(+5)"},null,{"$f":"getProgress(BA53,CK53,\"%\",1,1,WpAreaA_Sub1_exist)","v":"0%"},{"$f":"getProgress(BB53,CL53,,,1,WpAreaA_Sub1_exist)","v":"0"},{"$f":"getProgress(BC53,CM53,,,1,WpAreaA_Sub1_exist)","v":"5\n(+5)"},{"$f":"getProgress(BD53,CN53,\"%\",1,1,WpAreaA_Sub2_exist)","v":""},{"$f":"getProgress(BE53,CO53,,,1,WpAreaA_Sub2_exist)","v":""},{"$f":"getProgress(BF53,CP53,,,1,WpAreaA_Sub2_exist)","v":""},{"$f":"getProgress(BG53,CQ53,\"%\",1,1,WpAreaA_Sub3_exist)","v":""},{"$f":"getProgress(BH53,CR53,,,1,WpAreaA_Sub3_exist)","v":""},{"$f":"getProgress(BI53,CS53,,,1,WpAreaA_Sub3_exist)","v":""},null,{"$f":"getProgress(BK53,CU53,\"%\",1,1,WpAreaB_Sub1_exist)","v":""},{"$f":"getProgress(BL53,CV53,,,1,WpAreaB_Sub1_exist)","v":""},{"$f":"getProgress(BM53,CW53,,,1,WpAreaB_Sub1_exist)","v":""},{"$f":"getProgress(BN53,CX53,\"%\",1,1,WpAreaB_Sub2_exist)","v":""},{"$f":"getProgress(BO53,CY53,,,1,WpAreaB_Sub2_exist)","v":""},{"$f":"getProgress(BP53,CZ53,,,1,WpAreaB_Sub2_exist)","v":""},{"$f":"getProgress(BQ53,DA53,\"%\",1,1,WpAreaB_Sub3_exist)","v":""},{"$f":"getProgress(BR53,DB53,,,1,WpAreaB_Sub3_exist)","v":""},{"$f":"getProgress(BS53,DC53,,,1,WpAreaB_Sub3_exist)","v":""},null,{"$f":"getProgress(BU53,DE53,\"%\",1,1,WpAreaC_Sub1_exist)","v":""},{"$f":"getProgress(BV53,DF53,,,1,WpAreaC_Sub1_exist)","v":""},{"$f":"getProgress(BW53,DG53,,,1,WpAreaC_Sub1_exist)","v":""},{"$f":"getProgress(BX53,DH53,\"%\",1,1,WpAreaC_Sub2_exist)","v":""},{"$f":"getProgress(BY53,DI53,,,1,WpAreaC_Sub2_exist)","v":""},{"$f":"getProgress(BZ53,DJ53,,,1,WpAreaC_Sub2_exist)","v":""},{"$f":"getProgress(CA53,DK53,\"%\",1,1,WpAreaC_Sub3_exist)","v":""},{"$f":"getProgress(CB53,DL53,,,1,WpAreaC_Sub3_exist)","v":""},{"$f":"getProgress(CC53,DM53,,,1,WpAreaC_Sub3_exist)","v":""},null,null,null,null,null,null,null,null,null,null,null,null,null,{"$f":"IFERROR((IF(WpAreaA_exist,IF(BA53<>\"\",BA53*WP!$AB$9,0)+IF(BD53<>\"\",BD53*WP!$AC$9,0)+IF(BG53<>\"\",BG53*WP!$AD$9,0),0)+IF(WpAreaB_exist,IF(BK53<>\"\",BK53*WP!$AE$10)+IF(BN53<>\"\",BN53*WP!$AF$10,0)+IF(BQ53<>\"\",BQ53*WP!$AG$10,0),0)+IF(WpAreaC_exist,IF(BU53<>\"\",BU53*WP!$AH$10)+IF(BX53<>\"\",BX53*WP!$AI$10,0)+IF(CA53<>\"\",CA53*WP!$AJ$10,0),0))/(IF(WpAreaA_exist,IF(BA53<>\"\",WP!$AB$9,0)+IF(BD53<>\"\",WP!$AC$9,0)+IF(BG53<>\"\",WP!$AD$9,0),0)+IF(WpAreaB_exist,IF(BK53<>\"\",WP!$AE$10,0)+IF(BN53<>\"\",WP!$AF$10,0)+IF(BQ53<>\"\",WP!$AG$10,0),0)+IF(WpAreaC_exist,IF(BU53<>\"\",WP!$AH$10,0)+IF(BX53<>\"\",WP!$AI$10,0)+IF(CA53<>\"\",WP!$AJ$10,0),0)),\"\")","v":0},{"$f":"IFERROR(IF(SUMPRODUCT(--(INDIRECT(\"WP!$C$\"&$DO53&\":$C$\"&$DP53)=$C53),--(INDIRECT(\"WP!$B$\"&$DO53&\":$B$\"&$DP53)=\"Y\"),--(INDIRECT(\"WP!$\"&$AX$41&\"$\"&$DO53&\":$\"&$AX$41&\"$\"&$DP53)=1),--(INDIRECT(\"WP!$K$\"&$DO53&\":$K$\"&$DP53)>0))<>0,SUMPRODUCT(--(INDIRECT(\"WP!$C$\"&$DO53&\":$C$\"&$DP53)=$C53),--(INDIRECT(\"WP!$B$\"&$DO53&\":$B$\"&$DP53)=\"Y\"),--(INDIRECT(\"WP!$\"&$AX$41&\"$\"&$DO53&\":$\"&$AX$41&\"$\"&$DP53)=1),INDIRECT(\"WP!$K$\"&$DO53&\":$K$\"&$DP53)),IF(AZ53<>\"\",0,\"\")),\"\")","v":0},{"$f":"IFERROR(IF(SUMPRODUCT(--(INDIRECT(\"WP!$C$\"&$DO53&\":$C$\"&$DP53)=$C53),--(INDIRECT(\"WP!$B\"&$DO53&\":$B\"&$DP53)=\"Y\"),--(INDIRECT(\"WP!$\"&$AX$41&\"$\"&$DO53&\":$\"&$AX$41&\"$\"&$DP53)<>\"\"),--(INDIRECT(\"WP!$K\"&$DO53&\":$K\"&$DP53)>0))<>0,SUMPRODUCT(--(INDIRECT(\"WP!$C$\"&$DO53&\":$C$\"&$DP53)=$C53),--(INDIRECT(\"WP!$B\"&$DO53&\":$B\"&$DP53)=\"Y\"),--(INDIRECT(\"WP!$\"&$AX$41&\"$\"&$DO53&\":$\"&$AX$41&\"$\"&$DP53)<>\"\"),INDIRECT(\"WP!$K\"&$DO53&\":$K\"&$DP53)),\"\"),\"\")","v":5},{"$f":"IFERROR(IF(WpAreaA_Sub1_exist,IF(SUMPRODUCT(--(INDIRECT(\"WP!$C$\"&$DO53&\":$C$\"&$DP53)=$C53),--(INDIRECT(\"WP!$\"&$BA$41&\"$\"&$DO53&\":$\"&$BA$41&\"$\"&$DP53)<>\"\"),--(INDIRECT(\"WP!$K$\"&$DO53&\":$K$\"&$DP53)>0))>0,SUMPRODUCT(--(INDIRECT(\"WP!$C$\"&$DO53&\":$C$\"&$DP53)=$C53),--(INDIRECT(\"WP!$\"&$BA$41&\"$\"&$DO53&\":$\"&$BA$41&\"$\"&$DP53)<>\"\"),INDIRECT(\"WP!$K$\"&$DO53&\":$K$\"&$DP53),INDIRECT(\"WP!$\"&$BA$41&\"$\"&$DO53&\":$\"&$BA$41&\"$\"&$DP53))/SUMPRODUCT(--(INDIRECT(\"WP!$C$\"&$DO53&\":$C$\"&$DP53)=$C53),--(INDIRECT(\"WP!$\"&$BA$41&\"$\"&$DO53&\":$\"&$BA$41&\"$\"&$DP53)<>\"\"),INDIRECT(\"WP!$K$\"&$DO53&\":$K$\"&$DP53)),\"\"),\"\"),\"\")","v":0},{"$f":"IFERROR(IF(WpAreaA_Sub1_exist,IF(SUMPRODUCT(--(INDIRECT(\"WP!$C$\"&$DO53&\":$C$\"&$DP53)=$C53),--(INDIRECT(\"WP!$B$\"&$DO53&\":$B$\"&$DP53)=\"Y\"),--(INDIRECT(\"WP!$\"&$BA$41&\"$\"&$DO53&\":$\"&$BA$41&\"$\"&$DP53)=1),--(INDIRECT(\"WP!$K$\"&$DO53&\":$K$\"&$DP53)>0))<>0,SUMPRODUCT(--(INDIRECT(\"WP!$C$\"&$DO53&\":$C$\"&$DP53)=$C53),--(INDIRECT(\"WP!$B$\"&$DO53&\":$B$\"&$DP53)=\"Y\"),--(INDIRECT(\"WP!$\"&$BA$41&\"$\"&$DO53&\":$\"&$BA$41&\"$\"&$DP53)=1),INDIRECT(\"WP!$K$\"&$DO53&\":$K$\"&$DP53)),IF(BC53<>\"\",0,\"\")),\"\"),\"\")","v":0},{"$f":"IFERROR(IF(WpAreaA_Sub1_exist,IF(SUMPRODUCT(--(INDIRECT(\"WP!$C$\"&$DO53&\":$C$\"&$DP53)=$C53),--(INDIRECT(\"WP!$B\"&$DO53&\":$B\"&$DP53)=\"Y\"),--(INDIRECT(\"WP!$\"&$BA$41&\"$\"&$DO53&\":$\"&$BA$41&\"$\"&$DP53)<>\"\"),--(INDIRECT(\"WP!$K\"&$DO53&\":$K\"&$DP53)>0))<>0,SUMPRODUCT(--(INDIRECT(\"WP!$C$\"&$DO53&\":$C$\"&$DP53)=$C53),--(INDIRECT(\"WP!$B\"&$DO53&\":$B\"&$DP53)=\"Y\"),--(INDIRECT(\"WP!$\"&$BA$41&\"$\"&$DO53&\":$\"&$BA$41&\"$\"&$DP53)<>\"\"),INDIRECT(\"WP!$K\"&$DO53&\":$K\"&$DP53)),\"\"),\"\"),\"\")","v":5},{"$f":"IFERROR(IF(WpAreaA_Sub2_exist,IF(SUMPRODUCT(--(INDIRECT(\"WP!$C$\"&$DO53&\":$C$\"&$DP53)=$C53),--(INDIRECT(\"WP!$\"&$BD$41&\"$\"&$DO53&\":$\"&$BD$41&\"$\"&$DP53)<>\"\"),--(INDIRECT(\"WP!$K$\"&$DO53&\":$K$\"&$DP53)>0))>0,SUMPRODUCT(--(INDIRECT(\"WP!$C$\"&$DO53&\":$C$\"&$DP53)=$C53),--(INDIRECT(\"WP!$\"&$BD$41&\"$\"&$DO53&\":$\"&$BD$41&\"$\"&$DP53)<>\"\"),INDIRECT(\"WP!$K\"&$DO53&\":$K\"&$DP53),INDIRECT(\"WP!$\"&$BD$41&\"$\"&$DO53&\":$\"&$BD$41&\"$\"&$DP53))/SUMPRODUCT(--(INDIRECT(\"WP!$C$\"&$DO53&\":$C$\"&$DP53)=$C53),--(INDIRECT(\"WP!$\"&$BD$41&\"$\"&$DO53&\":$\"&$BD$41&\"$\"&$DP53)<>\"\"),INDIRECT(\"WP!$K\"&$DO53&\":$K\"&$DP53)),\"\"),\"\"),\"\")","v":""},{"$f":"IFERROR(IF(WpAreaA_Sub2_exist,IF(SUMPRODUCT(--(INDIRECT(\"WP!$C$\"&$DO53&\":$C$\"&$DP53)=$C53),--(INDIRECT(\"WP!$B\"&$DO53&\":$B\"&$DP53)=\"Y\"),--(INDIRECT(\"WP!$\"&$BD$41&\"$\"&$DO53&\":$\"&$BD$41&\"$\"&$DP53)=1),--(INDIRECT(\"WP!$K\"&$DO53&\":$K\"&$DP53)>0))<>0,SUMPRODUCT(--(INDIRECT(\"WP!$C$\"&$DO53&\":$C$\"&$DP53)=$C53),--(INDIRECT(\"WP!$B\"&$DO53&\":$B\"&$DP53)=\"Y\"),--(INDIRECT(\"WP!$\"&$BD$41&\"$\"&$DO53&\":$\"&$BD$41&\"$\"&$DP53)=1),INDIRECT(\"WP!$K\"&$DO53&\":$K\"&$DP53)),IF(BF53<>\"\",0,\"\")),\"\"),\"\")","v":""},{"$f":"IFERROR(IF(WpAreaA_Sub2_exist,IF(SUMPRODUCT(--(INDIRECT(\"WP!$C$\"&$DO53&\":$C$\"&$DP53)=$C53),--(INDIRECT(\"WP!$B\"&$DO53&\":$B\"&$DP53)=\"Y\"),--(INDIRECT(\"WP!$\"&$BD$41&\"$\"&$DO53&\":$\"&$BD$41&\"$\"&$DP53)<>\"\"),--(INDIRECT(\"WP!$K\"&$DO53&\":$K\"&$DP53)>0))<>0,SUMPRODUCT(--(INDIRECT(\"WP!$C$\"&$DO53&\":$C$\"&$DP53)=$C53),--(INDIRECT(\"WP!$B\"&$DO53&\":$B\"&$DP53)=\"Y\"),--(INDIRECT(\"WP!$\"&$BD$41&\"$\"&$DO53&\":$\"&$BD$41&\"$\"&$DP53)<>\"\"),INDIRECT(\"WP!$K\"&$DO53&\":$K\"&$DP53)),\"\"),\"\"),\"\")","v":""},{"$f":"IFERROR(IF(WpAreaA_Sub3_exist,IF(SUMPRODUCT(--(INDIRECT(\"WP!$C$\"&$DO53&\":$C$\"&$DP53)=$C53),--(INDIRECT(\"WP!$\"&$BG$41&\"$\"&$DO53&\":$\"&$BG$41&\"$\"&$DP53)<>\"\"),--(INDIRECT(\"WP!$K$\"&$DO53&\":$K$\"&$DP53)>0))>0,SUMPRODUCT(--(INDIRECT(\"WP!$C$\"&$DO53&\":$C$\"&$DP53)=$C53),--(INDIRECT(\"WP!$\"&$BG$41&\"$\"&$DO53&\":$\"&$BG$41&\"$\"&$DP53)<>\"\"),INDIRECT(\"WP!$K\"&$DO53&\":$K\"&$DP53),INDIRECT(\"WP!$\"&$BG$41&\"$\"&$DO53&\":$\"&$BG$41&\"$\"&$DP53))/SUMPRODUCT(--(INDIRECT(\"WP!$C$\"&$DO53&\":$C$\"&$DP53)=$C53),--(INDIRECT(\"WP!$\"&$BG$41&\"$\"&$DO53&\":$\"&$BG$41&\"$\"&$DP53)<>\"\"),INDIRECT(\"WP!$K\"&$DO53&\":$K\"&$DP53)),\"\"),\"\"),\"\")","v":""},{"$f":"IFERROR(IF(WpAreaA_Sub3_exist,IF(SUMPRODUCT(--(INDIRECT(\"WP!$C$\"&$DO53&\":$C$\"&$DP53)=$C53),--(INDIRECT(\"WP!$B\"&$DO53&\":$B\"&$DP53)=\"Y\"),--(INDIRECT(\"WP!$\"&$BG$41&\"$\"&$DO53&\":$\"&$BG$41&\"$\"&$DP53)=1),--(INDIRECT(\"WP!$K\"&$DO53&\":$K\"&$DP53)>0))<>0,SUMPRODUCT(--(INDIRECT(\"WP!$C$\"&$DO53&\":$C$\"&$DP53)=$C53),--(INDIRECT(\"WP!$B\"&$DO53&\":$B\"&$DP53)=\"Y\"),--(INDIRECT(\"WP!$\"&$BG$41&\"$\"&$DO53&\":$\"&$BG$41&\"$\"&$DP53)=1),INDIRECT(\"WP!$K\"&$DO53&\":$K\"&$DP53)),IF(BI53<>\"\",0,\"\")),\"\"),\"\")","v":""},{"$f":"IFERROR(IF(WpAreaA_Sub3_exist,IF(SUMPRODUCT(--(INDIRECT(\"WP!$C$\"&$DO53&\":$C$\"&$DP53)=$C53),--(INDIRECT(\"WP!$B\"&$DO53&\":$B\"&$DP53)=\"Y\"),--(INDIRECT(\"WP!$\"&$BG$41&\"$\"&$DO53&\":$\"&$BG$41&\"$\"&$DP53)<>\"\"),--(INDIRECT(\"WP!$K\"&$DO53&\":$K\"&$DP53)>0))<>0,SUMPRODUCT(--(INDIRECT(\"WP!$C$\"&$DO53&\":$C$\"&$DP53)=$C53),--(INDIRECT(\"WP!$B\"&$DO53&\":$B\"&$DP53)=\"Y\"),--(INDIRECT(\"WP!$\"&$BG$41&\"$\"&$DO53&\":$\"&$BG$41&\"$\"&$DP53)<>\"\"),INDIRECT(\"WP!$K\"&$DO53&\":$K\"&$DP53)),\"\"),\"\"),\"\")","v":""},null,{"$f":"IFERROR(IF(WpAreaB_Sub1_exist,IF(SUMPRODUCT(--(INDIRECT(\"WP!$C$\"&$DO53&\":$C$\"&$DP53)=$C53),--(INDIRECT(\"WP!$\"&$BK$41&\"$\"&$DO53&\":$\"&$BK$41&\"$\"&$DP53)<>\"\"),--(INDIRECT(\"WP!$K$\"&$DO53&\":$K$\"&$DP53)>0))>0,SUMPRODUCT(--(INDIRECT(\"WP!$C$\"&$DO53&\":$C$\"&$DP53)=$C53),--(INDIRECT(\"WP!$\"&$BK$41&\"$\"&$DO53&\":$\"&$BK$41&\"$\"&$DP53)<>\"\"),INDIRECT(\"WP!$K\"&$DO53&\":$K\"&$DP53),INDIRECT(\"WP!$\"&$BK$41&\"$\"&$DO53&\":$\"&$BK$41&\"$\"&$DP53))/SUMPRODUCT(--(INDIRECT(\"WP!$C$\"&$DO53&\":$C$\"&$DP53)=$C53),--(INDIRECT(\"WP!$\"&$BK$41&\"$\"&$DO53&\":$\"&$BK$41&\"$\"&$DP53)<>\"\"),INDIRECT(\"WP!$K\"&$DO53&\":$K\"&$DP53)),\"\"),\"\"),\"\")","v":""},{"$f":"IFERROR(IF(WpAreaB_Sub1_exist,IF(SUMPRODUCT(--(INDIRECT(\"WP!$C$\"&$DO53&\":$C$\"&$DP53)=$C53),--(INDIRECT(\"WP!$B\"&$DO53&\":$B\"&$DP53)=\"Y\"),--(INDIRECT(\"WP!$\"&$BK$41&\"$\"&$DO53&\":$\"&$BK$41&\"$\"&$DP53)=1),--(INDIRECT(\"WP!$K\"&$DO53&\":$K\"&$DP53)>0))<>0,SUMPRODUCT(--(INDIRECT(\"WP!$C$\"&$DO53&\":$C$\"&$DP53)=$C53),--(INDIRECT(\"WP!$B\"&$DO53&\":$B\"&$DP53)=\"Y\"),--(INDIRECT(\"WP!$\"&$BK$41&\"$\"&$DO53&\":$\"&$BK$41&\"$\"&$DP53)=1),INDIRECT(\"WP!$K\"&$DO53&\":$K\"&$DP53)),IF(BM53<>\"\",0,\"\")),\"\"),\"\")","v":""},{"$f":"IFERROR(IF(WpAreaB_Sub1_exist,IF(SUMPRODUCT(--(INDIRECT(\"WP!$C$\"&$DO53&\":$C$\"&$DP53)=$C53),--(INDIRECT(\"WP!$B\"&$DO53&\":$B\"&$DP53)=\"Y\"),--(INDIRECT(\"WP!$\"&$BK$41&\"$\"&$DO53&\":$\"&$BK$41&\"$\"&$DP53)<>\"\"),--(INDIRECT(\"WP!$K\"&$DO53&\":$K\"&$DP53)>0))<>0,SUMPRODUCT(--(INDIRECT(\"WP!$C$\"&$DO53&\":$C$\"&$DP53)=$C53),--(INDIRECT(\"WP!$B\"&$DO53&\":$B\"&$DP53)=\"Y\"),--(INDIRECT(\"WP!$\"&$BK$41&\"$\"&$DO53&\":$\"&$BK$41&\"$\"&$DP53)<>\"\"),INDIRECT(\"WP!$K\"&$DO53&\":$K\"&$DP53)),\"\"),\"\"),\"\")","v":""},{"$f":"IFERROR(IF(WpAreaB_Sub2_exist,IF(SUMPRODUCT(--(INDIRECT(\"WP!$C$\"&$DO53&\":$C$\"&$DP53)=$C53),--(INDIRECT(\"WP!$\"&$BN$41&\"$\"&$DO53&\":$\"&$BN$41&\"$\"&$DP53)<>\"\"),--(INDIRECT(\"WP!$K$\"&$DO53&\":$K$\"&$DP53)>0))>0,SUMPRODUCT(--(INDIRECT(\"WP!$C$\"&$DO53&\":$C$\"&$DP53)=$C53),--(INDIRECT(\"WP!$\"&$BN$41&\"$\"&$DO53&\":$\"&$BN$41&\"$\"&$DP53)<>\"\"),INDIRECT(\"WP!$K\"&$DO53&\":$K\"&$DP53),INDIRECT(\"WP!$\"&$BN$41&\"$\"&$DO53&\":$\"&$BN$41&\"$\"&$DP53))/SUMPRODUCT(--(INDIRECT(\"WP!$C$\"&$DO53&\":$C$\"&$DP53)=$C53),--(INDIRECT(\"WP!$\"&$BN$41&\"$\"&$DO53&\":$\"&$BN$41&\"$\"&$DP53)<>\"\"),INDIRECT(\"WP!$K\"&$DO53&\":$K\"&$DP53)),\"\"),\"\"),\"\")","v":""},{"$f":"IFERROR(IF(WpAreaB_Sub2_exist,IF(SUMPRODUCT(--(INDIRECT(\"WP!$C$\"&$DO53&\":$C$\"&$DP53)=$C53),--(INDIRECT(\"WP!$B\"&$DO53&\":$B\"&$DP53)=\"Y\"),--(INDIRECT(\"WP!$\"&$BN$41&\"$\"&$DO53&\":$\"&$BN$41&\"$\"&$DP53)=1),--(INDIRECT(\"WP!$K\"&$DO53&\":$K\"&$DP53)>0))<>0,SUMPRODUCT(--(INDIRECT(\"WP!$C$\"&$DO53&\":$C$\"&$DP53)=$C53),--(INDIRECT(\"WP!$B\"&$DO53&\":$B\"&$DP53)=\"Y\"),--(INDIRECT(\"WP!$\"&$BN$41&\"$\"&$DO53&\":$\"&$BN$41&\"$\"&$DP53)=1),INDIRECT(\"WP!$K\"&$DO53&\":$K\"&$DP53)),IF(BP53<>\"\",0,\"\")),\"\"),\"\")","v":""},{"$f":"IFERROR(IF(WpAreaB_Sub2_exist,IF(SUMPRODUCT(--(INDIRECT(\"WP!$C$\"&$DO53&\":$C$\"&$DP53)=$C53),--(INDIRECT(\"WP!$B\"&$DO53&\":$B\"&$DP53)=\"Y\"),--(INDIRECT(\"WP!$\"&$BN$41&\"$\"&$DO53&\":$\"&$BN$41&\"$\"&$DP53)<>\"\"),--(INDIRECT(\"WP!$K\"&$DO53&\":$K\"&$DP53)>0))<>0,SUMPRODUCT(--(INDIRECT(\"WP!$C$\"&$DO53&\":$C$\"&$DP53)=$C53),--(INDIRECT(\"WP!$B\"&$DO53&\":$B\"&$DP53)=\"Y\"),--(INDIRECT(\"WP!$\"&$BN$41&\"$\"&$DO53&\":$\"&$BN$41&\"$\"&$DP53)<>\"\"),INDIRECT(\"WP!$K\"&$DO53&\":$K\"&$DP53)),\"\"),\"\"),\"\")","v":""},{"$f":"IFERROR(IF(WpAreaB_Sub3_exist,IF(SUMPRODUCT(--(INDIRECT(\"WP!$C$\"&$DO53&\":$C$\"&$DP53)=$C53),--(INDIRECT(\"WP!$\"&$BQ$41&\"$\"&$DO53&\":$\"&$BQ$41&\"$\"&$DP53)<>\"\"),--(INDIRECT(\"WP!$K$\"&$DO53&\":$K$\"&$DP53)>0))>0,SUMPRODUCT(--(INDIRECT(\"WP!$C$\"&$DO53&\":$C$\"&$DP53)=$C53),--(INDIRECT(\"WP!$\"&$BQ$41&\"$\"&$DO53&\":$\"&$BQ$41&\"$\"&$DP53)<>\"\"),INDIRECT(\"WP!$K\"&$DO53&\":$K\"&$DP53),INDIRECT(\"WP!$\"&$BQ$41&\"$\"&$DO53&\":$\"&$BQ$41&\"$\"&$DP53))/SUMPRODUCT(--(INDIRECT(\"WP!$C$\"&$DO53&\":$C$\"&$DP53)=$C53),--(INDIRECT(\"WP!$\"&$BQ$41&\"$\"&$DO53&\":$\"&$BQ$41&\"$\"&$DP53)<>\"\"),INDIRECT(\"WP!$K\"&$DO53&\":$K\"&$DP53)),\"\"),\"\"),\"\")","v":""},{"$f":"IFERROR(IF(WpAreaB_Sub3_exist,IF(SUMPRODUCT(--(INDIRECT(\"WP!$C$\"&$DO53&\":$C$\"&$DP53)=$C53),--(INDIRECT(\"WP!$B\"&$DO53&\":$B\"&$DP53)=\"Y\"),--(INDIRECT(\"WP!$\"&$BQ$41&\"$\"&$DO53&\":$\"&$BQ$41&\"$\"&$DP53)=1),--(INDIRECT(\"WP!$K\"&$DO53&\":$K\"&$DP53)>0))<>0,SUMPRODUCT(--(INDIRECT(\"WP!$C$\"&$DO53&\":$C$\"&$DP53)=$C53),--(INDIRECT(\"WP!$B\"&$DO53&\":$B\"&$DP53)=\"Y\"),--(INDIRECT(\"WP!$\"&$BQ$41&\"$\"&$DO53&\":$\"&$BQ$41&\"$\"&$DP53)=1),INDIRECT(\"WP!$K\"&$DO53&\":$K\"&$DP53)),IF(BS53<>\"\",0,\"\")),\"\"),\"\")","v":""},{"$f":"IFERROR(IF(WpAreaB_Sub3_exist,IF(SUMPRODUCT(--(INDIRECT(\"WP!$C$\"&$DO53&\":$C$\"&$DP53)=$C53),--(INDIRECT(\"WP!$B\"&$DO53&\":$B\"&$DP53)=\"Y\"),--(INDIRECT(\"WP!$\"&$BQ$41&\"$\"&$DO53&\":$\"&$BQ$41&\"$\"&$DP53)<>\"\"),--(INDIRECT(\"WP!$K\"&$DO53&\":$K\"&$DP53)>0))<>0,SUMPRODUCT(--(INDIRECT(\"WP!$C$\"&$DO53&\":$C$\"&$DP53)=$C53),--(INDIRECT(\"WP!$B\"&$DO53&\":$B\"&$DP53)=\"Y\"),--(INDIRECT(\"WP!$\"&$BQ$41&\"$\"&$DO53&\":$\"&$BQ$41&\"$\"&$DP53)<>\"\"),INDIRECT(\"WP!$K\"&$DO53&\":$K\"&$DP53)),\"\"),\"\"),\"\")","v":""},null,{"$f":"IFERROR(IF(WpAreaC_Sub1_exist,IF(SUMPRODUCT(--(INDIRECT(\"WP!$C$\"&$DO53&\":$C$\"&$DP53)=$C53),--(INDIRECT(\"WP!$\"&$BU$41&\"$\"&$DO53&\":$\"&$BU$41&\"$\"&$DP53)<>\"\"),--(INDIRECT(\"WP!$K$\"&$DO53&\":$K$\"&$DP53)>0))>0,SUMPRODUCT(--(INDIRECT(\"WP!$C$\"&$DO53&\":$C$\"&$DP53)=$C53),--(INDIRECT(\"WP!$\"&$BU$41&\"$\"&$DO53&\":$\"&$BU$41&\"$\"&$DP53)<>\"\"),INDIRECT(\"WP!$K\"&$DO53&\":$K\"&$DP53),INDIRECT(\"WP!$\"&$BU$41&\"$\"&$DO53&\":$\"&$BU$41&\"$\"&$DP53))/SUMPRODUCT(--(INDIRECT(\"WP!$C$\"&$DO53&\":$C$\"&$DP53)=$C53),--(INDIRECT(\"WP!$\"&$BU$41&\"$\"&$DO53&\":$\"&$BU$41&\"$\"&$DP53)<>\"\"),INDIRECT(\"WP!$K\"&$DO53&\":$K\"&$DP53)),\"\"),\"\"),\"\")","v":""},{"$f":"IFERROR(IF(WpAreaC_Sub1_exist,IF(SUMPRODUCT(--(INDIRECT(\"WP!$C$\"&$DO53&\":$C$\"&$DP53)=$C53),--(INDIRECT(\"WP!$B\"&$DO53&\":$B\"&$DP53)=\"Y\"),--(INDIRECT(\"WP!$\"&$BU$41&\"$\"&$DO53&\":$\"&$BU$41&\"$\"&$DP53)=1),--(INDIRECT(\"WP!$K\"&$DO53&\":$K\"&$DP53)>0))<>0,SUMPRODUCT(--(INDIRECT(\"WP!$C$\"&$DO53&\":$C$\"&$DP53)=$C53),--(INDIRECT(\"WP!$B\"&$DO53&\":$B\"&$DP53)=\"Y\"),--(INDIRECT(\"WP!$\"&$BU$41&\"$\"&$DO53&\":$\"&$BU$41&\"$\"&$DP53)=1),INDIRECT(\"WP!$K\"&$DO53&\":$K\"&$DP53)),IF(BW53<>\"\",0,\"\")),\"\"),\"\")","v":""},{"$f":"IFERROR(IF(WpAreaC_Sub1_exist,IF(SUMPRODUCT(--(INDIRECT(\"WP!$C$\"&$DO53&\":$C$\"&$DP53)=$C53),--(INDIRECT(\"WP!$B\"&$DO53&\":$B\"&$DP53)=\"Y\"),--(INDIRECT(\"WP!$\"&$BU$41&\"$\"&$DO53&\":$\"&$BU$41&\"$\"&$DP53)<>\"\"),--(INDIRECT(\"WP!$K\"&$DO53&\":$K\"&$DP53)>0))<>0,SUMPRODUCT(--(INDIRECT(\"WP!$C$\"&$DO53&\":$C$\"&$DP53)=$C53),--(INDIRECT(\"WP!$B\"&$DO53&\":$B\"&$DP53)=\"Y\"),--(INDIRECT(\"WP!$\"&$BU$41&\"$\"&$DO53&\":$\"&$BU$41&\"$\"&$DP53)<>\"\"),INDIRECT(\"WP!$K\"&$DO53&\":$K\"&$DP53)),\"\"),\"\"),\"\")","v":""},{"$f":"IFERROR(IF(WpAreaC_Sub2_exist,IF(SUMPRODUCT(--(INDIRECT(\"WP!$C$\"&$DO53&\":$C$\"&$DP53)=$C53),--(INDIRECT(\"WP!$\"&$BX$41&\"$\"&$DO53&\":$\"&$BX$41&\"$\"&$DP53)<>\"\"),--(INDIRECT(\"WP!$K$\"&$DO53&\":$K$\"&$DP53)>0))>0,SUMPRODUCT(--(INDIRECT(\"WP!$C$\"&$DO53&\":$C$\"&$DP53)=$C53),--(INDIRECT(\"WP!$\"&$BX$41&\"$\"&$DO53&\":$\"&$BX$41&\"$\"&$DP53)<>\"\"),INDIRECT(\"WP!$K\"&$DO53&\":$K\"&$DP53),INDIRECT(\"WP!$\"&$BX$41&\"$\"&$DO53&\":$\"&$BX$41&\"$\"&$DP53))/SUMPRODUCT(--(INDIRECT(\"WP!$C$\"&$DO53&\":$C$\"&$DP53)=$C53),--(INDIRECT(\"WP!$\"&$BX$41&\"$\"&$DO53&\":$\"&$BX$41&\"$\"&$DP53)<>\"\"),INDIRECT(\"WP!$K\"&$DO53&\":$K\"&$DP53)),\"\"),\"\"),\"\")","v":""},{"$f":"IFERROR(IF(WpAreaC_Sub2_exist,IF(SUMPRODUCT(--(INDIRECT(\"WP!$C$\"&$DO53&\":$C$\"&$DP53)=$C53),--(INDIRECT(\"WP!$B\"&$DO53&\":$B\"&$DP53)=\"Y\"),--(INDIRECT(\"WP!$\"&$BX$41&\"$\"&$DO53&\":$\"&$BX$41&\"$\"&$DP53)=1),--(INDIRECT(\"WP!$K\"&$DO53&\":$K\"&$DP53)>0))<>0,SUMPRODUCT(--(INDIRECT(\"WP!$C$\"&$DO53&\":$C$\"&$DP53)=$C53),--(INDIRECT(\"WP!$B\"&$DO53&\":$B\"&$DP53)=\"Y\"),--(INDIRECT(\"WP!$\"&$BX$41&\"$\"&$DO53&\":$\"&$BX$41&\"$\"&$DP53)=1),INDIRECT(\"WP!$K\"&$DO53&\":$K\"&$DP53)),IF(BZ53<>\"\",0,\"\")),\"\"),\"\")","v":""},{"$f":"IFERROR(IF(WpAreaC_Sub2_exist,IF(SUMPRODUCT(--(INDIRECT(\"WP!$C$\"&$DO53&\":$C$\"&$DP53)=$C53),--(INDIRECT(\"WP!$B\"&$DO53&\":$B\"&$DP53)=\"Y\"),--(INDIRECT(\"WP!$\"&$BX$41&\"$\"&$DO53&\":$\"&$BX$41&\"$\"&$DP53)<>\"\"),--(INDIRECT(\"WP!$K\"&$DO53&\":$K\"&$DP53)>0))<>0,SUMPRODUCT(--(INDIRECT(\"WP!$C$\"&$DO53&\":$C$\"&$DP53)=$C53),--(INDIRECT(\"WP!$B\"&$DO53&\":$B\"&$DP53)=\"Y\"),--(INDIRECT(\"WP!$\"&$BX$41&\"$\"&$DO53&\":$\"&$BX$41&\"$\"&$DP53)<>\"\"),INDIRECT(\"WP!$K\"&$DO53&\":$K\"&$DP53)),\"\"),\"\"),\"\")","v":""},{"$f":"IFERROR(IF(WpAreaC_Sub3_exist,IF(SUMPRODUCT(--(INDIRECT(\"WP!$C$\"&$DO53&\":$C$\"&$DP53)=$C53),--(INDIRECT(\"WP!$\"&$CA$41&\"$\"&$DO53&\":$\"&$CA$41&\"$\"&$DP53)<>\"\"),--(INDIRECT(\"WP!$K$\"&$DO53&\":$K$\"&$DP53)>0))>0,SUMPRODUCT(--(INDIRECT(\"WP!$C$\"&$DO53&\":$C$\"&$DP53)=$C53),--(INDIRECT(\"WP!$\"&$CA$41&\"$\"&$DO53&\":$\"&$CA$41&\"$\"&$DP53)<>\"\"),INDIRECT(\"WP!$K\"&$DO53&\":$K\"&$DP53),INDIRECT(\"WP!$\"&$CA$41&\"$\"&$DO53&\":$\"&$CA$41&\"$\"&$DP53))/SUMPRODUCT(--(INDIRECT(\"WP!$C$\"&$DO53&\":$C$\"&$DP53)=$C53),--(INDIRECT(\"WP!$\"&$CA$41&\"$\"&$DO53&\":$\"&$CA$41&\"$\"&$DP53)<>\"\"),INDIRECT(\"WP!$K\"&$DO53&\":$K\"&$DP53)),\"\"),\"\"),\"\")","v":""},{"$f":"IFERROR(IF(WpAreaC_Sub3_exist,IF(SUMPRODUCT(--(INDIRECT(\"WP!$C$\"&$DO53&\":$C$\"&$DP53)=$C53),--(INDIRECT(\"WP!$B\"&$DO53&\":$B\"&$DP53)=\"Y\"),--(INDIRECT(\"WP!$\"&$CA$41&\"$\"&$DO53&\":$\"&$CA$41&\"$\"&$DP53)=1),--(INDIRECT(\"WP!$K\"&$DO53&\":$K\"&$DP53)>0))<>0,SUMPRODUCT(--(INDIRECT(\"WP!$C$\"&$DO53&\":$C$\"&$DP53)=$C53),--(INDIRECT(\"WP!$B\"&$DO53&\":$B\"&$DP53)=\"Y\"),--(INDIRECT(\"WP!$\"&$CA$41&\"$\"&$DO53&\":$\"&$CA$41&\"$\"&$DP53)=1),INDIRECT(\"WP!$K\"&$DO53&\":$K\"&$DP53)),IF(CC53<>\"\",0,\"\")),\"\"),\"\")","v":""},{"$f":"IFERROR(IF(WpAreaC_Sub3_exist,IF(SUMPRODUCT(--(INDIRECT(\"WP!$C$\"&$DO53&\":$C$\"&$DP53)=$C53),--(INDIRECT(\"WP!$B\"&$DO53&\":$B\"&$DP53)=\"Y\"),--(INDIRECT(\"WP!$\"&$CA$41&\"$\"&$DO53&\":$\"&$CA$41&\"$\"&$DP53)<>\"\"),--(INDIRECT(\"WP!$K\"&$DO53&\":$K\"&$DP53)>0))<>0,SUMPRODUCT(--(INDIRECT(\"WP!$C$\"&$DO53&\":$C$\"&$DP53)=$C53),--(INDIRECT(\"WP!$B\"&$DO53&\":$B\"&$DP53)=\"Y\"),--(INDIRECT(\"WP!$\"&$CA$41&\"$\"&$DO53&\":$\"&$CA$41&\"$\"&$DP53)<>\"\"),INDIRECT(\"WP!$K\"&$DO53&\":$K\"&$DP53)),\"\"),\"\"),\"\")","v":""},null,null,null,null,"","","","","","","","","","","","",null,"","","","","","","","","",null,"","","","","","","","","",null,{"$f":"MIN(IF(WP!$C$12:$C$79=$C53,ROW(WP!$C$12:$C$79),\"\"))","v":68},{"$f":"MAX(IF(WP!$C$12:$C$79=$C53,ROW(WP!$C$12:$C$79),\"\"))","v":74}]
[null,"Applicability Protocol test cases","36.523-2",{"$f":"getProgress(AX54,CH54,\"%\",1,1)","v":"0%"},{"$f":"getProgress(AY54,CI54,,,1)","v":""},{"$f":"getProgress(AZ54,CJ54,,,1)","v":""},null,{"$f":"getProgress(BA54,CK54,\"%\",1,1,WpAreaA_Sub1_exist)","v":"0%"},{"$f":"getProgress(BB54,CL54,,,1,WpAreaA_Sub1_exist)","v":""},{"$f":"getProgress(BC54,CM54,,,1,WpAreaA_Sub1_exist)","v":""},{"$f":"getProgress(BD54,CN54,\"%\",1,1,WpAreaA_Sub2_exist)","v":""},{"$f":"getProgress(BE54,CO54,,,1,WpAreaA_Sub2_exist)","v":""},{"$f":"getProgress(BF54,CP54,,,1,WpAreaA_Sub2_exist)","v":""},{"$f":"getProgress(BG54,CQ54,\"%\",1,1,WpAreaA_Sub3_exist)","v":""},{"$f":"getProgress(BH54,CR54,,,1,WpAreaA_Sub3_exist)","v":""},{"$f":"getProgress(BI54,CS54,,,1,WpAreaA_Sub3_exist)","v":""},null,{"$f":"getProgress(BK54,CU54,\"%\",1,1,WpAreaB_Sub1_exist)","v":""},{"$f":"getProgress(BL54,CV54,,,1,WpAreaB_Sub1_exist)","v":""},{"$f":"getProgress(BM54,CW54,,,1,WpAreaB_Sub1_exist)","v":""},{"$f":"getProgress(BN54,CX54,\"%\",1,1,WpAreaB_Sub2_exist)","v":""},{"$f":"getProgress(BO54,CY54,,,1,WpAreaB_Sub2_exist)","v":""},{"$f":"getProgress(BP54,CZ54,,,1,WpAreaB_Sub2_exist)","v":""},{"$f":"getProgress(BQ54,DA54,\"%\",1,1,WpAreaB_Sub3_exist)","v":""},{"$f":"getProgress(BR54,DB54,,,1,WpAreaB_Sub3_exist)","v":""},{"$f":"getProgress(BS54,DC54,,,1,WpAreaB_Sub3_exist)","v":""},null,{"$f":"getProgress(BU54,DE54,\"%\",1,1,WpAreaC_Sub1_exist)","v":""},{"$f":"getProgress(BV54,DF54,,,1,WpAreaC_Sub1_exist)","v":""},{"$f":"getProgress(BW54,DG54,,,1,WpAreaC_Sub1_exist)","v":""},{"$f":"getProgress(BX54,DH54,\"%\",1,1,WpAreaC_Sub2_exist)","v":""},{"$f":"getProgress(BY54,DI54,,,1,WpAreaC_Sub2_exist)","v":""},{"$f":"getProgress(BZ54,DJ54,,,1,WpAreaC_Sub2_exist)","v":""},{"$f":"getProgress(CA54,DK54,\"%\",1,1,WpAreaC_Sub3_exist)","v":""},{"$f":"getProgress(CB54,DL54,,,1,WpAreaC_Sub3_exist)","v":""},{"$f":"getProgress(CC54,DM54,,,1,WpAreaC_Sub3_exist)","v":""},null,null,null,null,null,null,null,null,null,null,null,null,null,{"$f":"IFERROR((IF(WpAreaA_exist,IF(BA54<>\"\",BA54*WP!$AB$9,0)+IF(BD54<>\"\",BD54*WP!$AC$9,0)+IF(BG54<>\"\",BG54*WP!$AD$9,0),0)+IF(WpAreaB_exist,IF(BK54<>\"\",BK54*WP!$AE$10)+IF(BN54<>\"\",BN54*WP!$AF$10,0)+IF(BQ54<>\"\",BQ54*WP!$AG$10,0),0)+IF(WpAreaC_exist,IF(BU54<>\"\",BU54*WP!$AH$10)+IF(BX54<>\"\",BX54*WP!$AI$10,0)+IF(CA54<>\"\",CA54*WP!$AJ$10,0),0))/(IF(WpAreaA_exist,IF(BA54<>\"\",WP!$AB$9,0)+IF(BD54<>\"\",WP!$AC$9,0)+IF(BG54<>\"\",WP!$AD$9,0),0)+IF(WpAreaB_exist,IF(BK54<>\"\",WP!$AE$10,0)+IF(BN54<>\"\",WP!$AF$10,0)+IF(BQ54<>\"\",WP!$AG$10,0),0)+IF(WpAreaC_exist,IF(BU54<>\"\",WP!$AH$10,0)+IF(BX54<>\"\",WP!$AI$10,0)+IF(CA54<>\"\",WP!$AJ$10,0),0)),\"\")","v":0},{"$f":"IFERROR(IF(SUMPRODUCT(--(INDIRECT(\"WP!$C$\"&$DO54&\":$C$\"&$DP54)=$C54),--(INDIRECT(\"WP!$B$\"&$DO54&\":$B$\"&$DP54)=\"Y\"),--(INDIRECT(\"WP!$\"&$AX$41&\"$\"&$DO54&\":$\"&$AX$41&\"$\"&$DP54)=1),--(INDIRECT(\"WP!$K$\"&$DO54&\":$K$\"&$DP54)>0))<>0,SUMPRODUCT(--(INDIRECT(\"WP!$C$\"&$DO54&\":$C$\"&$DP54)=$C54),--(INDIRECT(\"WP!$B$\"&$DO54&\":$B$\"&$DP54)=\"Y\"),--(INDIRECT(\"WP!$\"&$AX$41&\"$\"&$DO54&\":$\"&$AX$41&\"$\"&$DP54)=1),INDIRECT(\"WP!$K$\"&$DO54&\":$K$\"&$DP54)),IF(AZ54<>\"\",0,\"\")),\"\")","v":""},{"$f":"IFERROR(IF(SUMPRODUCT(--(INDIRECT(\"WP!$C$\"&$DO54&\":$C$\"&$DP54)=$C54),--(INDIRECT(\"WP!$B\"&$DO54&\":$B\"&$DP54)=\"Y\"),--(INDIRECT(\"WP!$\"&$AX$41&\"$\"&$DO54&\":$\"&$AX$41&\"$\"&$DP54)<>\"\"),--(INDIRECT(\"WP!$K\"&$DO54&\":$K\"&$DP54)>0))<>0,SUMPRODUCT(--(INDIRECT(\"WP!$C$\"&$DO54&\":$C$\"&$DP54)=$C54),--(INDIRECT(\"WP!$B\"&$DO54&\":$B\"&$DP54)=\"Y\"),--(INDIRECT(\"WP!$\"&$AX$41&\"$\"&$DO54&\":$\"&$AX$41&\"$\"&$DP54)<>\"\"),INDIRECT(\"WP!$K\"&$DO54&\":$K\"&$DP54)),\"\"),\"\")","v":""},{"$f":"IFERROR(IF(WpAreaA_Sub1_exist,IF(SUMPRODUCT(--(INDIRECT(\"WP!$C$\"&$DO54&\":$C$\"&$DP54)=$C54),--(INDIRECT(\"WP!$\"&$BA$41&\"$\"&$DO54&\":$\"&$BA$41&\"$\"&$DP54)<>\"\"),--(INDIRECT(\"WP!$K$\"&$DO54&\":$K$\"&$DP54)>0))>0,SUMPRODUCT(--(INDIRECT(\"WP!$C$\"&$DO54&\":$C$\"&$DP54)=$C54),--(INDIRECT(\"WP!$\"&$BA$41&\"$\"&$DO54&\":$\"&$BA$41&\"$\"&$DP54)<>\"\"),INDIRECT(\"WP!$K$\"&$DO54&\":$K$\"&$DP54),INDIRECT(\"WP!$\"&$BA$41&\"$\"&$DO54&\":$\"&$BA$41&\"$\"&$DP54))/SUMPRODUCT(--(INDIRECT(\"WP!$C$\"&$DO54&\":$C$\"&$DP54)=$C54),--(INDIRECT(\"WP!$\"&$BA$41&\"$\"&$DO54&\":$\"&$BA$41&\"$\"&$DP54)<>\"\"),INDIRECT(\"WP!$K$\"&$DO54&\":$K$\"&$DP54)),\"\"),\"\"),\"\")","v":0},{"$f":"IFERROR(IF(WpAreaA_Sub1_exist,IF(SUMPRODUCT(--(INDIRECT(\"WP!$C$\"&$DO54&\":$C$\"&$DP54)=$C54),--(INDIRECT(\"WP!$B$\"&$DO54&\":$B$\"&$DP54)=\"Y\"),--(INDIRECT(\"WP!$\"&$BA$41&\"$\"&$DO54&\":$\"&$BA$41&\"$\"&$DP54)=1),--(INDIRECT(\"WP!$K$\"&$DO54&\":$K$\"&$DP54)>0))<>0,SUMPRODUCT(--(INDIRECT(\"WP!$C$\"&$DO54&\":$C$\"&$DP54)=$C54),--(INDIRECT(\"WP!$B$\"&$DO54&\":$B$\"&$DP54)=\"Y\"),--(INDIRECT(\"WP!$\"&$BA$41&\"$\"&$DO54&\":$\"&$BA$41&\"$\"&$DP54)=1),INDIRECT(\"WP!$K$\"&$DO54&\":$K$\"&$DP54)),IF(BC54<>\"\",0,\"\")),\"\"),\"\")","v":""},{"$f":"IFERROR(IF(WpAreaA_Sub1_exist,IF(SUMPRODUCT(--(INDIRECT(\"WP!$C$\"&$DO54&\":$C$\"&$DP54)=$C54),--(INDIRECT(\"WP!$B\"&$DO54&\":$B\"&$DP54)=\"Y\"),--(INDIRECT(\"WP!$\"&$BA$41&\"$\"&$DO54&\":$\"&$BA$41&\"$\"&$DP54)<>\"\"),--(INDIRECT(\"WP!$K\"&$DO54&\":$K\"&$DP54)>0))<>0,SUMPRODUCT(--(INDIRECT(\"WP!$C$\"&$DO54&\":$C$\"&$DP54)=$C54),--(INDIRECT(\"WP!$B\"&$DO54&\":$B\"&$DP54)=\"Y\"),--(INDIRECT(\"WP!$\"&$BA$41&\"$\"&$DO54&\":$\"&$BA$41&\"$\"&$DP54)<>\"\"),INDIRECT(\"WP!$K\"&$DO54&\":$K\"&$DP54)),\"\"),\"\"),\"\")","v":""},{"$f":"IFERROR(IF(WpAreaA_Sub2_exist,IF(SUMPRODUCT(--(INDIRECT(\"WP!$C$\"&$DO54&\":$C$\"&$DP54)=$C54),--(INDIRECT(\"WP!$\"&$BD$41&\"$\"&$DO54&\":$\"&$BD$41&\"$\"&$DP54)<>\"\"),--(INDIRECT(\"WP!$K$\"&$DO54&\":$K$\"&$DP54)>0))>0,SUMPRODUCT(--(INDIRECT(\"WP!$C$\"&$DO54&\":$C$\"&$DP54)=$C54),--(INDIRECT(\"WP!$\"&$BD$41&\"$\"&$DO54&\":$\"&$BD$41&\"$\"&$DP54)<>\"\"),INDIRECT(\"WP!$K\"&$DO54&\":$K\"&$DP54),INDIRECT(\"WP!$\"&$BD$41&\"$\"&$DO54&\":$\"&$BD$41&\"$\"&$DP54))/SUMPRODUCT(--(INDIRECT(\"WP!$C$\"&$DO54&\":$C$\"&$DP54)=$C54),--(INDIRECT(\"WP!$\"&$BD$41&\"$\"&$DO54&\":$\"&$BD$41&\"$\"&$DP54)<>\"\"),INDIRECT(\"WP!$K\"&$DO54&\":$K\"&$DP54)),\"\"),\"\"),\"\")","v":""},{"$f":"IFERROR(IF(WpAreaA_Sub2_exist,IF(SUMPRODUCT(--(INDIRECT(\"WP!$C$\"&$DO54&\":$C$\"&$DP54)=$C54),--(INDIRECT(\"WP!$B\"&$DO54&\":$B\"&$DP54)=\"Y\"),--(INDIRECT(\"WP!$\"&$BD$41&\"$\"&$DO54&\":$\"&$BD$41&\"$\"&$DP54)=1),--(INDIRECT(\"WP!$K\"&$DO54&\":$K\"&$DP54)>0))<>0,SUMPRODUCT(--(INDIRECT(\"WP!$C$\"&$DO54&\":$C$\"&$DP54)=$C54),--(INDIRECT(\"WP!$B\"&$DO54&\":$B\"&$DP54)=\"Y\"),--(INDIRECT(\"WP!$\"&$BD$41&\"$\"&$DO54&\":$\"&$BD$41&\"$\"&$DP54)=1),INDIRECT(\"WP!$K\"&$DO54&\":$K\"&$DP54)),IF(BF54<>\"\",0,\"\")),\"\"),\"\")","v":""},{"$f":"IFERROR(IF(WpAreaA_Sub2_exist,IF(SUMPRODUCT(--(INDIRECT(\"WP!$C$\"&$DO54&\":$C$\"&$DP54)=$C54),--(INDIRECT(\"WP!$B\"&$DO54&\":$B\"&$DP54)=\"Y\"),--(INDIRECT(\"WP!$\"&$BD$41&\"$\"&$DO54&\":$\"&$BD$41&\"$\"&$DP54)<>\"\"),--(INDIRECT(\"WP!$K\"&$DO54&\":$K\"&$DP54)>0))<>0,SUMPRODUCT(--(INDIRECT(\"WP!$C$\"&$DO54&\":$C$\"&$DP54)=$C54),--(INDIRECT(\"WP!$B\"&$DO54&\":$B\"&$DP54)=\"Y\"),--(INDIRECT(\"WP!$\"&$BD$41&\"$\"&$DO54&\":$\"&$BD$41&\"$\"&$DP54)<>\"\"),INDIRECT(\"WP!$K\"&$DO54&\":$K\"&$DP54)),\"\"),\"\"),\"\")","v":""},{"$f":"IFERROR(IF(WpAreaA_Sub3_exist,IF(SUMPRODUCT(--(INDIRECT(\"WP!$C$\"&$DO54&\":$C$\"&$DP54)=$C54),--(INDIRECT(\"WP!$\"&$BG$41&\"$\"&$DO54&\":$\"&$BG$41&\"$\"&$DP54)<>\"\"),--(INDIRECT(\"WP!$K$\"&$DO54&\":$K$\"&$DP54)>0))>0,SUMPRODUCT(--(INDIRECT(\"WP!$C$\"&$DO54&\":$C$\"&$DP54)=$C54),--(INDIRECT(\"WP!$\"&$BG$41&\"$\"&$DO54&\":$\"&$BG$41&\"$\"&$DP54)<>\"\"),INDIRECT(\"WP!$K\"&$DO54&\":$K\"&$DP54),INDIRECT(\"WP!$\"&$BG$41&\"$\"&$DO54&\":$\"&$BG$41&\"$\"&$DP54))/SUMPRODUCT(--(INDIRECT(\"WP!$C$\"&$DO54&\":$C$\"&$DP54)=$C54),--(INDIRECT(\"WP!$\"&$BG$41&\"$\"&$DO54&\":$\"&$BG$41&\"$\"&$DP54)<>\"\"),INDIRECT(\"WP!$K\"&$DO54&\":$K\"&$DP54)),\"\"),\"\"),\"\")","v":""},{"$f":"IFERROR(IF(WpAreaA_Sub3_exist,IF(SUMPRODUCT(--(INDIRECT(\"WP!$C$\"&$DO54&\":$C$\"&$DP54)=$C54),--(INDIRECT(\"WP!$B\"&$DO54&\":$B\"&$DP54)=\"Y\"),--(INDIRECT(\"WP!$\"&$BG$41&\"$\"&$DO54&\":$\"&$BG$41&\"$\"&$DP54)=1),--(INDIRECT(\"WP!$K\"&$DO54&\":$K\"&$DP54)>0))<>0,SUMPRODUCT(--(INDIRECT(\"WP!$C$\"&$DO54&\":$C$\"&$DP54)=$C54),--(INDIRECT(\"WP!$B\"&$DO54&\":$B\"&$DP54)=\"Y\"),--(INDIRECT(\"WP!$\"&$BG$41&\"$\"&$DO54&\":$\"&$BG$41&\"$\"&$DP54)=1),INDIRECT(\"WP!$K\"&$DO54&\":$K\"&$DP54)),IF(BI54<>\"\",0,\"\")),\"\"),\"\")","v":""},{"$f":"IFERROR(IF(WpAreaA_Sub3_exist,IF(SUMPRODUCT(--(INDIRECT(\"WP!$C$\"&$DO54&\":$C$\"&$DP54)=$C54),--(INDIRECT(\"WP!$B\"&$DO54&\":$B\"&$DP54)=\"Y\"),--(INDIRECT(\"WP!$\"&$BG$41&\"$\"&$DO54&\":$\"&$BG$41&\"$\"&$DP54)<>\"\"),--(INDIRECT(\"WP!$K\"&$DO54&\":$K\"&$DP54)>0))<>0,SUMPRODUCT(--(INDIRECT(\"WP!$C$\"&$DO54&\":$C$\"&$DP54)=$C54),--(INDIRECT(\"WP!$B\"&$DO54&\":$B\"&$DP54)=\"Y\"),--(INDIRECT(\"WP!$\"&$BG$41&\"$\"&$DO54&\":$\"&$BG$41&\"$\"&$DP54)<>\"\"),INDIRECT(\"WP!$K\"&$DO54&\":$K\"&$DP54)),\"\"),\"\"),\"\")","v":""},null,{"$f":"IFERROR(IF(WpAreaB_Sub1_exist,IF(SUMPRODUCT(--(INDIRECT(\"WP!$C$\"&$DO54&\":$C$\"&$DP54)=$C54),--(INDIRECT(\"WP!$\"&$BK$41&\"$\"&$DO54&\":$\"&$BK$41&\"$\"&$DP54)<>\"\"),--(INDIRECT(\"WP!$K$\"&$DO54&\":$K$\"&$DP54)>0))>0,SUMPRODUCT(--(INDIRECT(\"WP!$C$\"&$DO54&\":$C$\"&$DP54)=$C54),--(INDIRECT(\"WP!$\"&$BK$41&\"$\"&$DO54&\":$\"&$BK$41&\"$\"&$DP54)<>\"\"),INDIRECT(\"WP!$K\"&$DO54&\":$K\"&$DP54),INDIRECT(\"WP!$\"&$BK$41&\"$\"&$DO54&\":$\"&$BK$41&\"$\"&$DP54))/SUMPRODUCT(--(INDIRECT(\"WP!$C$\"&$DO54&\":$C$\"&$DP54)=$C54),--(INDIRECT(\"WP!$\"&$BK$41&\"$\"&$DO54&\":$\"&$BK$41&\"$\"&$DP54)<>\"\"),INDIRECT(\"WP!$K\"&$DO54&\":$K\"&$DP54)),\"\"),\"\"),\"\")","v":""},{"$f":"IFERROR(IF(WpAreaB_Sub1_exist,IF(SUMPRODUCT(--(INDIRECT(\"WP!$C$\"&$DO54&\":$C$\"&$DP54)=$C54),--(INDIRECT(\"WP!$B\"&$DO54&\":$B\"&$DP54)=\"Y\"),--(INDIRECT(\"WP!$\"&$BK$41&\"$\"&$DO54&\":$\"&$BK$41&\"$\"&$DP54)=1),--(INDIRECT(\"WP!$K\"&$DO54&\":$K\"&$DP54)>0))<>0,SUMPRODUCT(--(INDIRECT(\"WP!$C$\"&$DO54&\":$C$\"&$DP54)=$C54),--(INDIRECT(\"WP!$B\"&$DO54&\":$B\"&$DP54)=\"Y\"),--(INDIRECT(\"WP!$\"&$BK$41&\"$\"&$DO54&\":$\"&$BK$41&\"$\"&$DP54)=1),INDIRECT(\"WP!$K\"&$DO54&\":$K\"&$DP54)),IF(BM54<>\"\",0,\"\")),\"\"),\"\")","v":""},{"$f":"IFERROR(IF(WpAreaB_Sub1_exist,IF(SUMPRODUCT(--(INDIRECT(\"WP!$C$\"&$DO54&\":$C$\"&$DP54)=$C54),--(INDIRECT(\"WP!$B\"&$DO54&\":$B\"&$DP54)=\"Y\"),--(INDIRECT(\"WP!$\"&$BK$41&\"$\"&$DO54&\":$\"&$BK$41&\"$\"&$DP54)<>\"\"),--(INDIRECT(\"WP!$K\"&$DO54&\":$K\"&$DP54)>0))<>0,SUMPRODUCT(--(INDIRECT(\"WP!$C$\"&$DO54&\":$C$\"&$DP54)=$C54),--(INDIRECT(\"WP!$B\"&$DO54&\":$B\"&$DP54)=\"Y\"),--(INDIRECT(\"WP!$\"&$BK$41&\"$\"&$DO54&\":$\"&$BK$41&\"$\"&$DP54)<>\"\"),INDIRECT(\"WP!$K\"&$DO54&\":$K\"&$DP54)),\"\"),\"\"),\"\")","v":""},{"$f":"IFERROR(IF(WpAreaB_Sub2_exist,IF(SUMPRODUCT(--(INDIRECT(\"WP!$C$\"&$DO54&\":$C$\"&$DP54)=$C54),--(INDIRECT(\"WP!$\"&$BN$41&\"$\"&$DO54&\":$\"&$BN$41&\"$\"&$DP54)<>\"\"),--(INDIRECT(\"WP!$K$\"&$DO54&\":$K$\"&$DP54)>0))>0,SUMPRODUCT(--(INDIRECT(\"WP!$C$\"&$DO54&\":$C$\"&$DP54)=$C54),--(INDIRECT(\"WP!$\"&$BN$41&\"$\"&$DO54&\":$\"&$BN$41&\"$\"&$DP54)<>\"\"),INDIRECT(\"WP!$K\"&$DO54&\":$K\"&$DP54),INDIRECT(\"WP!$\"&$BN$41&\"$\"&$DO54&\":$\"&$BN$41&\"$\"&$DP54))/SUMPRODUCT(--(INDIRECT(\"WP!$C$\"&$DO54&\":$C$\"&$DP54)=$C54),--(INDIRECT(\"WP!$\"&$BN$41&\"$\"&$DO54&\":$\"&$BN$41&\"$\"&$DP54)<>\"\"),INDIRECT(\"WP!$K\"&$DO54&\":$K\"&$DP54)),\"\"),\"\"),\"\")","v":""},{"$f":"IFERROR(IF(WpAreaB_Sub2_exist,IF(SUMPRODUCT(--(INDIRECT(\"WP!$C$\"&$DO54&\":$C$\"&$DP54)=$C54),--(INDIRECT(\"WP!$B\"&$DO54&\":$B\"&$DP54)=\"Y\"),--(INDIRECT(\"WP!$\"&$BN$41&\"$\"&$DO54&\":$\"&$BN$41&\"$\"&$DP54)=1),--(INDIRECT(\"WP!$K\"&$DO54&\":$K\"&$DP54)>0))<>0,SUMPRODUCT(--(INDIRECT(\"WP!$C$\"&$DO54&\":$C$\"&$DP54)=$C54),--(INDIRECT(\"WP!$B\"&$DO54&\":$B\"&$DP54)=\"Y\"),--(INDIRECT(\"WP!$\"&$BN$41&\"$\"&$DO54&\":$\"&$BN$41&\"$\"&$DP54)=1),INDIRECT(\"WP!$K\"&$DO54&\":$K\"&$DP54)),IF(BP54<>\"\",0,\"\")),\"\"),\"\")","v":""},{"$f":"IFERROR(IF(WpAreaB_Sub2_exist,IF(SUMPRODUCT(--(INDIRECT(\"WP!$C$\"&$DO54&\":$C$\"&$DP54)=$C54),--(INDIRECT(\"WP!$B\"&$DO54&\":$B\"&$DP54)=\"Y\"),--(INDIRECT(\"WP!$\"&$BN$41&\"$\"&$DO54&\":$\"&$BN$41&\"$\"&$DP54)<>\"\"),--(INDIRECT(\"WP!$K\"&$DO54&\":$K\"&$DP54)>0))<>0,SUMPRODUCT(--(INDIRECT(\"WP!$C$\"&$DO54&\":$C$\"&$DP54)=$C54),--(INDIRECT(\"WP!$B\"&$DO54&\":$B\"&$DP54)=\"Y\"),--(INDIRECT(\"WP!$\"&$BN$41&\"$\"&$DO54&\":$\"&$BN$41&\"$\"&$DP54)<>\"\"),INDIRECT(\"WP!$K\"&$DO54&\":$K\"&$DP54)),\"\"),\"\"),\"\")","v":""},{"$f":"IFERROR(IF(WpAreaB_Sub3_exist,IF(SUMPRODUCT(--(INDIRECT(\"WP!$C$\"&$DO54&\":$C$\"&$DP54)=$C54),--(INDIRECT(\"WP!$\"&$BQ$41&\"$\"&$DO54&\":$\"&$BQ$41&\"$\"&$DP54)<>\"\"),--(INDIRECT(\"WP!$K$\"&$DO54&\":$K$\"&$DP54)>0))>0,SUMPRODUCT(--(INDIRECT(\"WP!$C$\"&$DO54&\":$C$\"&$DP54)=$C54),--(INDIRECT(\"WP!$\"&$BQ$41&\"$\"&$DO54&\":$\"&$BQ$41&\"$\"&$DP54)<>\"\"),INDIRECT(\"WP!$K\"&$DO54&\":$K\"&$DP54),INDIRECT(\"WP!$\"&$BQ$41&\"$\"&$DO54&\":$\"&$BQ$41&\"$\"&$DP54))/SUMPRODUCT(--(INDIRECT(\"WP!$C$\"&$DO54&\":$C$\"&$DP54)=$C54),--(INDIRECT(\"WP!$\"&$BQ$41&\"$\"&$DO54&\":$\"&$BQ$41&\"$\"&$DP54)<>\"\"),INDIRECT(\"WP!$K\"&$DO54&\":$K\"&$DP54)),\"\"),\"\"),\"\")","v":""},{"$f":"IFERROR(IF(WpAreaB_Sub3_exist,IF(SUMPRODUCT(--(INDIRECT(\"WP!$C$\"&$DO54&\":$C$\"&$DP54)=$C54),--(INDIRECT(\"WP!$B\"&$DO54&\":$B\"&$DP54)=\"Y\"),--(INDIRECT(\"WP!$\"&$BQ$41&\"$\"&$DO54&\":$\"&$BQ$41&\"$\"&$DP54)=1),--(INDIRECT(\"WP!$K\"&$DO54&\":$K\"&$DP54)>0))<>0,SUMPRODUCT(--(INDIRECT(\"WP!$C$\"&$DO54&\":$C$\"&$DP54)=$C54),--(INDIRECT(\"WP!$B\"&$DO54&\":$B\"&$DP54)=\"Y\"),--(INDIRECT(\"WP!$\"&$BQ$41&\"$\"&$DO54&\":$\"&$BQ$41&\"$\"&$DP54)=1),INDIRECT(\"WP!$K\"&$DO54&\":$K\"&$DP54)),IF(BS54<>\"\",0,\"\")),\"\"),\"\")","v":""},{"$f":"IFERROR(IF(WpAreaB_Sub3_exist,IF(SUMPRODUCT(--(INDIRECT(\"WP!$C$\"&$DO54&\":$C$\"&$DP54)=$C54),--(INDIRECT(\"WP!$B\"&$DO54&\":$B\"&$DP54)=\"Y\"),--(INDIRECT(\"WP!$\"&$BQ$41&\"$\"&$DO54&\":$\"&$BQ$41&\"$\"&$DP54)<>\"\"),--(INDIRECT(\"WP!$K\"&$DO54&\":$K\"&$DP54)>0))<>0,SUMPRODUCT(--(INDIRECT(\"WP!$C$\"&$DO54&\":$C$\"&$DP54)=$C54),--(INDIRECT(\"WP!$B\"&$DO54&\":$B\"&$DP54)=\"Y\"),--(INDIRECT(\"WP!$\"&$BQ$41&\"$\"&$DO54&\":$\"&$BQ$41&\"$\"&$DP54)<>\"\"),INDIRECT(\"WP!$K\"&$DO54&\":$K\"&$DP54)),\"\"),\"\"),\"\")","v":""},null,{"$f":"IFERROR(IF(WpAreaC_Sub1_exist,IF(SUMPRODUCT(--(INDIRECT(\"WP!$C$\"&$DO54&\":$C$\"&$DP54)=$C54),--(INDIRECT(\"WP!$\"&$BU$41&\"$\"&$DO54&\":$\"&$BU$41&\"$\"&$DP54)<>\"\"),--(INDIRECT(\"WP!$K$\"&$DO54&\":$K$\"&$DP54)>0))>0,SUMPRODUCT(--(INDIRECT(\"WP!$C$\"&$DO54&\":$C$\"&$DP54)=$C54),--(INDIRECT(\"WP!$\"&$BU$41&\"$\"&$DO54&\":$\"&$BU$41&\"$\"&$DP54)<>\"\"),INDIRECT(\"WP!$K\"&$DO54&\":$K\"&$DP54),INDIRECT(\"WP!$\"&$BU$41&\"$\"&$DO54&\":$\"&$BU$41&\"$\"&$DP54))/SUMPRODUCT(--(INDIRECT(\"WP!$C$\"&$DO54&\":$C$\"&$DP54)=$C54),--(INDIRECT(\"WP!$\"&$BU$41&\"$\"&$DO54&\":$\"&$BU$41&\"$\"&$DP54)<>\"\"),INDIRECT(\"WP!$K\"&$DO54&\":$K\"&$DP54)),\"\"),\"\"),\"\")","v":""},{"$f":"IFERROR(IF(WpAreaC_Sub1_exist,IF(SUMPRODUCT(--(INDIRECT(\"WP!$C$\"&$DO54&\":$C$\"&$DP54)=$C54),--(INDIRECT(\"WP!$B\"&$DO54&\":$B\"&$DP54)=\"Y\"),--(INDIRECT(\"WP!$\"&$BU$41&\"$\"&$DO54&\":$\"&$BU$41&\"$\"&$DP54)=1),--(INDIRECT(\"WP!$K\"&$DO54&\":$K\"&$DP54)>0))<>0,SUMPRODUCT(--(INDIRECT(\"WP!$C$\"&$DO54&\":$C$\"&$DP54)=$C54),--(INDIRECT(\"WP!$B\"&$DO54&\":$B\"&$DP54)=\"Y\"),--(INDIRECT(\"WP!$\"&$BU$41&\"$\"&$DO54&\":$\"&$BU$41&\"$\"&$DP54)=1),INDIRECT(\"WP!$K\"&$DO54&\":$K\"&$DP54)),IF(BW54<>\"\",0,\"\")),\"\"),\"\")","v":""},{"$f":"IFERROR(IF(WpAreaC_Sub1_exist,IF(SUMPRODUCT(--(INDIRECT(\"WP!$C$\"&$DO54&\":$C$\"&$DP54)=$C54),--(INDIRECT(\"WP!$B\"&$DO54&\":$B\"&$DP54)=\"Y\"),--(INDIRECT(\"WP!$\"&$BU$41&\"$\"&$DO54&\":$\"&$BU$41&\"$\"&$DP54)<>\"\"),--(INDIRECT(\"WP!$K\"&$DO54&\":$K\"&$DP54)>0))<>0,SUMPRODUCT(--(INDIRECT(\"WP!$C$\"&$DO54&\":$C$\"&$DP54)=$C54),--(INDIRECT(\"WP!$B\"&$DO54&\":$B\"&$DP54)=\"Y\"),--(INDIRECT(\"WP!$\"&$BU$41&\"$\"&$DO54&\":$\"&$BU$41&\"$\"&$DP54)<>\"\"),INDIRECT(\"WP!$K\"&$DO54&\":$K\"&$DP54)),\"\"),\"\"),\"\")","v":""},{"$f":"IFERROR(IF(WpAreaC_Sub2_exist,IF(SUMPRODUCT(--(INDIRECT(\"WP!$C$\"&$DO54&\":$C$\"&$DP54)=$C54),--(INDIRECT(\"WP!$\"&$BX$41&\"$\"&$DO54&\":$\"&$BX$41&\"$\"&$DP54)<>\"\"),--(INDIRECT(\"WP!$K$\"&$DO54&\":$K$\"&$DP54)>0))>0,SUMPRODUCT(--(INDIRECT(\"WP!$C$\"&$DO54&\":$C$\"&$DP54)=$C54),--(INDIRECT(\"WP!$\"&$BX$41&\"$\"&$DO54&\":$\"&$BX$41&\"$\"&$DP54)<>\"\"),INDIRECT(\"WP!$K\"&$DO54&\":$K\"&$DP54),INDIRECT(\"WP!$\"&$BX$41&\"$\"&$DO54&\":$\"&$BX$41&\"$\"&$DP54))/SUMPRODUCT(--(INDIRECT(\"WP!$C$\"&$DO54&\":$C$\"&$DP54)=$C54),--(INDIRECT(\"WP!$\"&$BX$41&\"$\"&$DO54&\":$\"&$BX$41&\"$\"&$DP54)<>\"\"),INDIRECT(\"WP!$K\"&$DO54&\":$K\"&$DP54)),\"\"),\"\"),\"\")","v":""},{"$f":"IFERROR(IF(WpAreaC_Sub2_exist,IF(SUMPRODUCT(--(INDIRECT(\"WP!$C$\"&$DO54&\":$C$\"&$DP54)=$C54),--(INDIRECT(\"WP!$B\"&$DO54&\":$B\"&$DP54)=\"Y\"),--(INDIRECT(\"WP!$\"&$BX$41&\"$\"&$DO54&\":$\"&$BX$41&\"$\"&$DP54)=1),--(INDIRECT(\"WP!$K\"&$DO54&\":$K\"&$DP54)>0))<>0,SUMPRODUCT(--(INDIRECT(\"WP!$C$\"&$DO54&\":$C$\"&$DP54)=$C54),--(INDIRECT(\"WP!$B\"&$DO54&\":$B\"&$DP54)=\"Y\"),--(INDIRECT(\"WP!$\"&$BX$41&\"$\"&$DO54&\":$\"&$BX$41&\"$\"&$DP54)=1),INDIRECT(\"WP!$K\"&$DO54&\":$K\"&$DP54)),IF(BZ54<>\"\",0,\"\")),\"\"),\"\")","v":""},{"$f":"IFERROR(IF(WpAreaC_Sub2_exist,IF(SUMPRODUCT(--(INDIRECT(\"WP!$C$\"&$DO54&\":$C$\"&$DP54)=$C54),--(INDIRECT(\"WP!$B\"&$DO54&\":$B\"&$DP54)=\"Y\"),--(INDIRECT(\"WP!$\"&$BX$41&\"$\"&$DO54&\":$\"&$BX$41&\"$\"&$DP54)<>\"\"),--(INDIRECT(\"WP!$K\"&$DO54&\":$K\"&$DP54)>0))<>0,SUMPRODUCT(--(INDIRECT(\"WP!$C$\"&$DO54&\":$C$\"&$DP54)=$C54),--(INDIRECT(\"WP!$B\"&$DO54&\":$B\"&$DP54)=\"Y\"),--(INDIRECT(\"WP!$\"&$BX$41&\"$\"&$DO54&\":$\"&$BX$41&\"$\"&$DP54)<>\"\"),INDIRECT(\"WP!$K\"&$DO54&\":$K\"&$DP54)),\"\"),\"\"),\"\")","v":""},{"$f":"IFERROR(IF(WpAreaC_Sub3_exist,IF(SUMPRODUCT(--(INDIRECT(\"WP!$C$\"&$DO54&\":$C$\"&$DP54)=$C54),--(INDIRECT(\"WP!$\"&$CA$41&\"$\"&$DO54&\":$\"&$CA$41&\"$\"&$DP54)<>\"\"),--(INDIRECT(\"WP!$K$\"&$DO54&\":$K$\"&$DP54)>0))>0,SUMPRODUCT(--(INDIRECT(\"WP!$C$\"&$DO54&\":$C$\"&$DP54)=$C54),--(INDIRECT(\"WP!$\"&$CA$41&\"$\"&$DO54&\":$\"&$CA$41&\"$\"&$DP54)<>\"\"),INDIRECT(\"WP!$K\"&$DO54&\":$K\"&$DP54),INDIRECT(\"WP!$\"&$CA$41&\"$\"&$DO54&\":$\"&$CA$41&\"$\"&$DP54))/SUMPRODUCT(--(INDIRECT(\"WP!$C$\"&$DO54&\":$C$\"&$DP54)=$C54),--(INDIRECT(\"WP!$\"&$CA$41&\"$\"&$DO54&\":$\"&$CA$41&\"$\"&$DP54)<>\"\"),INDIRECT(\"WP!$K\"&$DO54&\":$K\"&$DP54)),\"\"),\"\"),\"\")","v":""},{"$f":"IFERROR(IF(WpAreaC_Sub3_exist,IF(SUMPRODUCT(--(INDIRECT(\"WP!$C$\"&$DO54&\":$C$\"&$DP54)=$C54),--(INDIRECT(\"WP!$B\"&$DO54&\":$B\"&$DP54)=\"Y\"),--(INDIRECT(\"WP!$\"&$CA$41&\"$\"&$DO54&\":$\"&$CA$41&\"$\"&$DP54)=1),--(INDIRECT(\"WP!$K\"&$DO54&\":$K\"&$DP54)>0))<>0,SUMPRODUCT(--(INDIRECT(\"WP!$C$\"&$DO54&\":$C$\"&$DP54)=$C54),--(INDIRECT(\"WP!$B\"&$DO54&\":$B\"&$DP54)=\"Y\"),--(INDIRECT(\"WP!$\"&$CA$41&\"$\"&$DO54&\":$\"&$CA$41&\"$\"&$DP54)=1),INDIRECT(\"WP!$K\"&$DO54&\":$K\"&$DP54)),IF(CC54<>\"\",0,\"\")),\"\"),\"\")","v":""},{"$f":"IFERROR(IF(WpAreaC_Sub3_exist,IF(SUMPRODUCT(--(INDIRECT(\"WP!$C$\"&$DO54&\":$C$\"&$DP54)=$C54),--(INDIRECT(\"WP!$B\"&$DO54&\":$B\"&$DP54)=\"Y\"),--(INDIRECT(\"WP!$\"&$CA$41&\"$\"&$DO54&\":$\"&$CA$41&\"$\"&$DP54)<>\"\"),--(INDIRECT(\"WP!$K\"&$DO54&\":$K\"&$DP54)>0))<>0,SUMPRODUCT(--(INDIRECT(\"WP!$C$\"&$DO54&\":$C$\"&$DP54)=$C54),--(INDIRECT(\"WP!$B\"&$DO54&\":$B\"&$DP54)=\"Y\"),--(INDIRECT(\"WP!$\"&$CA$41&\"$\"&$DO54&\":$\"&$CA$41&\"$\"&$DP54)<>\"\"),INDIRECT(\"WP!$K\"&$DO54&\":$K\"&$DP54)),\"\"),\"\"),\"\")","v":""},null,null,null,null,"","","","","","","","","","","","",null,"","","","","","","","","",null,"","","","","","","","","",null,{"$f":"MIN(IF(WP!$C$12:$C$79=$C54,ROW(WP!$C$12:$C$79),\"\"))","v":76},{"$f":"MAX(IF(WP!$C$12:$C$79=$C54,ROW(WP!$C$12:$C$79),\"\"))","v":78}]
[null,"Test suites (TTCN)","36.523-3",{"$f":"getProgress(AX55,CH55,\"%\",1,1)","v":""},{"$f":"getProgress(AY55,CI55,,,1)","v":""},{"$f":"getProgress(AZ55,CJ55,,,1)","v":""},null,{"$f":"getProgress(BA55,CK55,\"%\",1,1,WpAreaA_Sub1_exist)","v":""},{"$f":"getProgress(BB55,CL55,,,1,WpAreaA_Sub1_exist)","v":""},{"$f":"getProgress(BC55,CM55,,,1,WpAreaA_Sub1_exist)","v":""},{"$f":"getProgress(BD55,CN55,\"%\",1,1,WpAreaA_Sub2_exist)","v":""},{"$f":"getProgress(BE55,CO55,,,1,WpAreaA_Sub2_exist)","v":""},{"$f":"getProgress(BF55,CP55,,,1,WpAreaA_Sub2_exist)","v":""},{"$f":"getProgress(BG55,CQ55,\"%\",1,1,WpAreaA_Sub3_exist)","v":""},{"$f":"getProgress(BH55,CR55,,,1,WpAreaA_Sub3_exist)","v":""},{"$f":"getProgress(BI55,CS55,,,1,WpAreaA_Sub3_exist)","v":""},null,{"$f":"getProgress(BK55,CU55,\"%\",1,1,WpAreaB_Sub1_exist)","v":""},{"$f":"getProgress(BL55,CV55,,,1,WpAreaB_Sub1_exist)","v":""},{"$f":"getProgress(BM55,CW55,,,1,WpAreaB_Sub1_exist)","v":""},{"$f":"getProgress(BN55,CX55,\"%\",1,1,WpAreaB_Sub2_exist)","v":""},{"$f":"getProgress(BO55,CY55,,,1,WpAreaB_Sub2_exist)","v":""},{"$f":"getProgress(BP55,CZ55,,,1,WpAreaB_Sub2_exist)","v":""},{"$f":"getProgress(BQ55,DA55,\"%\",1,1,WpAreaB_Sub3_exist)","v":""},{"$f":"getProgress(BR55,DB55,,,1,WpAreaB_Sub3_exist)","v":""},{"$f":"getProgress(BS55,DC55,,,1,WpAreaB_Sub3_exist)","v":""},null,{"$f":"getProgress(BU55,DE55,\"%\",1,1,WpAreaC_Sub1_exist)","v":""},{"$f":"getProgress(BV55,DF55,,,1,WpAreaC_Sub1_exist)","v":""},{"$f":"getProgress(BW55,DG55,,,1,WpAreaC_Sub1_exist)","v":""},{"$f":"getProgress(BX55,DH55,\"%\",1,1,WpAreaC_Sub2_exist)","v":""},{"$f":"getProgress(BY55,DI55,,,1,WpAreaC_Sub2_exist)","v":""},{"$f":"getProgress(BZ55,DJ55,,,1,WpAreaC_Sub2_exist)","v":""},{"$f":"getProgress(CA55,DK55,\"%\",1,1,WpAreaC_Sub3_exist)","v":""},{"$f":"getProgress(CB55,DL55,,,1,WpAreaC_Sub3_exist)","v":""},{"$f":"getProgress(CC55,DM55,,,1,WpAreaC_Sub3_exist)","v":""},null,null,null,null,null,null,null,null,null,null,null,null,null,{"$f":"IFERROR((IF(WpAreaA_exist,IF(BA55<>\"\",BA55*WP!$AB$9,0)+IF(BD55<>\"\",BD55*WP!$AC$9,0)+IF(BG55<>\"\",BG55*WP!$AD$9,0),0)+IF(WpAreaB_exist,IF(BK55<>\"\",BK55*WP!$AE$10)+IF(BN55<>\"\",BN55*WP!$AF$10,0)+IF(BQ55<>\"\",BQ55*WP!$AG$10,0),0)+IF(WpAreaC_exist,IF(BU55<>\"\",BU55*WP!$AH$10)+IF(BX55<>\"\",BX55*WP!$AI$10,0)+IF(CA55<>\"\",CA55*WP!$AJ$10,0),0))/(IF(WpAreaA_exist,IF(BA55<>\"\",WP!$AB$9,0)+IF(BD55<>\"\",WP!$AC$9,0)+IF(BG55<>\"\",WP!$AD$9,0),0)+IF(WpAreaB_exist,IF(BK55<>\"\",WP!$AE$10,0)+IF(BN55<>\"\",WP!$AF$10,0)+IF(BQ55<>\"\",WP!$AG$10,0),0)+IF(WpAreaC_exist,IF(BU55<>\"\",WP!$AH$10,0)+IF(BX55<>\"\",WP!$AI$10,0)+IF(CA55<>\"\",WP!$AJ$10,0),0)),\"\")","v":""},{"$f":"IFERROR(IF(SUMPRODUCT(--(INDIRECT(\"WP!$C$\"&$DO55&\":$C$\"&$DP55)=$C55),--(INDIRECT(\"WP!$B$\"&$DO55&\":$B$\"&$DP55)=\"Y\"),--(INDIRECT(\"WP!$\"&$AX$41&\"$\"&$DO55&\":$\"&$AX$41&\"$\"&$DP55)=1),--(INDIRECT(\"WP!$K$\"&$DO55&\":$K$\"&$DP55)>0))<>0,SUMPRODUCT(--(INDIRECT(\"WP!$C$\"&$DO55&\":$C$\"&$DP55)=$C55),--(INDIRECT(\"WP!$B$\"&$DO55&\":$B$\"&$DP55)=\"Y\"),--(INDIRECT(\"WP!$\"&$AX$41&\"$\"&$DO55&\":$\"&$AX$41&\"$\"&$DP55)=1),INDIRECT(\"WP!$K$\"&$DO55&\":$K$\"&$DP55)),IF(AZ55<>\"\",0,\"\")),\"\")","v":""},{"$f":"IFERROR(IF(SUMPRODUCT(--(INDIRECT(\"WP!$C$\"&$DO55&\":$C$\"&$DP55)=$C55),--(INDIRECT(\"WP!$B\"&$DO55&\":$B\"&$DP55)=\"Y\"),--(INDIRECT(\"WP!$\"&$AX$41&\"$\"&$DO55&\":$\"&$AX$41&\"$\"&$DP55)<>\"\"),--(INDIRECT(\"WP!$K\"&$DO55&\":$K\"&$DP55)>0))<>0,SUMPRODUCT(--(INDIRECT(\"WP!$C$\"&$DO55&\":$C$\"&$DP55)=$C55),--(INDIRECT(\"WP!$B\"&$DO55&\":$B\"&$DP55)=\"Y\"),--(INDIRECT(\"WP!$\"&$AX$41&\"$\"&$DO55&\":$\"&$AX$41&\"$\"&$DP55)<>\"\"),INDIRECT(\"WP!$K\"&$DO55&\":$K\"&$DP55)),\"\"),\"\")","v":""},{"$f":"IFERROR(IF(WpAreaA_Sub1_exist,IF(SUMPRODUCT(--(INDIRECT(\"WP!$C$\"&$DO55&\":$C$\"&$DP55)=$C55),--(INDIRECT(\"WP!$\"&$BA$41&\"$\"&$DO55&\":$\"&$BA$41&\"$\"&$DP55)<>\"\"),--(INDIRECT(\"WP!$K$\"&$DO55&\":$K$\"&$DP55)>0))>0,SUMPRODUCT(--(INDIRECT(\"WP!$C$\"&$DO55&\":$C$\"&$DP55)=$C55),--(INDIRECT(\"WP!$\"&$BA$41&\"$\"&$DO55&\":$\"&$BA$41&\"$\"&$DP55)<>\"\"),INDIRECT(\"WP!$K$\"&$DO55&\":$K$\"&$DP55),INDIRECT(\"WP!$\"&$BA$41&\"$\"&$DO55&\":$\"&$BA$41&\"$\"&$DP55))/SUMPRODUCT(--(INDIRECT(\"WP!$C$\"&$DO55&\":$C$\"&$DP55)=$C55),--(INDIRECT(\"WP!$\"&$BA$41&\"$\"&$DO55&\":$\"&$BA$41&\"$\"&$DP55)<>\"\"),INDIRECT(\"WP!$K$\"&$DO55&\":$K$\"&$DP55)),\"\"),\"\"),\"\")","v":""},{"$f":"IFERROR(IF(WpAreaA_Sub1_exist,IF(SUMPRODUCT(--(INDIRECT(\"WP!$C$\"&$DO55&\":$C$\"&$DP55)=$C55),--(INDIRECT(\"WP!$B$\"&$DO55&\":$B$\"&$DP55)=\"Y\"),--(INDIRECT(\"WP!$\"&$BA$41&\"$\"&$DO55&\":$\"&$BA$41&\"$\"&$DP55)=1),--(INDIRECT(\"WP!$K$\"&$DO55&\":$K$\"&$DP55)>0))<>0,SUMPRODUCT(--(INDIRECT(\"WP!$C$\"&$DO55&\":$C$\"&$DP55)=$C55),--(INDIRECT(\"WP!$B$\"&$DO55&\":$B$\"&$DP55)=\"Y\"),--(INDIRECT(\"WP!$\"&$BA$41&\"$\"&$DO55&\":$\"&$BA$41&\"$\"&$DP55)=1),INDIRECT(\"WP!$K$\"&$DO55&\":$K$\"&$DP55)),IF(BC55<>\"\",0,\"\")),\"\"),\"\")","v":""},{"$f":"IFERROR(IF(WpAreaA_Sub1_exist,IF(SUMPRODUCT(--(INDIRECT(\"WP!$C$\"&$DO55&\":$C$\"&$DP55)=$C55),--(INDIRECT(\"WP!$B\"&$DO55&\":$B\"&$DP55)=\"Y\"),--(INDIRECT(\"WP!$\"&$BA$41&\"$\"&$DO55&\":$\"&$BA$41&\"$\"&$DP55)<>\"\"),--(INDIRECT(\"WP!$K\"&$DO55&\":$K\"&$DP55)>0))<>0,SUMPRODUCT(--(INDIRECT(\"WP!$C$\"&$DO55&\":$C$\"&$DP55)=$C55),--(INDIRECT(\"WP!$B\"&$DO55&\":$B\"&$DP55)=\"Y\"),--(INDIRECT(\"WP!$\"&$BA$41&\"$\"&$DO55&\":$\"&$BA$41&\"$\"&$DP55)<>\"\"),INDIRECT(\"WP!$K\"&$DO55&\":$K\"&$DP55)),\"\"),\"\"),\"\")","v":""},{"$f":"IFERROR(IF(WpAreaA_Sub2_exist,IF(SUMPRODUCT(--(INDIRECT(\"WP!$C$\"&$DO55&\":$C$\"&$DP55)=$C55),--(INDIRECT(\"WP!$\"&$BD$41&\"$\"&$DO55&\":$\"&$BD$41&\"$\"&$DP55)<>\"\"),--(INDIRECT(\"WP!$K$\"&$DO55&\":$K$\"&$DP55)>0))>0,SUMPRODUCT(--(INDIRECT(\"WP!$C$\"&$DO55&\":$C$\"&$DP55)=$C55),--(INDIRECT(\"WP!$\"&$BD$41&\"$\"&$DO55&\":$\"&$BD$41&\"$\"&$DP55)<>\"\"),INDIRECT(\"WP!$K\"&$DO55&\":$K\"&$DP55),INDIRECT(\"WP!$\"&$BD$41&\"$\"&$DO55&\":$\"&$BD$41&\"$\"&$DP55))/SUMPRODUCT(--(INDIRECT(\"WP!$C$\"&$DO55&\":$C$\"&$DP55)=$C55),--(INDIRECT(\"WP!$\"&$BD$41&\"$\"&$DO55&\":$\"&$BD$41&\"$\"&$DP55)<>\"\"),INDIRECT(\"WP!$K\"&$DO55&\":$K\"&$DP55)),\"\"),\"\"),\"\")","v":""},{"$f":"IFERROR(IF(WpAreaA_Sub2_exist,IF(SUMPRODUCT(--(INDIRECT(\"WP!$C$\"&$DO55&\":$C$\"&$DP55)=$C55),--(INDIRECT(\"WP!$B\"&$DO55&\":$B\"&$DP55)=\"Y\"),--(INDIRECT(\"WP!$\"&$BD$41&\"$\"&$DO55&\":$\"&$BD$41&\"$\"&$DP55)=1),--(INDIRECT(\"WP!$K\"&$DO55&\":$K\"&$DP55)>0))<>0,SUMPRODUCT(--(INDIRECT(\"WP!$C$\"&$DO55&\":$C$\"&$DP55)=$C55),--(INDIRECT(\"WP!$B\"&$DO55&\":$B\"&$DP55)=\"Y\"),--(INDIRECT(\"WP!$\"&$BD$41&\"$\"&$DO55&\":$\"&$BD$41&\"$\"&$DP55)=1),INDIRECT(\"WP!$K\"&$DO55&\":$K\"&$DP55)),IF(BF55<>\"\",0,\"\")),\"\"),\"\")","v":""},{"$f":"IFERROR(IF(WpAreaA_Sub2_exist,IF(SUMPRODUCT(--(INDIRECT(\"WP!$C$\"&$DO55&\":$C$\"&$DP55)=$C55),--(INDIRECT(\"WP!$B\"&$DO55&\":$B\"&$DP55)=\"Y\"),--(INDIRECT(\"WP!$\"&$BD$41&\"$\"&$DO55&\":$\"&$BD$41&\"$\"&$DP55)<>\"\"),--(INDIRECT(\"WP!$K\"&$DO55&\":$K\"&$DP55)>0))<>0,SUMPRODUCT(--(INDIRECT(\"WP!$C$\"&$DO55&\":$C$\"&$DP55)=$C55),--(INDIRECT(\"WP!$B\"&$DO55&\":$B\"&$DP55)=\"Y\"),--(INDIRECT(\"WP!$\"&$BD$41&\"$\"&$DO55&\":$\"&$BD$41&\"$\"&$DP55)<>\"\"),INDIRECT(\"WP!$K\"&$DO55&\":$K\"&$DP55)),\"\"),\"\"),\"\")","v":""},{"$f":"IFERROR(IF(WpAreaA_Sub3_exist,IF(SUMPRODUCT(--(INDIRECT(\"WP!$C$\"&$DO55&\":$C$\"&$DP55)=$C55),--(INDIRECT(\"WP!$\"&$BG$41&\"$\"&$DO55&\":$\"&$BG$41&\"$\"&$DP55)<>\"\"),--(INDIRECT(\"WP!$K$\"&$DO55&\":$K$\"&$DP55)>0))>0,SUMPRODUCT(--(INDIRECT(\"WP!$C$\"&$DO55&\":$C$\"&$DP55)=$C55),--(INDIRECT(\"WP!$\"&$BG$41&\"$\"&$DO55&\":$\"&$BG$41&\"$\"&$DP55)<>\"\"),INDIRECT(\"WP!$K\"&$DO55&\":$K\"&$DP55),INDIRECT(\"WP!$\"&$BG$41&\"$\"&$DO55&\":$\"&$BG$41&\"$\"&$DP55))/SUMPRODUCT(--(INDIRECT(\"WP!$C$\"&$DO55&\":$C$\"&$DP55)=$C55),--(INDIRECT(\"WP!$\"&$BG$41&\"$\"&$DO55&\":$\"&$BG$41&\"$\"&$DP55)<>\"\"),INDIRECT(\"WP!$K\"&$DO55&\":$K\"&$DP55)),\"\"),\"\"),\"\")","v":""},{"$f":"IFERROR(IF(WpAreaA_Sub3_exist,IF(SUMPRODUCT(--(INDIRECT(\"WP!$C$\"&$DO55&\":$C$\"&$DP55)=$C55),--(INDIRECT(\"WP!$B\"&$DO55&\":$B\"&$DP55)=\"Y\"),--(INDIRECT(\"WP!$\"&$BG$41&\"$\"&$DO55&\":$\"&$BG$41&\"$\"&$DP55)=1),--(INDIRECT(\"WP!$K\"&$DO55&\":$K\"&$DP55)>0))<>0,SUMPRODUCT(--(INDIRECT(\"WP!$C$\"&$DO55&\":$C$\"&$DP55)=$C55),--(INDIRECT(\"WP!$B\"&$DO55&\":$B\"&$DP55)=\"Y\"),--(INDIRECT(\"WP!$\"&$BG$41&\"$\"&$DO55&\":$\"&$BG$41&\"$\"&$DP55)=1),INDIRECT(\"WP!$K\"&$DO55&\":$K\"&$DP55)),IF(BI55<>\"\",0,\"\")),\"\"),\"\")","v":""},{"$f":"IFERROR(IF(WpAreaA_Sub3_exist,IF(SUMPRODUCT(--(INDIRECT(\"WP!$C$\"&$DO55&\":$C$\"&$DP55)=$C55),--(INDIRECT(\"WP!$B\"&$DO55&\":$B\"&$DP55)=\"Y\"),--(INDIRECT(\"WP!$\"&$BG$41&\"$\"&$DO55&\":$\"&$BG$41&\"$\"&$DP55)<>\"\"),--(INDIRECT(\"WP!$K\"&$DO55&\":$K\"&$DP55)>0))<>0,SUMPRODUCT(--(INDIRECT(\"WP!$C$\"&$DO55&\":$C$\"&$DP55)=$C55),--(INDIRECT(\"WP!$B\"&$DO55&\":$B\"&$DP55)=\"Y\"),--(INDIRECT(\"WP!$\"&$BG$41&\"$\"&$DO55&\":$\"&$BG$41&\"$\"&$DP55)<>\"\"),INDIRECT(\"WP!$K\"&$DO55&\":$K\"&$DP55)),\"\"),\"\"),\"\")","v":""},null,{"$f":"IFERROR(IF(WpAreaB_Sub1_exist,IF(SUMPRODUCT(--(INDIRECT(\"WP!$C$\"&$DO55&\":$C$\"&$DP55)=$C55),--(INDIRECT(\"WP!$\"&$BK$41&\"$\"&$DO55&\":$\"&$BK$41&\"$\"&$DP55)<>\"\"),--(INDIRECT(\"WP!$K$\"&$DO55&\":$K$\"&$DP55)>0))>0,SUMPRODUCT(--(INDIRECT(\"WP!$C$\"&$DO55&\":$C$\"&$DP55)=$C55),--(INDIRECT(\"WP!$\"&$BK$41&\"$\"&$DO55&\":$\"&$BK$41&\"$\"&$DP55)<>\"\"),INDIRECT(\"WP!$K\"&$DO55&\":$K\"&$DP55),INDIRECT(\"WP!$\"&$BK$41&\"$\"&$DO55&\":$\"&$BK$41&\"$\"&$DP55))/SUMPRODUCT(--(INDIRECT(\"WP!$C$\"&$DO55&\":$C$\"&$DP55)=$C55),--(INDIRECT(\"WP!$\"&$BK$41&\"$\"&$DO55&\":$\"&$BK$41&\"$\"&$DP55)<>\"\"),INDIRECT(\"WP!$K\"&$DO55&\":$K\"&$DP55)),\"\"),\"\"),\"\")","v":""},{"$f":"IFERROR(IF(WpAreaB_Sub1_exist,IF(SUMPRODUCT(--(INDIRECT(\"WP!$C$\"&$DO55&\":$C$\"&$DP55)=$C55),--(INDIRECT(\"WP!$B\"&$DO55&\":$B\"&$DP55)=\"Y\"),--(INDIRECT(\"WP!$\"&$BK$41&\"$\"&$DO55&\":$\"&$BK$41&\"$\"&$DP55)=1),--(INDIRECT(\"WP!$K\"&$DO55&\":$K\"&$DP55)>0))<>0,SUMPRODUCT(--(INDIRECT(\"WP!$C$\"&$DO55&\":$C$\"&$DP55)=$C55),--(INDIRECT(\"WP!$B\"&$DO55&\":$B\"&$DP55)=\"Y\"),--(INDIRECT(\"WP!$\"&$BK$41&\"$\"&$DO55&\":$\"&$BK$41&\"$\"&$DP55)=1),INDIRECT(\"WP!$K\"&$DO55&\":$K\"&$DP55)),IF(BM55<>\"\",0,\"\")),\"\"),\"\")","v":""},{"$f":"IFERROR(IF(WpAreaB_Sub1_exist,IF(SUMPRODUCT(--(INDIRECT(\"WP!$C$\"&$DO55&\":$C$\"&$DP55)=$C55),--(INDIRECT(\"WP!$B\"&$DO55&\":$B\"&$DP55)=\"Y\"),--(INDIRECT(\"WP!$\"&$BK$41&\"$\"&$DO55&\":$\"&$BK$41&\"$\"&$DP55)<>\"\"),--(INDIRECT(\"WP!$K\"&$DO55&\":$K\"&$DP55)>0))<>0,SUMPRODUCT(--(INDIRECT(\"WP!$C$\"&$DO55&\":$C$\"&$DP55)=$C55),--(INDIRECT(\"WP!$B\"&$DO55&\":$B\"&$DP55)=\"Y\"),--(INDIRECT(\"WP!$\"&$BK$41&\"$\"&$DO55&\":$\"&$BK$41&\"$\"&$DP55)<>\"\"),INDIRECT(\"WP!$K\"&$DO55&\":$K\"&$DP55)),\"\"),\"\"),\"\")","v":""},{"$f":"IFERROR(IF(WpAreaB_Sub2_exist,IF(SUMPRODUCT(--(INDIRECT(\"WP!$C$\"&$DO55&\":$C$\"&$DP55)=$C55),--(INDIRECT(\"WP!$\"&$BN$41&\"$\"&$DO55&\":$\"&$BN$41&\"$\"&$DP55)<>\"\"),--(INDIRECT(\"WP!$K$\"&$DO55&\":$K$\"&$DP55)>0))>0,SUMPRODUCT(--(INDIRECT(\"WP!$C$\"&$DO55&\":$C$\"&$DP55)=$C55),--(INDIRECT(\"WP!$\"&$BN$41&\"$\"&$DO55&\":$\"&$BN$41&\"$\"&$DP55)<>\"\"),INDIRECT(\"WP!$K\"&$DO55&\":$K\"&$DP55),INDIRECT(\"WP!$\"&$BN$41&\"$\"&$DO55&\":$\"&$BN$41&\"$\"&$DP55))/SUMPRODUCT(--(INDIRECT(\"WP!$C$\"&$DO55&\":$C$\"&$DP55)=$C55),--(INDIRECT(\"WP!$\"&$BN$41&\"$\"&$DO55&\":$\"&$BN$41&\"$\"&$DP55)<>\"\"),INDIRECT(\"WP!$K\"&$DO55&\":$K\"&$DP55)),\"\"),\"\"),\"\")","v":""},{"$f":"IFERROR(IF(WpAreaB_Sub2_exist,IF(SUMPRODUCT(--(INDIRECT(\"WP!$C$\"&$DO55&\":$C$\"&$DP55)=$C55),--(INDIRECT(\"WP!$B\"&$DO55&\":$B\"&$DP55)=\"Y\"),--(INDIRECT(\"WP!$\"&$BN$41&\"$\"&$DO55&\":$\"&$BN$41&\"$\"&$DP55)=1),--(INDIRECT(\"WP!$K\"&$DO55&\":$K\"&$DP55)>0))<>0,SUMPRODUCT(--(INDIRECT(\"WP!$C$\"&$DO55&\":$C$\"&$DP55)=$C55),--(INDIRECT(\"WP!$B\"&$DO55&\":$B\"&$DP55)=\"Y\"),--(INDIRECT(\"WP!$\"&$BN$41&\"$\"&$DO55&\":$\"&$BN$41&\"$\"&$DP55)=1),INDIRECT(\"WP!$K\"&$DO55&\":$K\"&$DP55)),IF(BP55<>\"\",0,\"\")),\"\"),\"\")","v":""},{"$f":"IFERROR(IF(WpAreaB_Sub2_exist,IF(SUMPRODUCT(--(INDIRECT(\"WP!$C$\"&$DO55&\":$C$\"&$DP55)=$C55),--(INDIRECT(\"WP!$B\"&$DO55&\":$B\"&$DP55)=\"Y\"),--(INDIRECT(\"WP!$\"&$BN$41&\"$\"&$DO55&\":$\"&$BN$41&\"$\"&$DP55)<>\"\"),--(INDIRECT(\"WP!$K\"&$DO55&\":$K\"&$DP55)>0))<>0,SUMPRODUCT(--(INDIRECT(\"WP!$C$\"&$DO55&\":$C$\"&$DP55)=$C55),--(INDIRECT(\"WP!$B\"&$DO55&\":$B\"&$DP55)=\"Y\"),--(INDIRECT(\"WP!$\"&$BN$41&\"$\"&$DO55&\":$\"&$BN$41&\"$\"&$DP55)<>\"\"),INDIRECT(\"WP!$K\"&$DO55&\":$K\"&$DP55)),\"\"),\"\"),\"\")","v":""},{"$f":"IFERROR(IF(WpAreaB_Sub3_exist,IF(SUMPRODUCT(--(INDIRECT(\"WP!$C$\"&$DO55&\":$C$\"&$DP55)=$C55),--(INDIRECT(\"WP!$\"&$BQ$41&\"$\"&$DO55&\":$\"&$BQ$41&\"$\"&$DP55)<>\"\"),--(INDIRECT(\"WP!$K$\"&$DO55&\":$K$\"&$DP55)>0))>0,SUMPRODUCT(--(INDIRECT(\"WP!$C$\"&$DO55&\":$C$\"&$DP55)=$C55),--(INDIRECT(\"WP!$\"&$BQ$41&\"$\"&$DO55&\":$\"&$BQ$41&\"$\"&$DP55)<>\"\"),INDIRECT(\"WP!$K\"&$DO55&\":$K\"&$DP55),INDIRECT(\"WP!$\"&$BQ$41&\"$\"&$DO55&\":$\"&$BQ$41&\"$\"&$DP55))/SUMPRODUCT(--(INDIRECT(\"WP!$C$\"&$DO55&\":$C$\"&$DP55)=$C55),--(INDIRECT(\"WP!$\"&$BQ$41&\"$\"&$DO55&\":$\"&$BQ$41&\"$\"&$DP55)<>\"\"),INDIRECT(\"WP!$K\"&$DO55&\":$K\"&$DP55)),\"\"),\"\"),\"\")","v":""},{"$f":"IFERROR(IF(WpAreaB_Sub3_exist,IF(SUMPRODUCT(--(INDIRECT(\"WP!$C$\"&$DO55&\":$C$\"&$DP55)=$C55),--(INDIRECT(\"WP!$B\"&$DO55&\":$B\"&$DP55)=\"Y\"),--(INDIRECT(\"WP!$\"&$BQ$41&\"$\"&$DO55&\":$\"&$BQ$41&\"$\"&$DP55)=1),--(INDIRECT(\"WP!$K\"&$DO55&\":$K\"&$DP55)>0))<>0,SUMPRODUCT(--(INDIRECT(\"WP!$C$\"&$DO55&\":$C$\"&$DP55)=$C55),--(INDIRECT(\"WP!$B\"&$DO55&\":$B\"&$DP55)=\"Y\"),--(INDIRECT(\"WP!$\"&$BQ$41&\"$\"&$DO55&\":$\"&$BQ$41&\"$\"&$DP55)=1),INDIRECT(\"WP!$K\"&$DO55&\":$K\"&$DP55)),IF(BS55<>\"\",0,\"\")),\"\"),\"\")","v":""},{"$f":"IFERROR(IF(WpAreaB_Sub3_exist,IF(SUMPRODUCT(--(INDIRECT(\"WP!$C$\"&$DO55&\":$C$\"&$DP55)=$C55),--(INDIRECT(\"WP!$B\"&$DO55&\":$B\"&$DP55)=\"Y\"),--(INDIRECT(\"WP!$\"&$BQ$41&\"$\"&$DO55&\":$\"&$BQ$41&\"$\"&$DP55)<>\"\"),--(INDIRECT(\"WP!$K\"&$DO55&\":$K\"&$DP55)>0))<>0,SUMPRODUCT(--(INDIRECT(\"WP!$C$\"&$DO55&\":$C$\"&$DP55)=$C55),--(INDIRECT(\"WP!$B\"&$DO55&\":$B\"&$DP55)=\"Y\"),--(INDIRECT(\"WP!$\"&$BQ$41&\"$\"&$DO55&\":$\"&$BQ$41&\"$\"&$DP55)<>\"\"),INDIRECT(\"WP!$K\"&$DO55&\":$K\"&$DP55)),\"\"),\"\"),\"\")","v":""},null,{"$f":"IFERROR(IF(WpAreaC_Sub1_exist,IF(SUMPRODUCT(--(INDIRECT(\"WP!$C$\"&$DO55&\":$C$\"&$DP55)=$C55),--(INDIRECT(\"WP!$\"&$BU$41&\"$\"&$DO55&\":$\"&$BU$41&\"$\"&$DP55)<>\"\"),--(INDIRECT(\"WP!$K$\"&$DO55&\":$K$\"&$DP55)>0))>0,SUMPRODUCT(--(INDIRECT(\"WP!$C$\"&$DO55&\":$C$\"&$DP55)=$C55),--(INDIRECT(\"WP!$\"&$BU$41&\"$\"&$DO55&\":$\"&$BU$41&\"$\"&$DP55)<>\"\"),INDIRECT(\"WP!$K\"&$DO55&\":$K\"&$DP55),INDIRECT(\"WP!$\"&$BU$41&\"$\"&$DO55&\":$\"&$BU$41&\"$\"&$DP55))/SUMPRODUCT(--(INDIRECT(\"WP!$C$\"&$DO55&\":$C$\"&$DP55)=$C55),--(INDIRECT(\"WP!$\"&$BU$41&\"$\"&$DO55&\":$\"&$BU$41&\"$\"&$DP55)<>\"\"),INDIRECT(\"WP!$K\"&$DO55&\":$K\"&$DP55)),\"\"),\"\"),\"\")","v":""},{"$f":"IFERROR(IF(WpAreaC_Sub1_exist,IF(SUMPRODUCT(--(INDIRECT(\"WP!$C$\"&$DO55&\":$C$\"&$DP55)=$C55),--(INDIRECT(\"WP!$B\"&$DO55&\":$B\"&$DP55)=\"Y\"),--(INDIRECT(\"WP!$\"&$BU$41&\"$\"&$DO55&\":$\"&$BU$41&\"$\"&$DP55)=1),--(INDIRECT(\"WP!$K\"&$DO55&\":$K\"&$DP55)>0))<>0,SUMPRODUCT(--(INDIRECT(\"WP!$C$\"&$DO55&\":$C$\"&$DP55)=$C55),--(INDIRECT(\"WP!$B\"&$DO55&\":$B\"&$DP55)=\"Y\"),--(INDIRECT(\"WP!$\"&$BU$41&\"$\"&$DO55&\":$\"&$BU$41&\"$\"&$DP55)=1),INDIRECT(\"WP!$K\"&$DO55&\":$K\"&$DP55)),IF(BW55<>\"\",0,\"\")),\"\"),\"\")","v":""},{"$f":"IFERROR(IF(WpAreaC_Sub1_exist,IF(SUMPRODUCT(--(INDIRECT(\"WP!$C$\"&$DO55&\":$C$\"&$DP55)=$C55),--(INDIRECT(\"WP!$B\"&$DO55&\":$B\"&$DP55)=\"Y\"),--(INDIRECT(\"WP!$\"&$BU$41&\"$\"&$DO55&\":$\"&$BU$41&\"$\"&$DP55)<>\"\"),--(INDIRECT(\"WP!$K\"&$DO55&\":$K\"&$DP55)>0))<>0,SUMPRODUCT(--(INDIRECT(\"WP!$C$\"&$DO55&\":$C$\"&$DP55)=$C55),--(INDIRECT(\"WP!$B\"&$DO55&\":$B\"&$DP55)=\"Y\"),--(INDIRECT(\"WP!$\"&$BU$41&\"$\"&$DO55&\":$\"&$BU$41&\"$\"&$DP55)<>\"\"),INDIRECT(\"WP!$K\"&$DO55&\":$K\"&$DP55)),\"\"),\"\"),\"\")","v":""},{"$f":"IFERROR(IF(WpAreaC_Sub2_exist,IF(SUMPRODUCT(--(INDIRECT(\"WP!$C$\"&$DO55&\":$C$\"&$DP55)=$C55),--(INDIRECT(\"WP!$\"&$BX$41&\"$\"&$DO55&\":$\"&$BX$41&\"$\"&$DP55)<>\"\"),--(INDIRECT(\"WP!$K$\"&$DO55&\":$K$\"&$DP55)>0))>0,SUMPRODUCT(--(INDIRECT(\"WP!$C$\"&$DO55&\":$C$\"&$DP55)=$C55),--(INDIRECT(\"WP!$\"&$BX$41&\"$\"&$DO55&\":$\"&$BX$41&\"$\"&$DP55)<>\"\"),INDIRECT(\"WP!$K\"&$DO55&\":$K\"&$DP55),INDIRECT(\"WP!$\"&$BX$41&\"$\"&$DO55&\":$\"&$BX$41&\"$\"&$DP55))/SUMPRODUCT(--(INDIRECT(\"WP!$C$\"&$DO55&\":$C$\"&$DP55)=$C55),--(INDIRECT(\"WP!$\"&$BX$41&\"$\"&$DO55&\":$\"&$BX$41&\"$\"&$DP55)<>\"\"),INDIRECT(\"WP!$K\"&$DO55&\":$K\"&$DP55)),\"\"),\"\"),\"\")","v":""},{"$f":"IFERROR(IF(WpAreaC_Sub2_exist,IF(SUMPRODUCT(--(INDIRECT(\"WP!$C$\"&$DO55&\":$C$\"&$DP55)=$C55),--(INDIRECT(\"WP!$B\"&$DO55&\":$B\"&$DP55)=\"Y\"),--(INDIRECT(\"WP!$\"&$BX$41&\"$\"&$DO55&\":$\"&$BX$41&\"$\"&$DP55)=1),--(INDIRECT(\"WP!$K\"&$DO55&\":$K\"&$DP55)>0))<>0,SUMPRODUCT(--(INDIRECT(\"WP!$C$\"&$DO55&\":$C$\"&$DP55)=$C55),--(INDIRECT(\"WP!$B\"&$DO55&\":$B\"&$DP55)=\"Y\"),--(INDIRECT(\"WP!$\"&$BX$41&\"$\"&$DO55&\":$\"&$BX$41&\"$\"&$DP55)=1),INDIRECT(\"WP!$K\"&$DO55&\":$K\"&$DP55)),IF(BZ55<>\"\",0,\"\")),\"\"),\"\")","v":""},{"$f":"IFERROR(IF(WpAreaC_Sub2_exist,IF(SUMPRODUCT(--(INDIRECT(\"WP!$C$\"&$DO55&\":$C$\"&$DP55)=$C55),--(INDIRECT(\"WP!$B\"&$DO55&\":$B\"&$DP55)=\"Y\"),--(INDIRECT(\"WP!$\"&$BX$41&\"$\"&$DO55&\":$\"&$BX$41&\"$\"&$DP55)<>\"\"),--(INDIRECT(\"WP!$K\"&$DO55&\":$K\"&$DP55)>0))<>0,SUMPRODUCT(--(INDIRECT(\"WP!$C$\"&$DO55&\":$C$\"&$DP55)=$C55),--(INDIRECT(\"WP!$B\"&$DO55&\":$B\"&$DP55)=\"Y\"),--(INDIRECT(\"WP!$\"&$BX$41&\"$\"&$DO55&\":$\"&$BX$41&\"$\"&$DP55)<>\"\"),INDIRECT(\"WP!$K\"&$DO55&\":$K\"&$DP55)),\"\"),\"\"),\"\")","v":""},{"$f":"IFERROR(IF(WpAreaC_Sub3_exist,IF(SUMPRODUCT(--(INDIRECT(\"WP!$C$\"&$DO55&\":$C$\"&$DP55)=$C55),--(INDIRECT(\"WP!$\"&$CA$41&\"$\"&$DO55&\":$\"&$CA$41&\"$\"&$DP55)<>\"\"),--(INDIRECT(\"WP!$K$\"&$DO55&\":$K$\"&$DP55)>0))>0,SUMPRODUCT(--(INDIRECT(\"WP!$C$\"&$DO55&\":$C$\"&$DP55)=$C55),--(INDIRECT(\"WP!$\"&$CA$41&\"$\"&$DO55&\":$\"&$CA$41&\"$\"&$DP55)<>\"\"),INDIRECT(\"WP!$K\"&$DO55&\":$K\"&$DP55),INDIRECT(\"WP!$\"&$CA$41&\"$\"&$DO55&\":$\"&$CA$41&\"$\"&$DP55))/SUMPRODUCT(--(INDIRECT(\"WP!$C$\"&$DO55&\":$C$\"&$DP55)=$C55),--(INDIRECT(\"WP!$\"&$CA$41&\"$\"&$DO55&\":$\"&$CA$41&\"$\"&$DP55)<>\"\"),INDIRECT(\"WP!$K\"&$DO55&\":$K\"&$DP55)),\"\"),\"\"),\"\")","v":""},{"$f":"IFERROR(IF(WpAreaC_Sub3_exist,IF(SUMPRODUCT(--(INDIRECT(\"WP!$C$\"&$DO55&\":$C$\"&$DP55)=$C55),--(INDIRECT(\"WP!$B\"&$DO55&\":$B\"&$DP55)=\"Y\"),--(INDIRECT(\"WP!$\"&$CA$41&\"$\"&$DO55&\":$\"&$CA$41&\"$\"&$DP55)=1),--(INDIRECT(\"WP!$K\"&$DO55&\":$K\"&$DP55)>0))<>0,SUMPRODUCT(--(INDIRECT(\"WP!$C$\"&$DO55&\":$C$\"&$DP55)=$C55),--(INDIRECT(\"WP!$B\"&$DO55&\":$B\"&$DP55)=\"Y\"),--(INDIRECT(\"WP!$\"&$CA$41&\"$\"&$DO55&\":$\"&$CA$41&\"$\"&$DP55)=1),INDIRECT(\"WP!$K\"&$DO55&\":$K\"&$DP55)),IF(CC55<>\"\",0,\"\")),\"\"),\"\")","v":""},{"$f":"IFERROR(IF(WpAreaC_Sub3_exist,IF(SUMPRODUCT(--(INDIRECT(\"WP!$C$\"&$DO55&\":$C$\"&$DP55)=$C55),--(INDIRECT(\"WP!$B\"&$DO55&\":$B\"&$DP55)=\"Y\"),--(INDIRECT(\"WP!$\"&$CA$41&\"$\"&$DO55&\":$\"&$CA$41&\"$\"&$DP55)<>\"\"),--(INDIRECT(\"WP!$K\"&$DO55&\":$K\"&$DP55)>0))<>0,SUMPRODUCT(--(INDIRECT(\"WP!$C$\"&$DO55&\":$C$\"&$DP55)=$C55),--(INDIRECT(\"WP!$B\"&$DO55&\":$B\"&$DP55)=\"Y\"),--(INDIRECT(\"WP!$\"&$CA$41&\"$\"&$DO55&\":$\"&$CA$41&\"$\"&$DP55)<>\"\"),INDIRECT(\"WP!$K\"&$DO55&\":$K\"&$DP55)),\"\"),\"\"),\"\")","v":""},null,null,null,null,"","","","","","","","","","","","",null,"","","","","","","","","",null,"","","","","","","","","",null,{"$f":"MIN(IF(WP!$C$12:$C$79=$C55,ROW(WP!$C$12:$C$79),\"\"))","v":0},{"$f":"MAX(IF(WP!$C$12:$C$79=$C55,ROW(WP!$C$12:$C$79),\"\"))","v":0}]
[null,null,null,null,null,null,null,null,null,null,null,null,null,null,null,null,null,null,null,null,null,null,null,null,null,null,null,null,null,null,null,null,null,null,null,null,null,null,null,null,null,null,null,null,null,null,"End of source data"]
[]
[null,"5 References"]
[null,"[1] RP-240784","New WID on UE Conformance - IoT NTN enhancements plus CT1 aspects\n\n"]

{"sheet":"WP","index":1,"n_rows":79,"n_cols":51,"rows_kept":79,"cut":false,"hidden":false,"merged":[[0,0,0,1],[0,2,0,9],[0,47,0,50],[1,0,1,1],[1,2,1,9],[2,0,2,1],[2,2,2,9],[2,17,2,23],[3,0,3,1],[3,2,3,4],[3,5,3,7],[3,8,3,9],[4,0,4,1],[4,2,4,4],[4,5,4,7],[4,8,4,9],[5,47,5,48],[5,49,5,50],[6,27,6,40],[10,16,10,24],[78,27,78,40],[0,15,5,15],[0,25,6,25],[7,26,14,26],[7,36,14,36],[1,47,4,47],[0,27,5,35],[0,37,5,45],[3,16,4,18],[3,19,4,21],[3,22,4,24],[1,48,4,50],[0,16,1,24],[3,11,4,14]]}
["WP Title:",null,"UE Conformance - IoT NTN enhancements plus CT1 aspects",null,null,null,null,null,null,null,null,null,null,null,null,"Start of workplan status columns.  Note! Do not remove this column. ","WP item status",null,null,null,null,null,null,null,null,"End of workplan columns.  Note! Do not remove this column. ",null,"Current meeting status",null,null,null,null,null,null,null,null,null,"Previous meeting status baseline",null,null,null,null,null,null,null,null,null,"WP rapporteur's private information. \nThese columns will be removed in the clean copy created by \"Create clean WP for publishing\".\n"]
["WI code",null,"IoT_NTN_enh_plus_CT1-UEConTest"]
["WP Scope:",null,"This work plan covers the tasks needed to include NB-IoT (Narrowband IoT) enhancement core & performance requirements for Non-Terrestrial Networks (NTN)",null,null,null,null,null,null,null,null,null,null,null,null,null,null,"vs Area"]
["WP Resp:",null,"Danni Song (CMCC); Danbo Fu (MediaTek); Yufeng Zhang(CAICT)",null,null,"songdan@chinamobile.com",null,null,null,null,null,"WP item completion",null,null,null,null,{"$f":"WpAreaA","v":"LTE"},null,null,{"$f":"WpAreaB","v":"N/A"},null,null,{"$f":"WpAreaC","v":"N/A"}]
["TS Resp:",null,"N/A",null,null,"N/A"]
["WP Item ID","Is new test case?","TS/area","Clause","Title","Test purpose / Task","Company","Target","TDOC(s)","Comments","Weight","Overall",{"$f":"WpAreaA","v":"LTE"},{"$f":"WpAreaB","v":"N/A"},{"$f":"WpAreaC","v":"N/A"},null,{"$f":"WpAreaA_Sub1","v":"FDD"},{"$f":"WpAreaA_Sub2","v":"N/A"},{"$f":"WpAreaA_Sub3","v":"N/A"},{"$f":"WpAreaB_Sub1","v":"N/A"},{"$f":"WpAreaB_Sub2","v":"N/A"},{"$f":"WpAreaB_Sub3","v":"N/A"},{"$f":"WpAreaC_Sub1","v":"N/A"},{"$f":"WpAreaC_Sub2","v":"N/A"},{"$f":"WpAreaC_Sub3","v":"N/A"},null,null,null,null,null,null,null,null,null,null,null,null,null,null,null,null,null,null,null,null,null,null,"WP rapporteur internal notes",null,"Company <-> Contact email address(es)"]
[null,null,null,null,null,null,null,null,null,null,null,null,null,null,null,null,null,null,null,null,null,null,null,null,null,null,null,"Start of source data",null,null,null,null,null,null,null,null,null,null,null,null,null,null,null,null,null,null,null,"<Internal note column#1>","<Internal note column#2>","Company","E-mail address(es)"]
[null,null,null,null,null,null,null,null,null,null,null,null,null,null,"Overall",null,{"$f":"getProgress(AB8,AL8,\"%\",1,1)","v":"5%\n(+5%)"},{"$f":"getProgress(AC8,AM8,\"%\",1,1)","v":""},{"$f":"getProgress(AD8,AN8,\"%\",1,1)","v":""},{"$f":"getProgress(AE8,AO8,\"%\",1,1)","v":""},{"$f":"getProgress(AF8,AP8,\"%\",1,1)","v":""},{"$f":"getProgress(AG8,AQ8,\"%\",1,1)","v":""},{"$f":"getProgress(AH8,AR8,\"%\",1,1)","v":""},{"$f":"getProgress(AI8,AS8,\"%\",1,1)","v":""},{"$f":"getProgress(AJ8,AT8,\"%\",1,1)","v":""},null,"Start of Current Meeting Data",{"$f":"IF(SUMPRODUCT(--(INDIRECT(WpAreaA_Sub1_Rng)<>\"\"),INDIRECT(WpWeight_Rng)),$Q$11+(1-$Q$11)*(SUMPRODUCT(--(INDIRECT(WpAreaA_Sub1_Rng)<>\"\"),INDIRECT(WpWeight_Rng),INDIRECT(WpAreaA_Sub1_Rng))/SUMPRODUCT(--(INDIRECT(WpAreaA_Sub1_Rng)<>\"\"),INDIRECT(WpWeight_Rng))),\"\")","v":0.05},{"$f":"IF(SUMPRODUCT(--(INDIRECT(WpAreaA_Sub2_Rng)<>\"\"),INDIRECT(WpWeight_Rng)),$Q$11+(1-$Q$11)*(SUMPRODUCT(--(INDIRECT(WpAreaA_Sub2_Rng)<>\"\"),INDIRECT(WpWeight_Rng),INDIRECT(WpAreaA_Sub2_Rng))/SUMPRODUCT(--(INDIRECT(WpAreaA_Sub2_Rng)<>\"\"),INDIRECT(WpWeight_Rng))),\"\")","v":""},{"$f":"IF(SUMPRODUCT(--(INDIRECT(WpAreaA_Sub3_Rng)<>\"\"),INDIRECT(WpWeight_Rng)),$Q$11+(1-$Q$11)*(SUMPRODUCT(--(INDIRECT(WpAreaA_Sub3_Rng)<>\"\"),INDIRECT(WpWeight_Rng),INDIRECT(WpAreaA_Sub3_Rng))/SUMPRODUCT(--(INDIRECT(WpAreaA_Sub3_Rng)<>\"\"),INDIRECT(WpWeight_Rng))),\"\")","v":""},{"$f":"IF(SUMPRODUCT(--(INDIRECT(WpAreaB_Sub1_Rng)<>\"\"),INDIRECT(WpWeight_Rng)),$Q$11+(1-$Q$11)*(SUMPRODUCT(--(INDIRECT(WpAreaB_Sub1_Rng)<>\"\"),INDIRECT(WpWeight_Rng),INDIRECT(WpAreaB_Sub1_Rng))/SUMPRODUCT(--(INDIRECT(WpAreaB_Sub1_Rng)<>\"\"),INDIRECT(WpWeight_Rng))),\"\")","v":""},{"$f":"IF(SUMPRODUCT(--(INDIRECT(WpAreaB_Sub2_Rng)<>\"\"),INDIRECT(WpWeight_Rng)),$Q$11+(1-$Q$11)*(SUMPRODUCT(--(INDIRECT(WpAreaB_Sub2_Rng)<>\"\"),INDIRECT(WpWeight_Rng),INDIRECT(WpAreaB_Sub2_Rng))/SUMPRODUCT(--(INDIRECT(WpAreaB_Sub2_Rng)<>\"\"),INDIRECT(WpWeight_Rng))),\"\")","v":""},{"$f":"IF(SUMPRODUCT(--(INDIRECT(WpAreaB_Sub3_Rng)<>\"\"),INDIRECT(WpWeight_Rng)),$Q$11+(1-$Q$11)*(SUMPRODUCT(--(INDIRECT(WpAreaB_Sub3_Rng)<>\"\"),INDIRECT(WpWeight_Rng),INDIRECT(WpAreaB_Sub3_Rng))/SUMPRODUCT(--(INDIRECT(WpAreaB_Sub3_Rng)<>\"\"),INDIRECT(WpWeight_Rng))),\"\")","v":""},{"$f":"IF(SUMPRODUCT(--(INDIRECT(WpAreaC_Sub1_Rng)<>\"\"),INDIRECT(WpWeight_Rng)),$Q$11+(1-$Q$11)*(SUMPRODUCT(--(INDIRECT(WpAreaC_Sub1_Rng)<>\"\"),INDIRECT(WpWeight_Rng),INDIRECT(WpAreaC_Sub1_Rng))/SUMPRODUCT(--(INDIRECT(WpAreaC_Sub1_Rng)<>\"\"),INDIRECT(WpWeight_Rng))),\"\")","v":""},{"$f":"IF(SUMPRODUCT(--(INDIRECT(WpAreaC_Sub2_Rng)<>\"\"),INDIRECT(WpWeight_Rng)),$Q$11+(1-$Q$11)*(SUMPRODUCT(--(INDIRECT(WpAreaC_Sub2_Rng)<>\"\"),INDIRECT(WpWeight_Rng),INDIRECT(WpAreaC_Sub2_Rng))/SUMPRODUCT(--(INDIRECT(WpAreaC_Sub2_Rng)<>\"\"),INDIRECT(WpWeight_Rng))),\"\")","v":""},{"$f":"IF(SUMPRODUCT(--(INDIRECT(WpAreaC_Sub3_Rng)<>\"\"),INDIRECT(WpWeight_Rng)),$Q$11+(1-$Q$11)*(SUMPRODUCT(--(INDIRECT(WpAreaC_Sub3_Rng)<>\"\"),INDIRECT(WpWeight_Rng),INDIRECT(WpAreaC_Sub3_Rng))/SUMPRODUCT(--(INDIRECT(WpAreaC_Sub3_Rng)<>\"\"),INDIRECT(WpWeight_Rng))),\"\")","v":""},"End of Current Meeting Data","","","","","","","","",""]
[null,null,null,null,null,null,null,null,null,null,null,null,null,null,"Number of WP items",null,{"$f":"getProgress(AB9,AL9,,,1)","v":"30\n(+30)"},{"$f":"getProgress(AC9,AM9,,,1)","v":"0"},{"$f":"getProgress(AD9,AN9,,,1)","v":"0"},{"$f":"getProgress(AE9,AO9,,,1)","v":"0"},{"$f":"getProgress(AF9,AP9,,,1)","v":"0"},{"$f":"getProgress(AG9,AQ9,,,1)","v":"0"},{"$f":"getProgress(AH9,AR9,,,1)","v":"0"},{"$f":"getProgress(AI9,AS9,,,1)","v":"0"},{"$f":"getProgress(AJ9,AT9,,,1)","v":"0"},null,null,{"$f":"IF(WpAreaA_Sub1_exist,COUNTA(INDIRECT(WpAreaA_Sub1_Rng)),0)","v":30},{"$f":"IF(WpAreaA_Sub1_exist,COUNTA(INDIRECT(WpAreaA_Sub2_Rng)),0)","v":0},{"$f":"IF(WpAreaA_Sub1_exist,COUNTA(INDIRECT(WpAreaA_Sub3_Rng)),0)","v":0},{"$f":"IF(WpAreaB_Sub1_exist,COUNTA(INDIRECT(WpAreaB_Sub1_Rng)),0)","v":0},{"$f":"IF(WpAreaB_Sub1_exist,COUNTA(INDIRECT(WpAreaB_Sub2_Rng)),0)","v":0},{"$f":"IF(WpAreaB_Sub1_exist,COUNTA(INDIRECT(WpAreaB_Sub3_Rng)),0)","v":0},{"$f":"IF(WpAreaC_Sub1_exist,COUNTA(INDIRECT(WpAreaC_Sub1_Rng)),0)","v":0},{"$f":"IF(WpAreaC_Sub1_exist,COUNTA(INDIRECT(WpAreaC_Sub2_Rng)),0)","v":0},{"$f":"IF(WpAreaC_Sub1_exist,COUNTA(INDIRECT(WpAreaC_Sub3_Rng)),0)","v":0},null,0,0,0,0,0,0,0,0,0]
[null,null,null,null,null,null,null,null,null,null,null,null,null,null,"Sum weight of WP items",null,{"$f":"getProgress(AB10,AL10,,1,1)","v":"19.4\n(+19.4)"},{"$f":"getProgress(AC10,AM10,,1,1)","v":"0"},{"$f":"getProgress(AD10,AN10,,1,1)","v":"0"},{"$f":"getProgress(AE10,AO10,,1,1)","v":"0"},{"$f":"getProgress(AF10,AP10,,1,1)","v":"0"},{"$f":"getProgress(AG10,AQ10,,1,1)","v":"0"},{"$f":"getProgress(AH10,AR10,,1,1)","v":"0"},{"$f":"getProgress(AI10,AS10,,1,1)","v":"0"},{"$f":"getProgress(AJ10,AT10,,1,1)","v":"0"},null,null,{"$f":"IF(WpAreaA_Sub1_exist,SUMPRODUCT(--(INDIRECT(WpAreaA_Sub1_Rng)<>\"\"),INDIRECT(WpWeight_Rng)),0)","v":19.4},{"$f":"IF(WpAreaA_Sub2_exist,SUMPRODUCT(--(INDIRECT(WpAreaA_Sub2_Rng)<>\"\"),INDIRECT(WpWeight_Rng)),0)","v":0},{"$f":"IF(WpAreaA_Sub3_exist,SUMPRODUCT(--(INDIRECT(WpAreaA_Sub3_Rng)<>\"\"),INDIRECT(WpWeight_Rng)),0)","v":0},{"$f":"IF(WpAreaB_Sub1_exist,SUMPRODUCT(--(INDIRECT(WpAreaB_Sub1_Rng)<>\"\"),INDIRECT(WpWeight_Rng)),0)","v":0},{"$f":"IF(WpAreaB_Sub2_exist,SUMPRODUCT(--(INDIRECT(WpAreaB_Sub2_Rng)<>\"\"),INDIRECT(WpWeight_Rng)),0)","v":0},{"$f":"IF(WpAreaB_Sub3_exist,SUMPRODUCT(--(INDIRECT(WpAreaB_Sub3_Rng)<>\"\"),INDIRECT(WpWeight_Rng)),0)","v":0},{"$f":"IF(WpAreaC_Sub1_exist,SUMPRODUCT(--(INDIRECT(WpAreaC_Sub1_Rng)<>\"\"),INDIRECT(WpWeight_Rng)),0)","v":0},{"$f":"IF(WpAreaC_Sub2_exist,SUMPRODUCT(--(INDIRECT(WpAreaC_Sub2_Rng)<>\"\"),INDIRECT(WpWeight_Rng)),0)","v":0},{"$f":"IF(WpAreaC_Sub3_exist,SUMPRODUCT(--(INDIRECT(WpAreaC_Sub3_Rng)<>\"\"),INDIRECT(WpWeight_Rng)),0)","v":0},null,0,0,0,0,0,0,0,0,0]
[null,null,null,null,null,null,null,null,null,null,null,null,null,null,"Contribution by  work plan analysis",null,0.05,null,null,null,null,null,null,null,null,null,null,{"$f":"Q11","v":0.05},null,null,null,null,null,null,null,null,null,0.05]
["Start of work plan items.  Note! Do not remove this row. Introduce new work plan rows/items below this row."]
["LTE"]
["LTE Common"]
["TS 36.508: Common test environment"]
[null,null,"36.508",null,"Placeholder for estimation of not yet identified tasks within the area (to be removed when no further tasks expected).",null,null,null,null,null,"TBD",{"$f":"getProgress(AB16,AL16,\"%\",1,1)","v":""},{"$f":"getProgress(AC16,AM16,\"%\",1,1)","v":""},{"$f":"getProgress(AD16,AN16,\"%\",1,1)","v":""},{"$f":"getProgress(AE16,AO16,\"%\",1,1)","v":""},null,null,null,null,null,null,null,null,null,null,null,null,{"$f":"IF(SUMPRODUCT(--($Q$10:$Y$10>0),--(Q16:Y16<>\"\"))>0,SUMPRODUCT(--($Q$10:$Y$10>0),Q16:Y16)/SUMPRODUCT(--($Q$10:$Y$10>0),--(Q16:Y16<>\"\")),\"\")","v":""},{"$f":"IF(WpAreaA_exist,IF(SUMPRODUCT(--($Q$9:$S$9<>0),--(Q16:S16<>\"\"))>0,SUMPRODUCT(--($Q$9:$S$9>0),Q16:S16)/SUMPRODUCT(--($Q$9:$S$9<>0),--(Q16:S16<>\"\")),\"\"),\"\")","v":""},{"$f":"IF(WpAreaB_exist,IF(SUMPRODUCT(--($T$9:$V$9<>0),--(T16:V16<>\"\"))>0,SUMPRODUCT(--($T$9:$V$9>0),T16:V16)/SUMPRODUCT(--($T$9:$V$9<>0),--(T16:V16<>\"\")),\"\"),\"\")","v":""},{"$f":"IF(WpAreaC_exist,IF(SUMPRODUCT(--($W$9:$Y$9<>0),--(W16:Y16<>\"\"))>0,SUMPRODUCT(--($W$9:$Y$9>0),W16:Y16)/SUMPRODUCT(--($W$9:$Y$9<>0),--(W16:Y16<>\"\")),\"\"),\"\")","v":""},null,null,null,null,null,null,"","","",""]
[null,null,"36.508",8,"NB-IoT test environment","Clause header",null,null,null,null,0,null,null,{"$f":"getProgress(AD17,AN17,\"%\",1,1)","v":""},{"$f":"getProgress(AE17,AO17,\"%\",1,1)","v":""},null,null,null,null,null,null,null,null,null,null,null,null,{"$f":"IF(SUMPRODUCT(--($Q$10:$Y$10>0),--(Q17:Y17<>\"\"))>0,SUMPRODUCT(--($Q$10:$Y$10>0),Q17:Y17)/SUMPRODUCT(--($Q$10:$Y$10>0),--(Q17:Y17<>\"\")),\"\")","v":""},{"$f":"IF(WpAreaA_exist,IF(SUMPRODUCT(--($Q$9:$S$9<>0),--(Q17:S17<>\"\"))>0,SUMPRODUCT(--($Q$9:$S$9>0),Q17:S17)/SUMPRODUCT(--($Q$9:$S$9<>0),--(Q17:S17<>\"\")),\"\"),\"\")","v":""},{"$f":"IF(WpAreaB_exist,IF(SUMPRODUCT(--($T$9:$V$9<>0),--(T17:V17<>\"\"))>0,SUMPRODUCT(--($T$9:$V$9>0),T17:V17)/SUMPRODUCT(--($T$9:$V$9<>0),--(T17:V17<>\"\")),\"\"),\"\")","v":""},{"$f":"IF(WpAreaC_exist,IF(SUMPRODUCT(--($W$9:$Y$9<>0),--(W17:Y17<>\"\"))>0,SUMPRODUCT(--($W$9:$Y$9>0),W17:Y17)/SUMPRODUCT(--($W$9:$Y$9<>0),--(W17:Y17<>\"\")),\"\"),\"\")","v":""},null,null,null,null,null,null,"","","",""]
[null,null,"36.508","8.1","NB-IoT Common test environment","Sub-clause header",null,null,null,null,0,null,null,{"$f":"getProgress(AD18,AN18,\"%\",1,1)","v":""},{"$f":"getProgress(AE18,AO18,\"%\",1,1)","v":""},null,null,null,null,null,null,null,null,null,null,null,null,{"$f":"IF(SUMPRODUCT(--($Q$10:$Y$10>0),--(Q18:Y18<>\"\"))>0,SUMPRODUCT(--($Q$10:$Y$10>0),Q18:Y18)/SUMPRODUCT(--($Q$10:$Y$10>0),--(Q18:Y18<>\"\")),\"\")","v":""},{"$f":"IF(WpAreaA_exist,IF(SUMPRODUCT(--($Q$9:$S$9<>0),--(Q18:S18<>\"\"))>0,SUMPRODUCT(--($Q$9:$S$9>0),Q18:S18)/SUMPRODUCT(--($Q$9:$S$9<>0),--(Q18:S18<>\"\")),\"\"),\"\")","v":""},{"$f":"IF(WpAreaB_exist,IF(SUMPRODUCT(--($T$9:$V$9<>0),--(T18:V18<>\"\"))>0,SUMPRODUCT(--($T$9:$V$9>0),T18:V18)/SUMPRODUCT(--($T$9:$V$9<>0),--(T18:V18<>\"\")),\"\"),\"\")","v":""},{"$f":"IF(WpAreaC_exist,IF(SUMPRODUCT(--($W$9:$Y$9<>0),--(W18:Y18<>\"\"))>0,SUMPRODUCT(--($W$9:$Y$9>0),W18:Y18)/SUMPRODUCT(--($W$9:$Y$9<>0),--(W18:Y18<>\"\")),\"\"),\"\")","v":""},null,null,null,null,null,null,"","","",""]
[1,null,36.508,"8.1.4.3","NB-IoT Reference system configurations","Update SIB information for neighbor cell","MediaTek","RAN5#106 (Feb-25)",null,"allen.zhang@mediatek.com juan.huang@mediatek.com",0.5,{"$f":"getProgress(AB19,AL19,\"%\",1,1)","v":"0%"},{"$f":"getProgress(AC19,AM19,\"%\",1,1)","v":"0%"},{"$f":"getProgress(AD19,AN19,\"%\",1,1)","v":""},{"$f":"getProgress(AE19,AO19,\"%\",1,1)","v":""},null,0,null,null,null,null,null,null,null,null,null,null,{"$f":"IF(SUMPRODUCT(--($Q$10:$Y$10>0),--(Q19:Y19<>\"\"))>0,SUMPRODUCT(--($Q$10:$Y$10>0),Q19:Y19)/SUMPRODUCT(--($Q$10:$Y$10>0),--(Q19:Y19<>\"\")),\"\")","v":0},{"$f":"IF(WpAreaA_exist,IF(SUMPRODUCT(--($Q$9:$S$9<>0),--(Q19:S19<>\"\"))>0,SUMPRODUCT(--($Q$9:$S$9>0),Q19:S19)/SUMPRODUCT(--($Q$9:$S$9<>0),--(Q19:S19<>\"\")),\"\"),\"\")","v":0},{"$f":"IF(WpAreaB_exist,IF(SUMPRODUCT(--($T$9:$V$9<>0),--(T19:V19<>\"\"))>0,SUMPRODUCT(--($T$9:$V$9>0),T19:V19)/SUMPRODUCT(--($T$9:$V$9<>0),--(T19:V19<>\"\")),\"\"),\"\")","v":""},{"$f":"IF(WpAreaC_exist,IF(SUMPRODUCT(--($W$9:$Y$9<>0),--(W19:Y19<>\"\"))>0,SUMPRODUCT(--($W$9:$Y$9>0),W19:Y19)/SUMPRODUCT(--($W$9:$Y$9<>0),--(W19:Y19<>\"\")),\"\"),\"\")","v":""},null,null,null,null,null,null,"","","",""]
[2,null,36.508,"8.1.5B","Common test environment for Vertical UEs","Update Common test environment","MediaTek","RAN5#106 (Feb-25)",null,"allen.zhang@mediatek.com juan.huang@mediatek.com",0.5,{"$f":"getProgress(AB20,AL20,\"%\",1,1)","v":"0%"},{"$f":"getProgress(AC20,AM20,\"%\",1,1)","v":"0%"},{"$f":"getProgress(AD20,AN20,\"%\",1,1)","v":""},{"$f":"getProgress(AE20,AO20,\"%\",1,1)","v":""},null,0,null,null,null,null,null,null,null,null,null,null,{"$f":"IF(SUMPRODUCT(--($Q$10:$Y$10>0),--(Q20:Y20<>\"\"))>0,SUMPRODUCT(--($Q$10:$Y$10>0),Q20:Y20)/SUMPRODUCT(--($Q$10:$Y$10>0),--(Q20:Y20<>\"\")),\"\")","v":0},{"$f":"IF(WpAreaA_exist,IF(SUMPRODUCT(--($Q$9:$S$9<>0),--(Q20:S20<>\"\"))>0,SUMPRODUCT(--($Q$9:$S$9>0),Q20:S20)/SUMPRODUCT(--($Q$9:$S$9<>0),--(Q20:S20<>\"\")),\"\"),\"\")","v":0},{"$f":"IF(WpAreaB_exist,IF(SUMPRODUCT(--($T$9:$V$9<>0),--(T20:V20<>\"\"))>0,SUMPRODUCT(--($T$9:$V$9>0),T20:V20)/SUMPRODUCT(--($T$9:$V$9<>0),--(T20:V20<>\"\")),\"\"),\"\")","v":""},{"$f":"IF(WpAreaC_exist,IF(SUMPRODUCT(--($W$9:$Y$9<>0),--(W20:Y20<>\"\"))>0,SUMPRODUCT(--($W$9:$Y$9>0),W20:Y20)/SUMPRODUCT(--($W$9:$Y$9<>0),--(W20:Y20<>\"\")),\"\"),\"\")","v":""},null,null,null,null,null,null,"","","",""]
[null,null,"36.508",8.4,"NB-IOT Test environment for RRM tests","Sub-clause header",null,null,null,null,null,null,null,{"$f":"getProgress(AD21,AN21,\"%\",1,1)","v":""},{"$f":"getProgress(AE21,AO21,\"%\",1,1)","v":""},null,null,null,null,null,null,null,null,null,null,null,null,{"$f":"IF(SUMPRODUCT(--($Q$10:$Y$10>0),--(Q21:Y21<>\"\"))>0,SUMPRODUCT(--($Q$10:$Y$10>0),Q21:Y21)/SUMPRODUCT(--($Q$10:$Y$10>0),--(Q21:Y21<>\"\")),\"\")","v":""},{"$f":"IF(WpAreaA_exist,IF(SUMPRODUCT(--($Q$9:$S$9<>0),--(Q21:S21<>\"\"))>0,SUMPRODUCT(--($Q$9:$S$9>0),Q21:S21)/SUMPRODUCT(--($Q$9:$S$9<>0),--(Q21:S21<>\"\")),\"\"),\"\")","v":""},{"$f":"IF(WpAreaB_exist,IF(SUMPRODUCT(--($T$9:$V$9<>0),--(T21:V21<>\"\"))>0,SUMPRODUCT(--($T$9:$V$9>0),T21:V21)/SUMPRODUCT(--($T$9:$V$9<>0),--(T21:V21<>\"\")),\"\"),\"\")","v":""},{"$f":"IF(WpAreaC_exist,IF(SUMPRODUCT(--($W$9:$Y$9<>0),--(W21:Y21<>\"\"))>0,SUMPRODUCT(--($W$9:$Y$9>0),W21:Y21)/SUMPRODUCT(--($W$9:$Y$9<>0),--(W21:Y21<>\"\")),\"\"),\"\")","v":""},null,null,null,null,null,null,"","","",""]
[3,null,36.508,"8.4.2.1.3","NB-IoT Common contents of system information messages","Update SIB information for neighbor cell","MediaTek","RAN5#106 (Feb-25)",null,"allen.zhang@mediatek.com juan.huang@mediatek.com",0.5,{"$f":"getProgress(AB22,AL22,\"%\",1,1)","v":"0%"},{"$f":"getProgress(AC22,AM22,\"%\",1,1)","v":"0%"},{"$f":"getProgress(AD22,AN22,\"%\",1,1)","v":""},{"$f":"getProgress(AE22,AO22,\"%\",1,1)","v":""},null,0,null,null,null,null,null,null,null,null,null,null,{"$f":"IF(SUMPRODUCT(--($Q$10:$Y$10>0),--(Q22:Y22<>\"\"))>0,SUMPRODUCT(--($Q$10:$Y$10>0),Q22:Y22)/SUMPRODUCT(--($Q$10:$Y$10>0),--(Q22:Y22<>\"\")),\"\")","v":0},{"$f":"IF(WpAreaA_exist,IF(SUMPRODUCT(--($Q$9:$S$9<>0),--(Q22:S22<>\"\"))>0,SUMPRODUCT(--($Q$9:$S$9>0),Q22:S22)/SUMPRODUCT(--($Q$9:$S$9<>0),--(Q22:S22<>\"\")),\"\"),\"\")","v":0},{"$f":"IF(WpAreaB_exist,IF(SUMPRODUCT(--($T$9:$V$9<>0),--(T22:V22<>\"\"))>0,SUMPRODUCT(--($T$9:$V$9>0),T22:V22)/SUMPRODUCT(--($T$9:$V$9<>0),--(T22:V22<>\"\")),\"\"),\"\")","v":""},{"$f":"IF(WpAreaC_exist,IF(SUMPRODUCT(--($W$9:$Y$9<>0),--(W22:Y22<>\"\"))>0,SUMPRODUCT(--($W$9:$Y$9>0),W22:Y22)/SUMPRODUCT(--($W$9:$Y$9<>0),--(W22:Y22<>\"\")),\"\"),\"\")","v":""},null,null,null,null,null,null,"","","",""]
[4,null,36.508,"8.4.6","Test environment for NB-IoT NTN RRM testing","Update UE location and ephemeris information for location based test cases and NGSO multi-cell test cases",null,null,null,null,0.5,{"$f":"getProgress(AB23,AL23,\"%\",1,1)","v":"0%"},{"$f":"getProgress(AC23,AM23,\"%\",1,1)","v":"0%"},{"$f":"getProgress(AD23,AN23,\"%\",1,1)","v":""},{"$f":"getProgress(AE23,AO23,\"%\",1,1)","v":""},null,0,null,null,null,null,null,null,null,null,null,null,{"$f":"IF(SUMPRODUCT(--($Q$10:$Y$10>0),--(Q23:Y23<>\"\"))>0,SUMPRODUCT(--($Q$10:$Y$10>0),Q23:Y23)/SUMPRODUCT(--($Q$10:$Y$10>0),--(Q23:Y23<>\"\")),\"\")","v":0},{"$f":"IF(WpAreaA_exist,IF(SUMPRODUCT(--($Q$9:$S$9<>0),--(Q23:S23<>\"\"))>0,SUMPRODUCT(--($Q$9:$S$9>0),Q23:S23)/SUMPRODUCT(--($Q$9:$S$9<>0),--(Q23:S23<>\"\")),\"\"),\"\")","v":0},{"$f":"IF(WpAreaB_exist,IF(SUMPRODUCT(--($T$9:$V$9<>0),--(T23:V23<>\"\"))>0,SUMPRODUCT(--($T$9:$V$9>0),T23:V23)/SUMPRODUCT(--($T$9:$V$9<>0),--(T23:V23<>\"\")),\"\"),\"\")","v":""},{"$f":"IF(WpAreaC_exist,IF(SUMPRODUCT(--($W$9:$Y$9<>0),--(W23:Y23<>\"\"))>0,SUMPRODUCT(--($W$9:$Y$9>0),W23:Y23)/SUMPRODUCT(--($W$9:$Y$9<>0),--(W23:Y23<>\"\")),\"\"),\"\")","v":""},null,null,null,null,null,null,"","","",""]
["TS 36.509: UE specific testing functions"]
[null,null,"36.509",null,"Placeholder for estimation of not yet identified tasks within the area (to be removed when no further tasks expected). ",null,null,null,null,null,0,{"$f":"getProgress(AB25,AL25,\"%\",1,1)","v":""},{"$f":"getProgress(AC25,AM25,\"%\",1,1)","v":""},{"$f":"getProgress(AD25,AN25,\"%\",1,1)","v":""},{"$f":"getProgress(AE25,AO25,\"%\",1,1)","v":""},null,null,null,null,null,null,null,null,null,null,null,null,{"$f":"IF(SUMPRODUCT(--($Q$10:$Y$10>0),--(Q25:Y25<>\"\"))>0,SUMPRODUCT(--($Q$10:$Y$10>0),Q25:Y25)/SUMPRODUCT(--($Q$10:$Y$10>0),--(Q25:Y25<>\"\")),\"\")","v":""},{"$f":"IF(WpAreaA_exist,IF(SUMPRODUCT(--($Q$9:$S$9<>0),--(Q25:S25<>\"\"))>0,SUMPRODUCT(--($Q$9:$S$9>0),Q25:S25)/SUMPRODUCT(--($Q$9:$S$9<>0),--(Q25:S25<>\"\")),\"\"),\"\")","v":""},{"$f":"IF(WpAreaB_exist,IF(SUMPRODUCT(--($T$9:$V$9<>0),--(T25:V25<>\"\"))>0,SUMPRODUCT(--($T$9:$V$9>0),T25:V25)/SUMPRODUCT(--($T$9:$V$9<>0),--(T25:V25<>\"\")),\"\"),\"\")","v":""},{"$f":"IF(WpAreaC_exist,IF(SUMPRODUCT(--($W$9:$Y$9<>0),--(W25:Y25<>\"\"))>0,SUMPRODUCT(--($W$9:$Y$9>0),W25:Y25)/SUMPRODUCT(--($W$9:$Y$9<>0),--(W25:Y25<>\"\")),\"\"),\"\")","v":""},null,null,null,null,null,null,"","","",""]
["TBD",null,"36.509","<Clause>","TBD","TBD",null,null,null,null,0,{"$f":"getProgress(AB26,AL26,\"%\",1,1)","v":""},{"$f":"getProgress(AC26,AM26,\"%\",1,1)","v":""},{"$f":"getProgress(AD26,AN26,\"%\",1,1)","v":""},{"$f":"getProgress(AE26,AO26,\"%\",1,1)","v":""},null,null,null,null,null,null,null,null,null,null,null,null,{"$f":"IF(SUMPRODUCT(--($Q$10:$Y$10>0),--(Q26:Y26<>\"\"))>0,SUMPRODUCT(--($Q$10:$Y$10>0),Q26:Y26)/SUMPRODUCT(--($Q$10:$Y$10>0),--(Q26:Y26<>\"\")),\"\")","v":""},{"$f":"IF(WpAreaA_exist,IF(SUMPRODUCT(--($Q$9:$S$9<>0),--(Q26:S26<>\"\"))>0,SUMPRODUCT(--($Q$9:$S$9>0),Q26:S26)/SUMPRODUCT(--($Q$9:$S$9<>0),--(Q26:S26<>\"\")),\"\"),\"\")","v":""},{"$f":"IF(WpAreaB_exist,IF(SUMPRODUCT(--($T$9:$V$9<>0),--(T26:V26<>\"\"))>0,SUMPRODUCT(--($T$9:$V$9>0),T26:V26)/SUMPRODUCT(--($T$9:$V$9<>0),--(T26:V26<>\"\")),\"\"),\"\")","v":""},{"$f":"IF(WpAreaC_exist,IF(SUMPRODUCT(--($W$9:$Y$9<>0),--(W26:Y26<>\"\"))>0,SUMPRODUCT(--($W$9:$Y$9>0),W26:Y26)/SUMPRODUCT(--($W$9:$Y$9<>0),--(W26:Y26<>\"\")),\"\"),\"\")","v":""},null,null,null,null,null,null,"","","",""]
["LTE RF/RRM"]
["TS 36.521-2: Applicability for RF, Demod/CSI reporting and RRM test cases"]
[null,null,"36.521-2",null,"Placeholder for estimation of not yet identified tasks within the area (to be removed when no further tasks expected).",null,null,null,null,null,"TBD",{"$f":"getProgress(AB29,AL29,\"%\",1,1)","v":""},{"$f":"getProgress(AC29,AM29,\"%\",1,1)","v":""},{"$f":"getProgress(AD29,AN29,\"%\",1,1)","v":""},{"$f":"getProgress(AE29,AO29,\"%\",1,1)","v":""},null,null,null,null,null,null,null,null,null,null,null,null,{"$f":"IF(SUMPRODUCT(--($Q$10:$Y$10>0),--(Q29:Y29<>\"\"))>0,SUMPRODUCT(--($Q$10:$Y$10>0),Q29:Y29)/SUMPRODUCT(--($Q$10:$Y$10>0),--(Q29:Y29<>\"\")),\"\")","v":""},{"$f":"IF(WpAreaA_exist,IF(SUMPRODUCT(--($Q$9:$S$9<>0),--(Q29:S29<>\"\"))>0,SUMPRODUCT(--($Q$9:$S$9>0),Q29:S29)/SUMPRODUCT(--($Q$9:$S$9<>0),--(Q29:S29<>\"\")),\"\"),\"\")","v":""},{"$f":"IF(WpAreaB_exist,IF(SUMPRODUCT(--($T$9:$V$9<>0),--(T29:V29<>\"\"))>0,SUMPRODUCT(--($T$9:$V$9>0),T29:V29)/SUMPRODUCT(--($T$9:$V$9<>0),--(T29:V29<>\"\")),\"\"),\"\")","v":""},{"$f":"IF(WpAreaC_exist,IF(SUMPRODUCT(--($W$9:$Y$9<>0),--(W29:Y29<>\"\"))>0,SUMPRODUCT(--($W$9:$Y$9>0),W29:Y29)/SUMPRODUCT(--($W$9:$Y$9<>0),--(W29:Y29<>\"\")),\"\"),\"\")","v":""},null,null,null,null,null,null,"","","",""]
[null,null,"36.521-2",4,"Recommended test case applicability","Clause header",null,null,null,null,0,null,null,{"$f":"getProgress(AD30,AN30,\"%\",1,1)","v":""},{"$f":"getProgress(AE30,AO30,\"%\",1,1)","v":""},null,null,null,null,null,null,null,null,null,null,null,null,{"$f":"IF(SUMPRODUCT(--($Q$10:$Y$10>0),--(Q30:Y30<>\"\"))>0,SUMPRODUCT(--($Q$10:$Y$10>0),Q30:Y30)/SUMPRODUCT(--($Q$10:$Y$10>0),--(Q30:Y30<>\"\")),\"\")","v":""},{"$f":"IF(WpAreaA_exist,IF(SUMPRODUCT(--($Q$9:$S$9<>0),--(Q30:S30<>\"\"))>0,SUMPRODUCT(--($Q$9:$S$9>0),Q30:S30)/SUMPRODUCT(--($Q$9:$S$9<>0),--(Q30:S30<>\"\")),\"\"),\"\")","v":""},{"$f":"IF(WpAreaB_exist,IF(SUMPRODUCT(--($T$9:$V$9<>0),--(T30:V30<>\"\"))>0,SUMPRODUCT(--($T$9:$V$9>0),T30:V30)/SUMPRODUCT(--($T$9:$V$9<>0),--(T30:V30<>\"\")),\"\"),\"\")","v":""},{"$f":"IF(WpAreaC_exist,IF(SUMPRODUCT(--($W$9:$Y$9<>0),--(W30:Y30<>\"\"))>0,SUMPRODUCT(--($W$9:$Y$9>0),W30:Y30)/SUMPRODUCT(--($W$9:$Y$9<>0),--(W30:Y30<>\"\")),\"\"),\"\")","v":""},null,null,null,null,null,null,"","","",""]
[5,null,"36.521-2","4.3.3","RRM conformance test cases for NB-IoT/eMTC NTN","Add test applicability for RRM test cases","CMCC","RAN5#109 (Nov-25)",null,"zhaoluyang@chinamobile.com",0.5,{"$f":"getProgress(AB31,AL31,\"%\",1,1)","v":"0%"},{"$f":"getProgress(AC31,AM31,\"%\",1,1)","v":"0%"},{"$f":"getProgress(AD31,AN31,\"%\",1,1)","v":""},{"$f":"getProgress(AE31,AO31,\"%\",1,1)","v":""},null,0,null,null,null,null,null,null,null,null,null,null,{"$f":"IF(SUMPRODUCT(--($Q$10:$Y$10>0),--(Q31:Y31<>\"\"))>0,SUMPRODUCT(--($Q$10:$Y$10>0),Q31:Y31)/SUMPRODUCT(--($Q$10:$Y$10>0),--(Q31:Y31<>\"\")),\"\")","v":0},{"$f":"IF(WpAreaA_exist,IF(SUMPRODUCT(--($Q$9:$S$9<>0),--(Q31:S31<>\"\"))>0,SUMPRODUCT(--($Q$9:$S$9>0),Q31:S31)/SUMPRODUCT(--($Q$9:$S$9<>0),--(Q31:S31<>\"\")),\"\"),\"\")","v":0},{"$f":"IF(WpAreaB_exist,IF(SUMPRODUCT(--($T$9:$V$9<>0),--(T31:V31<>\"\"))>0,SUMPRODUCT(--($T$9:$V$9>0),T31:V31)/SUMPRODUCT(--($T$9:$V$9<>0),--(T31:V31<>\"\")),\"\"),\"\")","v":""},{"$f":"IF(WpAreaC_exist,IF(SUMPRODUCT(--($W$9:$Y$9<>0),--(W31:Y31<>\"\"))>0,SUMPRODUCT(--($W$9:$Y$9>0),W31:Y31)/SUMPRODUCT(--($W$9:$Y$9<>0),--(W31:Y31<>\"\")),\"\"),\"\")","v":""},null,null,null,null,null,null,"","","",""]
["TS 36.521-3: RRM test cases"]
[null,null,"36.521-3",null,"Placeholder for estimation of not yet identified tasks within the area (to be removed when no further tasks expected).",null,null,null,null,null,"TBD",{"$f":"getProgress(AB33,AL33,\"%\",1,1)","v":""},{"$f":"getProgress(AC33,AM33,\"%\",1,1)","v":""},{"$f":"getProgress(AD33,AN33,\"%\",1,1)","v":""},{"$f":"getProgress(AE33,AO33,\"%\",1,1)","v":""},null,null,null,null,null,null,null,null,null,null,null,null,{"$f":"IF(SUMPRODUCT(--($Q$10:$Y$10>0),--(Q33:Y33<>\"\"))>0,SUMPRODUCT(--($Q$10:$Y$10>0),Q33:Y33)/SUMPRODUCT(--($Q$10:$Y$10>0),--(Q33:Y33<>\"\")),\"\")","v":""},{"$f":"IF(WpAreaA_exist,IF(SUMPRODUCT(--($Q$9:$S$9<>0),--(Q33:S33<>\"\"))>0,SUMPRODUCT(--($Q$9:$S$9>0),Q33:S33)/SUMPRODUCT(--($Q$9:$S$9<>0),--(Q33:S33<>\"\")),\"\"),\"\")","v":""},{"$f":"IF(WpAreaB_exist,IF(SUMPRODUCT(--($T$9:$V$9<>0),--(T33:V33<>\"\"))>0,SUMPRODUCT(--($T$9:$V$9>0),T33:V33)/SUMPRODUCT(--($T$9:$V$9<>0),--(T33:V33<>\"\")),\"\"),\"\")","v":""},{"$f":"IF(WpAreaC_exist,IF(SUMPRODUCT(--($W$9:$Y$9<>0),--(W33:Y33<>\"\"))>0,SUMPRODUCT(--($W$9:$Y$9>0),W33:Y33)/SUMPRODUCT(--($W$9:$Y$9<>0),--(W33:Y33<>\"\")),\"\"),\"\")","v":""},null,null,null,null,null,null,"","","",""]
[null,null,"36.521-3",13,"E-UTRAN Standalone Tests for UE Category NB for Satellite Access","Clause header",null,null,null,null,0,null,null,null,{"$f":"getProgress(AE34,AO34,\"%\",1,1)","v":""},null,null,null,null,null,null,null,null,null,null,null,null,{"$f":"IF(SUMPRODUCT(--($Q$10:$Y$10>0),--(Q34:Y34<>\"\"))>0,SUMPRODUCT(--($Q$10:$Y$10>0),Q34:Y34)/SUMPRODUCT(--($Q$10:$Y$10>0),--(Q34:Y34<>\"\")),\"\")","v":""},{"$f":"IF(WpAreaA_exist,IF(SUMPRODUCT(--($Q$9:$S$9<>0),--(Q34:S34<>\"\"))>0,SUMPRODUCT(--($Q$9:$S$9>0),Q34:S34)/SUMPRODUCT(--($Q$9:$S$9<>0),--(Q34:S34<>\"\")),\"\"),\"\")","v":""},{"$f":"IF(WpAreaB_exist,IF(SUMPRODUCT(--($T$9:$V$9<>0),--(T34:V34<>\"\"))>0,SUMPRODUCT(--($T$9:$V$9>0),T34:V34)/SUMPRODUCT(--($T$9:$V$9<>0),--(T34:V34<>\"\")),\"\"),\"\")","v":""},{"$f":"IF(WpAreaC_exist,IF(SUMPRODUCT(--($W$9:$Y$9<>0),--(W34:Y34<>\"\"))>0,SUMPRODUCT(--($W$9:$Y$9>0),W34:Y34)/SUMPRODUCT(--($W$9:$Y$9<>0),--(W34:Y34<>\"\")),\"\"),\"\")","v":""},null,null,null,null,null,null,"","","",""]
[null,null,"36.521-3","13,1","RRC_IDLE state for satellite access","Sub-clause header",null,null,null,null,0,null,null,{"$f":"getProgress(AD35,AN35,\"%\",1,1)","v":""},{"$f":"getProgress(AE35,AO35,\"%\",1,1)","v":""}]
[null,null,"36.521-3","13.1.1","Cell re-selection for satellite access","Sub-clause header",null,null,null,null,0,null,null,{"$f":"getProgress(AD36,AN36,\"%\",1,1)","v":""},{"$f":"getProgress(AE36,AO36,\"%\",1,1)","v":""}]
[6,null,"36.521-3","13.1.1.1","HD – FDD Intra frequency case for UE Category NB1 Standalone mode in normal coverage","Introduce NGSO configuration for the existing intra-frequency test cases","MediaTek","RAN5#105 (Nov-24)",null,"allen.zhang@mediatek.com",0.5,{"$f":"getProgress(AB37,AL37,\"%\",1,1)","v":"0%"},{"$f":"getProgress(AC37,AM37,\"%\",1,1)","v":"0%"},{"$f":"getProgress(AD37,AN37,\"%\",1,1)","v":""},{"$f":"getProgress(AE37,AO37,\"%\",1,1)","v":""},null,0,null,null,null,null,null,null,null,null,null,null,{"$f":"IF(SUMPRODUCT(--($Q$10:$Y$10>0),--(Q37:Y37<>\"\"))>0,SUMPRODUCT(--($Q$10:$Y$10>0),Q37:Y37)/SUMPRODUCT(--($Q$10:$Y$10>0),--(Q37:Y37<>\"\")),\"\")","v":0},{"$f":"IF(WpAreaA_exist,IF(SUMPRODUCT(--($Q$9:$S$9<>0),--(Q37:S37<>\"\"))>0,SUMPRODUCT(--($Q$9:$S$9>0),Q37:S37)/SUMPRODUCT(--($Q$9:$S$9<>0),--(Q37:S37<>\"\")),\"\"),\"\")","v":0},{"$f":"IF(WpAreaB_exist,IF(SUMPRODUCT(--($T$9:$V$9<>0),--(T37:V37<>\"\"))>0,SUMPRODUCT(--($T$9:$V$9>0),T37:V37)/SUMPRODUCT(--($T$9:$V$9<>0),--(T37:V37<>\"\")),\"\"),\"\")","v":""},{"$f":"IF(WpAreaC_exist,IF(SUMPRODUCT(--($W$9:$Y$9<>0),--(W37:Y37<>\"\"))>0,SUMPRODUCT(--($W$9:$Y$9>0),W37:Y37)/SUMPRODUCT(--($W$9:$Y$9<>0),--(W37:Y37<>\"\")),\"\"),\"\")","v":""},null,null,null,null,null,null,"","","",""]
[7,null,"36.521-3","13.1.1.2","HD – FDD Intra frequency case for UE Category NB1 Standalone mode in normal coverage with serving cell RRM measurement relaxation","Introduce NGSO configuration for the existing intra-frequency test cases","MediaTek","RAN5#105 (Nov-24)",null,"allen.zhang@mediatek.com",0.5,{"$f":"getProgress(AB38,AL38,\"%\",1,1)","v":"0%"},{"$f":"getProgress(AC38,AM38,\"%\",1,1)","v":"0%"},{"$f":"getProgress(AD38,AN38,\"%\",1,1)","v":""},{"$f":"getProgress(AE38,AO38,\"%\",1,1)","v":""},null,0,null,null,null,null,null,null,null,null,null,null,{"$f":"IF(SUMPRODUCT(--($Q$10:$Y$10>0),--(Q38:Y38<>\"\"))>0,SUMPRODUCT(--($Q$10:$Y$10>0),Q38:Y38)/SUMPRODUCT(--($Q$10:$Y$10>0),--(Q38:Y38<>\"\")),\"\")","v":0},{"$f":"IF(WpAreaA_exist,IF(SUMPRODUCT(--($Q$9:$S$9<>0),--(Q38:S38<>\"\"))>0,SUMPRODUCT(--($Q$9:$S$9>0),Q38:S38)/SUMPRODUCT(--($Q$9:$S$9<>0),--(Q38:S38<>\"\")),\"\"),\"\")","v":0},{"$f":"IF(WpAreaB_exist,IF(SUMPRODUCT(--($T$9:$V$9<>0),--(T38:V38<>\"\"))>0,SUMPRODUCT(--($T$9:$V$9>0),T38:V38)/SUMPRODUCT(--($T$9:$V$9<>0),--(T38:V38<>\"\")),\"\"),\"\")","v":""},{"$f":"IF(WpAreaC_exist,IF(SUMPRODUCT(--($W$9:$Y$9<>0),--(W38:Y38<>\"\"))>0,SUMPRODUCT(--($W$9:$Y$9>0),W38:Y38)/SUMPRODUCT(--($W$9:$Y$9<>0),--(W38:Y38<>\"\")),\"\"),\"\")","v":""},null,null,null,null,null,null,"","","",""]
[8,null,"36.521-3","13.1.1.3","HD – FDD Intra frequency case for UE Category NB1 Standalone mode in normal coverage with UE specific DRX","Introduce NGSO configuration for the existing intra-frequency test cases","MediaTek","RAN5#105 (Nov-24)",null,"allen.zhang@mediatek.com",0.5,{"$f":"getProgress(AB39,AL39,\"%\",1,1)","v":"0%"},{"$f":"getProgress(AC39,AM39,\"%\",1,1)","v":"0%"},{"$f":"getProgress(AD39,AN39,\"%\",1,1)","v":""},{"$f":"getProgress(AE39,AO39,\"%\",1,1)","v":""},null,0,null,null,null,null,null,null,null,null,null,null,{"$f":"IF(SUMPRODUCT(--($Q$10:$Y$10>0),--(Q39:Y39<>\"\"))>0,SUMPRODUCT(--($Q$10:$Y$10>0),Q39:Y39)/SUMPRODUCT(--($Q$10:$Y$10>0),--(Q39:Y39<>\"\")),\"\")","v":0},{"$f":"IF(WpAreaA_exist,IF(SUMPRODUCT(--($Q$9:$S$9<>0),--(Q39:S39<>\"\"))>0,SUMPRODUCT(--($Q$9:$S$9>0),Q39:S39)/SUMPRODUCT(--($Q$9:$S$9<>0),--(Q39:S39<>\"\")),\"\"),\"\")","v":0},{"$f":"IF(WpAreaB_exist,IF(SUMPRODUCT(--($T$9:$V$9<>0),--(T39:V39<>\"\"))>0,SUMPRODUCT(--($T$9:$V$9>0),T39:V39)/SUMPRODUCT(--($T$9:$V$9<>0),--(T39:V39<>\"\")),\"\"),\"\")","v":""},{"$f":"IF(WpAreaC_exist,IF(SUMPRODUCT(--($W$9:$Y$9<>0),--(W39:Y39<>\"\"))>0,SUMPRODUCT(--($W$9:$Y$9>0),W39:Y39)/SUMPRODUCT(--($W$9:$Y$9<>0),--(W39:Y39<>\"\")),\"\"),\"\")","v":""},null,null,null,null,null,null,"","","",""]
[9,"Y","36.521-3","13.1.1.4","HD – FDD Inter frequency case for UE Category NB1 Standalone mode in normal coverage","Test in A.13.1.1.4 in TS 36.133 (R4-2406522)","MediaTek","RAN5#106 (Feb-25)",null,"allen.zhang@mediatek.com",1,{"$f":"getProgress(AB40,AL40,\"%\",1,1)","v":"0%"},{"$f":"getProgress(AC40,AM40,\"%\",1,1)","v":"0%"},{"$f":"getProgress(AD40,AN40,\"%\",1,1)","v":""},{"$f":"getProgress(AE40,AO40,\"%\",1,1)","v":""},null,0,null,null,null,null,null,null,null,null,null,null,{"$f":"IF(SUMPRODUCT(--($Q$10:$Y$10>0),--(Q40:Y40<>\"\"))>0,SUMPRODUCT(--($Q$10:$Y$10>0),Q40:Y40)/SUMPRODUCT(--($Q$10:$Y$10>0),--(Q40:Y40<>\"\")),\"\")","v":0},{"$f":"IF(WpAreaA_exist,IF(SUMPRODUCT(--($Q$9:$S$9<>0),--(Q40:S40<>\"\"))>0,SUMPRODUCT(--($Q$9:$S$9>0),Q40:S40)/SUMPRODUCT(--($Q$9:$S$9<>0),--(Q40:S40<>\"\")),\"\"),\"\")","v":0},{"$f":"IF(WpAreaB_exist,IF(SUMPRODUCT(--($T$9:$V$9<>0),--(T40:V40<>\"\"))>0,SUMPRODUCT(--($T$9:$V$9>0),T40:V40)/SUMPRODUCT(--($T$9:$V$9<>0),--(T40:V40<>\"\")),\"\"),\"\")","v":""},{"$f":"IF(WpAreaC_exist,IF(SUMPRODUCT(--($W$9:$Y$9<>0),--(W40:Y40<>\"\"))>0,SUMPRODUCT(--($W$9:$Y$9>0),W40:Y40)/SUMPRODUCT(--($W$9:$Y$9<>0),--(W40:Y40<>\"\")),\"\"),\"\")","v":""},null,null,null,null,null,null,"","","",""]
[10,"Y","36.521-3","13.1.1.5","HD – FDD Intra frequency case for UE Category NB1 Standalone mode in enhanced coverage, location-based cell reselection for NGSO","Test in A.13.1.1.5 in TS 36.133 (R4-2406522)","MediaTek","RAN5#106 (Feb-25)",null,"allen.zhang@mediatek.com",1,{"$f":"getProgress(AB41,AL41,\"%\",1,1)","v":"0%"},{"$f":"getProgress(AC41,AM41,\"%\",1,1)","v":"0%"},{"$f":"getProgress(AD41,AN41,\"%\",1,1)","v":""},{"$f":"getProgress(AE41,AO41,\"%\",1,1)","v":""},null,0,null,null,null,null,null,null,null,null,null,null,{"$f":"IF(SUMPRODUCT(--($Q$10:$Y$10>0),--(Q41:Y41<>\"\"))>0,SUMPRODUCT(--($Q$10:$Y$10>0),Q41:Y41)/SUMPRODUCT(--($Q$10:$Y$10>0),--(Q41:Y41<>\"\")),\"\")","v":0},{"$f":"IF(WpAreaA_exist,IF(SUMPRODUCT(--($Q$9:$S$9<>0),--(Q41:S41<>\"\"))>0,SUMPRODUCT(--($Q$9:$S$9>0),Q41:S41)/SUMPRODUCT(--($Q$9:$S$9<>0),--(Q41:S41<>\"\")),\"\"),\"\")","v":0},{"$f":"IF(WpAreaB_exist,IF(SUMPRODUCT(--($T$9:$V$9<>0),--(T41:V41<>\"\"))>0,SUMPRODUCT(--($T$9:$V$9>0),T41:V41)/SUMPRODUCT(--($T$9:$V$9<>0),--(T41:V41<>\"\")),\"\"),\"\")","v":""},{"$f":"IF(WpAreaC_exist,IF(SUMPRODUCT(--($W$9:$Y$9<>0),--(W41:Y41<>\"\"))>0,SUMPRODUCT(--($W$9:$Y$9>0),W41:Y41)/SUMPRODUCT(--($W$9:$Y$9<>0),--(W41:Y41<>\"\")),\"\"),\"\")","v":""},null,null,null,null,null,null,"","","",""]
[11,"Y","36.521-3","13.1.1.6","HD – FDD Inter frequency case for UE Category NB1 Standalone mode in enhanced coverage, time-based cell reselection for NGSO","Test in A.13.1.1.6 in TS 36.133 (R4-2406522)","MediaTek","RAN5#106 (Feb-25)",null,"allen.zhang@mediatek.com",1,{"$f":"getProgress(AB42,AL42,\"%\",1,1)","v":"0%"},{"$f":"getProgress(AC42,AM42,\"%\",1,1)","v":"0%"},{"$f":"getProgress(AD42,AN42,\"%\",1,1)","v":""},{"$f":"getProgress(AE42,AO42,\"%\",1,1)","v":""},null,0,null,null,null,null,null,null,null,null,null,null,{"$f":"IF(SUMPRODUCT(--($Q$10:$Y$10>0),--(Q42:Y42<>\"\"))>0,SUMPRODUCT(--($Q$10:$Y$10>0),Q42:Y42)/SUMPRODUCT(--($Q$10:$Y$10>0),--(Q42:Y42<>\"\")),\"\")","v":0},{"$f":"IF(WpAreaA_exist,IF(SUMPRODUCT(--($Q$9:$S$9<>0),--(Q42:S42<>\"\"))>0,SUMPRODUCT(--($Q$9:$S$9>0),Q42:S42)/SUMPRODUCT(--($Q$9:$S$9<>0),--(Q42:S42<>\"\")),\"\"),\"\")","v":0},{"$f":"IF(WpAreaB_exist,IF(SUMPRODUCT(--($T$9:$V$9<>0),--(T42:V42<>\"\"))>0,SUMPRODUCT(--($T$9:$V$9>0),T42:V42)/SUMPRODUCT(--($T$9:$V$9<>0),--(T42:V42<>\"\")),\"\"),\"\")","v":""},{"$f":"IF(WpAreaC_exist,IF(SUMPRODUCT(--($W$9:$Y$9<>0),--(W42:Y42<>\"\"))>0,SUMPRODUCT(--($W$9:$Y$9>0),W42:Y42)/SUMPRODUCT(--($W$9:$Y$9<>0),--(W42:Y42<>\"\")),\"\"),\"\")","v":""},null,null,null,null,null,null,"","","",""]
[null,null,"36.521-3",13.3,"RRC connection mobility control for satellite access","Sub-clause header",null,null,null,null,0,null,null,{"$f":"getProgress(AD43,AN43,\"%\",1,1)","v":""},{"$f":"getProgress(AE43,AO43,\"%\",1,1)","v":""}]
[null,null,"36.521-3","13.3.1","RRC re-establishment for satellite access","Sub-clause header",null,null,null,null,0,null,null,{"$f":"getProgress(AD44,AN44,\"%\",1,1)","v":""},{"$f":"getProgress(AE44,AO44,\"%\",1,1)","v":""}]
[12,null,"36.521-3","13.3.1.1","HD-FDD Intra-frequency RRC Re-establishment for UE category NB1 in Standalone mode under normal coverage","Introduce NGSO configuration for the existing intra-frequency test cases","MediaTek","RAN5#105 (Nov-24)",null,"sapling.lin@mediatek.com",0.5,{"$f":"getProgress(AB45,AL45,\"%\",1,1)","v":"0%"},{"$f":"getProgress(AC45,AM45,\"%\",1,1)","v":"0%"},{"$f":"getProgress(AD45,AN45,\"%\",1,1)","v":""},{"$f":"getProgress(AE45,AO45,\"%\",1,1)","v":""},null,0,null,null,null,null,null,null,null,null,null,null,{"$f":"IF(SUMPRODUCT(--($Q$10:$Y$10>0),--(Q45:Y45<>\"\"))>0,SUMPRODUCT(--($Q$10:$Y$10>0),Q45:Y45)/SUMPRODUCT(--($Q$10:$Y$10>0),--(Q45:Y45<>\"\")),\"\")","v":0},{"$f":"IF(WpAreaA_exist,IF(SUMPRODUCT(--($Q$9:$S$9<>0),--(Q45:S45<>\"\"))>0,SUMPRODUCT(--($Q$9:$S$9>0),Q45:S45)/SUMPRODUCT(--($Q$9:$S$9<>0),--(Q45:S45<>\"\")),\"\"),\"\")","v":0},{"$f":"IF(WpAreaB_exist,IF(SUMPRODUCT(--($T$9:$V$9<>0),--(T45:V45<>\"\"))>0,SUMPRODUCT(--($T$9:$V$9>0),T45:V45)/SUMPRODUCT(--($T$9:$V$9<>0),--(T45:V45<>\"\")),\"\"),\"\")","v":""},{"$f":"IF(WpAreaC_exist,IF(SUMPRODUCT(--($W$9:$Y$9<>0),--(W45:Y45<>\"\"))>0,SUMPRODUCT(--($W$9:$Y$9>0),W45:Y45)/SUMPRODUCT(--($W$9:$Y$9<>0),--(W45:Y45<>\"\")),\"\"),\"\")","v":""},null,null,null,null,null,null,"","","",""]
[13,null,"36.521-3","13.3.1.2","HD-FDD Intra-frequency RRC Re-establishment for UE category NB1 in Standalone mode under enhanced coverage","Introduce NGSO configuration for the existing intra-frequency test cases","MediaTek","RAN5#105 (Nov-24)",null,"sapling.lin@mediatek.com",0.5,{"$f":"getProgress(AB46,AL46,\"%\",1,1)","v":"0%"},{"$f":"getProgress(AC46,AM46,\"%\",1,1)","v":"0%"},{"$f":"getProgress(AD46,AN46,\"%\",1,1)","v":""},{"$f":"getProgress(AE46,AO46,\"%\",1,1)","v":""},null,0,null,null,null,null,null,null,null,null,null,null,{"$f":"IF(SUMPRODUCT(--($Q$10:$Y$10>0),--(Q46:Y46<>\"\"))>0,SUMPRODUCT(--($Q$10:$Y$10>0),Q46:Y46)/SUMPRODUCT(--($Q$10:$Y$10>0),--(Q46:Y46<>\"\")),\"\")","v":0},{"$f":"IF(WpAreaA_exist,IF(SUMPRODUCT(--($Q$9:$S$9<>0),--(Q46:S46<>\"\"))>0,SUMPRODUCT(--($Q$9:$S$9>0),Q46:S46)/SUMPRODUCT(--($Q$9:$S$9<>0),--(Q46:S46<>\"\")),\"\"),\"\")","v":0},{"$f":"IF(WpAreaB_exist,IF(SUMPRODUCT(--($T$9:$V$9<>0),--(T46:V46<>\"\"))>0,SUMPRODUCT(--($T$9:$V$9>0),T46:V46)/SUMPRODUCT(--($T$9:$V$9<>0),--(T46:V46<>\"\")),\"\"),\"\")","v":""},{"$f":"IF(WpAreaC_exist,IF(SUMPRODUCT(--($W$9:$Y$9<>0),--(W46:Y46<>\"\"))>0,SUMPRODUCT(--($W$9:$Y$9>0),W46:Y46)/SUMPRODUCT(--($W$9:$Y$9<>0),--(W46:Y46<>\"\")),\"\"),\"\")","v":""},null,null,null,null,null,null,"","","",""]
[14,"Y","36.521-3","13.3.1.3","HD-FDD Inter-frequency RRC Re-establishment for UE category NB1 in Standalone mode under enhanced coverage","Test in A.13.3.1.3 in TS 36.133 (R4-2406522)","MediaTek","RAN5#106 (Feb-25)",null,"sapling.lin@mediatek.com",1,{"$f":"getProgress(AB47,AL47,\"%\",1,1)","v":"0%"},{"$f":"getProgress(AC47,AM47,\"%\",1,1)","v":"0%"},{"$f":"getProgress(AD47,AN47,\"%\",1,1)","v":""},{"$f":"getProgress(AE47,AO47,\"%\",1,1)","v":""},null,0,null,null,null,null,null,null,null,null,null,null,{"$f":"IF(SUMPRODUCT(--($Q$10:$Y$10>0),--(Q47:Y47<>\"\"))>0,SUMPRODUCT(--($Q$10:$Y$10>0),Q47:Y47)/SUMPRODUCT(--($Q$10:$Y$10>0),--(Q47:Y47<>\"\")),\"\")","v":0},{"$f":"IF(WpAreaA_exist,IF(SUMPRODUCT(--($Q$9:$S$9<>0),--(Q47:S47<>\"\"))>0,SUMPRODUCT(--($Q$9:$S$9>0),Q47:S47)/SUMPRODUCT(--($Q$9:$S$9<>0),--(Q47:S47<>\"\")),\"\"),\"\")","v":0},{"$f":"IF(WpAreaB_exist,IF(SUMPRODUCT(--($T$9:$V$9<>0),--(T47:V47<>\"\"))>0,SUMPRODUCT(--($T$9:$V$9>0),T47:V47)/SUMPRODUCT(--($T$9:$V$9<>0),--(T47:V47<>\"\")),\"\"),\"\")","v":""},{"$f":"IF(WpAreaC_exist,IF(SUMPRODUCT(--($W$9:$Y$9<>0),--(W47:Y47<>\"\"))>0,SUMPRODUCT(--($W$9:$Y$9>0),W47:Y47)/SUMPRODUCT(--($W$9:$Y$9<>0),--(W47:Y47<>\"\")),\"\"),\"\")","v":""},null,null,null,null,null,null,"","","",""]
[null,null,"36.521-3",13.4,"Timing and signalling characteristics for satellite access","New Sub-clause header",null,null,null,null,0,null,null,{"$f":"getProgress(AD48,AN48,\"%\",1,1)","v":""},{"$f":"getProgress(AE48,AO48,\"%\",1,1)","v":""}]
[null,null,"36.521-3","13.4.1 ","UE transmit timing for satellite access","New Sub-clause header",null,null,null,null,0,null,null,{"$f":"getProgress(AD49,AN49,\"%\",1,1)","v":""},{"$f":"getProgress(AE49,AO49,\"%\",1,1)","v":""}]
[15,null,"36.521-3","13.4.1.3","E-UTRAN HD-FDD – UE Transmit Timing Accuracy Tests for Category NB1 UE Standalone mode under enhanced coverage with segment transmission in NGSO for Satellite Access","Introduce NGSO configuration for the existing intra-frequency test cases","MediaTek","RAN5#105 (Nov-24)",null,"allen.zhang@mediatek.com",0.5,{"$f":"getProgress(AB50,AL50,\"%\",1,1)","v":"0%"},{"$f":"getProgress(AC50,AM50,\"%\",1,1)","v":"0%"},{"$f":"getProgress(AD50,AN50,\"%\",1,1)","v":""},{"$f":"getProgress(AE50,AO50,\"%\",1,1)","v":""},null,0,null,null,null,null,null,null,null,null,null,null,{"$f":"IF(SUMPRODUCT(--($Q$10:$Y$10>0),--(Q50:Y50<>\"\"))>0,SUMPRODUCT(--($Q$10:$Y$10>0),Q50:Y50)/SUMPRODUCT(--($Q$10:$Y$10>0),--(Q50:Y50<>\"\")),\"\")","v":0},{"$f":"IF(WpAreaA_exist,IF(SUMPRODUCT(--($Q$9:$S$9<>0),--(Q50:S50<>\"\"))>0,SUMPRODUCT(--($Q$9:$S$9>0),Q50:S50)/SUMPRODUCT(--($Q$9:$S$9<>0),--(Q50:S50<>\"\")),\"\"),\"\")","v":0},{"$f":"IF(WpAreaB_exist,IF(SUMPRODUCT(--($T$9:$V$9<>0),--(T50:V50<>\"\"))>0,SUMPRODUCT(--($T$9:$V$9>0),T50:V50)/SUMPRODUCT(--($T$9:$V$9<>0),--(T50:V50<>\"\")),\"\"),\"\")","v":""},{"$f":"IF(WpAreaC_exist,IF(SUMPRODUCT(--($W$9:$Y$9<>0),--(W50:Y50<>\"\"))>0,SUMPRODUCT(--($W$9:$Y$9>0),W50:Y50)/SUMPRODUCT(--($W$9:$Y$9<>0),--(W50:Y50<>\"\")),\"\"),\"\")","v":""},null,null,null,null,null,null,"","","",""]
[null,null,"36.521-3",13.5,"UE measurement procedures in RRC_CONNECTED state for UE category NB1 for satellite access","New Sub-clause header",null,null,null,null,0,null,null,{"$f":"getProgress(AD51,AN51,\"%\",1,1)","v":""},{"$f":"getProgress(AE51,AO51,\"%\",1,1)","v":""}]
[16,"Y","36.521-3","13.5.1","HD-FDD Intra-frequency neighbour cell measurement for UE category NB1 in standalone mode under normal coverage for Satellite Access","Test in A.13.5.1 in TS 36.133 (R4-2406522)","CMCC","RAN5#109 (Nov-25)",null,"zhaoluyang@chinamobile.com",1,{"$f":"getProgress(AB52,AL52,\"%\",1,1)","v":"0%"},{"$f":"getProgress(AC52,AM52,\"%\",1,1)","v":"0%"},{"$f":"getProgress(AD52,AN52,\"%\",1,1)","v":""},{"$f":"getProgress(AE52,AO52,\"%\",1,1)","v":""},null,0,null,null,null,null,null,null,null,null,null,null,{"$f":"IF(SUMPRODUCT(--($Q$10:$Y$10>0),--(Q52:Y52<>\"\"))>0,SUMPRODUCT(--($Q$10:$Y$10>0),Q52:Y52)/SUMPRODUCT(--($Q$10:$Y$10>0),--(Q52:Y52<>\"\")),\"\")","v":0},{"$f":"IF(WpAreaA_exist,IF(SUMPRODUCT(--($Q$9:$S$9<>0),--(Q52:S52<>\"\"))>0,SUMPRODUCT(--($Q$9:$S$9>0),Q52:S52)/SUMPRODUCT(--($Q$9:$S$9<>0),--(Q52:S52<>\"\")),\"\"),\"\")","v":0},{"$f":"IF(WpAreaB_exist,IF(SUMPRODUCT(--($T$9:$V$9<>0),--(T52:V52<>\"\"))>0,SUMPRODUCT(--($T$9:$V$9>0),T52:V52)/SUMPRODUCT(--($T$9:$V$9<>0),--(T52:V52<>\"\")),\"\"),\"\")","v":""},{"$f":"IF(WpAreaC_exist,IF(SUMPRODUCT(--($W$9:$Y$9<>0),--(W52:Y52<>\"\"))>0,SUMPRODUCT(--($W$9:$Y$9>0),W52:Y52)/SUMPRODUCT(--($W$9:$Y$9<>0),--(W52:Y52<>\"\")),\"\"),\"\")","v":""},null,null,null,null,null,null,"","","",""]
[17,"Y","36.521-3","13.5.2","HD-FDD Inter-frequency neighbour cell measurement for UE category NB1 in standalone mode under normal coverage for Satellite Access","Test in A.13.5.2 in TS 36.133 (R4-2406522)","CMCC","RAN5#109 (Nov-25)",null,"zhaoluyang@chinamobile.com",1,{"$f":"getProgress(AB53,AL53,\"%\",1,1)","v":"0%"},{"$f":"getProgress(AC53,AM53,\"%\",1,1)","v":"0%"},{"$f":"getProgress(AD53,AN53,\"%\",1,1)","v":""},{"$f":"getProgress(AE53,AO53,\"%\",1,1)","v":""},null,0,null,null,null,null,null,null,null,null,null,null,{"$f":"IF(SUMPRODUCT(--($Q$10:$Y$10>0),--(Q53:Y53<>\"\"))>0,SUMPRODUCT(--($Q$10:$Y$10>0),Q53:Y53)/SUMPRODUCT(--($Q$10:$Y$10>0),--(Q53:Y53<>\"\")),\"\")","v":0},{"$f":"IF(WpAreaA_exist,IF(SUMPRODUCT(--($Q$9:$S$9<>0),--(Q53:S53<>\"\"))>0,SUMPRODUCT(--($Q$9:$S$9>0),Q53:S53)/SUMPRODUCT(--($Q$9:$S$9<>0),--(Q53:S53<>\"\")),\"\"),\"\")","v":0},{"$f":"IF(WpAreaB_exist,IF(SUMPRODUCT(--($T$9:$V$9<>0),--(T53:V53<>\"\"))>0,SUMPRODUCT(--($T$9:$V$9>0),T53:V53)/SUMPRODUCT(--($T$9:$V$9<>0),--(T53:V53<>\"\")),\"\"),\"\")","v":""},{"$f":"IF(WpAreaC_exist,IF(SUMPRODUCT(--($W$9:$Y$9<>0),--(W53:Y53<>\"\"))>0,SUMPRODUCT(--($W$9:$Y$9>0),W53:Y53)/SUMPRODUCT(--($W$9:$Y$9<>0),--(W53:Y53<>\"\")),\"\"),\"\")","v":""},null,null,null,null,null,null,"","","",""]
[18,"Y","36.521-3","13.5.3","HD-FDD Intra-frequency location-based neighbour cell measurement for UE category NB1 in standalone mode under normal coverage for Satellite Access","Test in A.13.5.3 in TS 36.133 (R4-2406522)","CMCC","RAN5#109 (Nov-25)",null,"zhaoluyang@chinamobile.com",1,{"$f":"getProgress(AB54,AL54,\"%\",1,1)","v":"0%"},{"$f":"getProgress(AC54,AM54,\"%\",1,1)","v":"0%"},{"$f":"getProgress(AD54,AN54,\"%\",1,1)","v":""},{"$f":"getProgress(AE54,AO54,\"%\",1,1)","v":""},null,0,null,null,null,null,null,null,null,null,null,null,{"$f":"IF(SUMPRODUCT(--($Q$10:$Y$10>0),--(Q54:Y54<>\"\"))>0,SUMPRODUCT(--($Q$10:$Y$10>0),Q54:Y54)/SUMPRODUCT(--($Q$10:$Y$10>0),--(Q54:Y54<>\"\")),\"\")","v":0},{"$f":"IF(WpAreaA_exist,IF(SUMPRODUCT(--($Q$9:$S$9<>0),--(Q54:S54<>\"\"))>0,SUMPRODUCT(--($Q$9:$S$9>0),Q54:S54)/SUMPRODUCT(--($Q$9:$S$9<>0),--(Q54:S54<>\"\")),\"\"),\"\")","v":0},{"$f":"IF(WpAreaB_exist,IF(SUMPRODUCT(--($T$9:$V$9<>0),--(T54:V54<>\"\"))>0,SUMPRODUCT(--($T$9:$V$9>0),T54:V54)/SUMPRODUCT(--($T$9:$V$9<>0),--(T54:V54<>\"\")),\"\"),\"\")","v":""},{"$f":"IF(WpAreaC_exist,IF(SUMPRODUCT(--($W$9:$Y$9<>0),--(W54:Y54<>\"\"))>0,SUMPRODUCT(--($W$9:$Y$9>0),W54:Y54)/SUMPRODUCT(--($W$9:$Y$9<>0),--(W54:Y54<>\"\")),\"\"),\"\")","v":""},null,null,null,null,null,null,"","","",""]
[19,null,"36.521-3","Annex E","Annex E (normative):\nCell configuration mapping","Add cell config information to \"Table E-9: Cell configuration mapping for IoT NTN RRM testing\"","CMCC","RAN5#109 (Nov-25)",null,"zhaoluyang@chinamobile.com",0.1,{"$f":"getProgress(AB55,AL55,\"%\",1,1)","v":"0%"},{"$f":"getProgress(AC55,AM55,\"%\",1,1)","v":"0%"},{"$f":"getProgress(AD55,AN55,\"%\",1,1)","v":""},{"$f":"getProgress(AE55,AO55,\"%\",1,1)","v":""},null,0,null,null,null,null,null,null,null,null,null,null,{"$f":"IF(SUMPRODUCT(--($Q$10:$Y$10>0),--(Q55:Y55<>\"\"))>0,SUMPRODUCT(--($Q$10:$Y$10>0),Q55:Y55)/SUMPRODUCT(--($Q$10:$Y$10>0),--(Q55:Y55<>\"\")),\"\")","v":0},{"$f":"IF(WpAreaA_exist,IF(SUMPRODUCT(--($Q$9:$S$9<>0),--(Q55:S55<>\"\"))>0,SUMPRODUCT(--($Q$9:$S$9>0),Q55:S55)/SUMPRODUCT(--($Q$9:$S$9<>0),--(Q55:S55<>\"\")),\"\"),\"\")","v":0},{"$f":"IF(WpAreaB_exist,IF(SUMPRODUCT(--($T$9:$V$9<>0),--(T55:V55<>\"\"))>0,SUMPRODUCT(--($T$9:$V$9>0),T55:V55)/SUMPRODUCT(--($T$9:$V$9<>0),--(T55:V55<>\"\")),\"\"),\"\")","v":""},{"$f":"IF(WpAreaC_exist,IF(SUMPRODUCT(--($W$9:$Y$9<>0),--(W55:Y55<>\"\"))>0,SUMPRODUCT(--($W$9:$Y$9>0),W55:Y55)/SUMPRODUCT(--($W$9:$Y$9<>0),--(W55:Y55<>\"\")),\"\"),\"\")","v":""},null,null,null,null,null,null,"","","",""]
[null,null,"36.521-3","Annex F","Annex F (normative):\nMeasurement uncertainties and Test Tolerances","clause header",null,null,null,null,0,null,null,{"$f":"getProgress(AD56,AN56,\"%\",1,1)","v":""},{"$f":"getProgress(AE56,AO56,\"%\",1,1)","v":""}]
[null,null,"36.521-3","F.1","Acceptable uncertainty of Test System (normative)","Sub-clause header",null,null,null,null,0,null,null,{"$f":"getProgress(AD57,AN57,\"%\",1,1)","v":""},{"$f":"getProgress(AE57,AO57,\"%\",1,1)","v":""}]
[20,null,"36.521-3","F.1.2","Measurement of RRM requirements","add MU analysis for new RRM test cases","MediaTek","RAN5#106 (Feb-25)",null,"allen.zhang@mediatek.com",0.5,{"$f":"getProgress(AB58,AL58,\"%\",1,1)","v":"0%"},{"$f":"getProgress(AC58,AM58,\"%\",1,1)","v":"0%"},{"$f":"getProgress(AD58,AN58,\"%\",1,1)","v":""},{"$f":"getProgress(AE58,AO58,\"%\",1,1)","v":""},null,0,null,null,null,null,null,null,null,null,null,null,{"$f":"IF(SUMPRODUCT(--($Q$10:$Y$10>0),--(Q58:Y58<>\"\"))>0,SUMPRODUCT(--($Q$10:$Y$10>0),Q58:Y58)/SUMPRODUCT(--($Q$10:$Y$10>0),--(Q58:Y58<>\"\")),\"\")","v":0},{"$f":"IF(WpAreaA_exist,IF(SUMPRODUCT(--($Q$9:$S$9<>0),--(Q58:S58<>\"\"))>0,SUMPRODUCT(--($Q$9:$S$9>0),Q58:S58)/SUMPRODUCT(--($Q$9:$S$9<>0),--(Q58:S58<>\"\")),\"\"),\"\")","v":0},{"$f":"IF(WpAreaB_exist,IF(SUMPRODUCT(--($T$9:$V$9<>0),--(T58:V58<>\"\"))>0,SUMPRODUCT(--($T$9:$V$9>0),T58:V58)/SUMPRODUCT(--($T$9:$V$9<>0),--(T58:V58<>\"\")),\"\"),\"\")","v":""},{"$f":"IF(WpAreaC_exist,IF(SUMPRODUCT(--($W$9:$Y$9<>0),--(W58:Y58<>\"\"))>0,SUMPRODUCT(--($W$9:$Y$9>0),W58:Y58)/SUMPRODUCT(--($W$9:$Y$9<>0),--(W58:Y58<>\"\")),\"\"),\"\")","v":""},null,null,null,null,null,null,"","","",""]
[null,null,"36.521-3","F.3","Test Tolerance and Derivation of Test Requirements (informative)","Sub-clause header",null,null,null,null,0,null,null,{"$f":"getProgress(AD59,AN59,\"%\",1,1)","v":""},{"$f":"getProgress(AE59,AO59,\"%\",1,1)","v":""}]
[21,null,"36.521-3","F.3.2","Measurement of RRM requirements","add TT analysis for new RRM test cases","MediaTek","RAN5#106 (Feb-25)",null,"allen.zhang@mediatek.com",0.5,{"$f":"getProgress(AB60,AL60,\"%\",1,1)","v":"0%"},{"$f":"getProgress(AC60,AM60,\"%\",1,1)","v":"0%"},{"$f":"getProgress(AD60,AN60,\"%\",1,1)","v":""},{"$f":"getProgress(AE60,AO60,\"%\",1,1)","v":""},null,0,null,null,null,null,null,null,null,null,null,null,{"$f":"IF(SUMPRODUCT(--($Q$10:$Y$10>0),--(Q60:Y60<>\"\"))>0,SUMPRODUCT(--($Q$10:$Y$10>0),Q60:Y60)/SUMPRODUCT(--($Q$10:$Y$10>0),--(Q60:Y60<>\"\")),\"\")","v":0},{"$f":"IF(WpAreaA_exist,IF(SUMPRODUCT(--($Q$9:$S$9<>0),--(Q60:S60<>\"\"))>0,SUMPRODUCT(--($Q$9:$S$9>0),Q60:S60)/SUMPRODUCT(--($Q$9:$S$9<>0),--(Q60:S60<>\"\")),\"\"),\"\")","v":0},{"$f":"IF(WpAreaB_exist,IF(SUMPRODUCT(--($T$9:$V$9<>0),--(T60:V60<>\"\"))>0,SUMPRODUCT(--($T$9:$V$9>0),T60:V60)/SUMPRODUCT(--($T$9:$V$9<>0),--(T60:V60<>\"\")),\"\"),\"\")","v":""},{"$f":"IF(WpAreaC_exist,IF(SUMPRODUCT(--($W$9:$Y$9<>0),--(W60:Y60<>\"\"))>0,SUMPRODUCT(--($W$9:$Y$9>0),W60:Y60)/SUMPRODUCT(--($W$9:$Y$9<>0),--(W60:Y60<>\"\")),\"\"),\"\")","v":""},null,null,null,null,null,null,"","","",""]
["TR 36.903: Test Tolerances analysis RRM test cases"]
[null,null,"36.903",null,"Placeholder for estimation of not yet identified tasks within the area (to be removed when no further tasks expected).",null,null,null,null,null,"TBD",{"$f":"getProgress(AB62,AL62,\"%\",1,1)","v":""},{"$f":"getProgress(AC62,AM62,\"%\",1,1)","v":""},{"$f":"getProgress(AD62,AN62,\"%\",1,1)","v":""},{"$f":"getProgress(AE62,AO62,\"%\",1,1)","v":""},null,null,null,null,null,null,null,null,null,null,null,null,{"$f":"IF(SUMPRODUCT(--($Q$10:$Y$10>0),--(Q62:Y62<>\"\"))>0,SUMPRODUCT(--($Q$10:$Y$10>0),Q62:Y62)/SUMPRODUCT(--($Q$10:$Y$10>0),--(Q62:Y62<>\"\")),\"\")","v":""},{"$f":"IF(WpAreaA_exist,IF(SUMPRODUCT(--($Q$9:$S$9<>0),--(Q62:S62<>\"\"))>0,SUMPRODUCT(--($Q$9:$S$9>0),Q62:S62)/SUMPRODUCT(--($Q$9:$S$9<>0),--(Q62:S62<>\"\")),\"\"),\"\")","v":""},{"$f":"IF(WpAreaB_exist,IF(SUMPRODUCT(--($T$9:$V$9<>0),--(T62:V62<>\"\"))>0,SUMPRODUCT(--($T$9:$V$9>0),T62:V62)/SUMPRODUCT(--($T$9:$V$9<>0),--(T62:V62<>\"\")),\"\"),\"\")","v":""},{"$f":"IF(WpAreaC_exist,IF(SUMPRODUCT(--($W$9:$Y$9<>0),--(W62:Y62<>\"\"))>0,SUMPRODUCT(--($W$9:$Y$9>0),W62:Y62)/SUMPRODUCT(--($W$9:$Y$9<>0),--(W62:Y62<>\"\")),\"\"),\"\")","v":""},null,null,null,null,null,null,"","","",""]
[22,null,36.903,5,"Grouping of test cases defined in TS 36.521-3","Update grouping of new RRM test cases defined in TS 36.521-3.","MediaTek","RAN5#106 (Feb-25)",null,"allen.zhang@mediatek.com",0.5,{"$f":"getProgress(AB63,AL63,\"%\",1,1)","v":"0%"},{"$f":"getProgress(AC63,AM63,\"%\",1,1)","v":"0%"},{"$f":"getProgress(AD63,AN63,\"%\",1,1)","v":""},{"$f":"getProgress(AE63,AO63,\"%\",1,1)","v":""},null,0,null,null,null,null,null,null,null,null,null,null,{"$f":"IF(SUMPRODUCT(--($Q$10:$Y$10>0),--(Q63:Y63<>\"\"))>0,SUMPRODUCT(--($Q$10:$Y$10>0),Q63:Y63)/SUMPRODUCT(--($Q$10:$Y$10>0),--(Q63:Y63<>\"\")),\"\")","v":0},{"$f":"IF(WpAreaA_exist,IF(SUMPRODUCT(--($Q$9:$S$9<>0),--(Q63:S63<>\"\"))>0,SUMPRODUCT(--($Q$9:$S$9>0),Q63:S63)/SUMPRODUCT(--($Q$9:$S$9<>0),--(Q63:S63<>\"\")),\"\"),\"\")","v":0},{"$f":"IF(WpAreaB_exist,IF(SUMPRODUCT(--($T$9:$V$9<>0),--(T63:V63<>\"\"))>0,SUMPRODUCT(--($T$9:$V$9>0),T63:V63)/SUMPRODUCT(--($T$9:$V$9<>0),--(T63:V63<>\"\")),\"\"),\"\")","v":""},{"$f":"IF(WpAreaC_exist,IF(SUMPRODUCT(--($W$9:$Y$9<>0),--(W63:Y63<>\"\"))>0,SUMPRODUCT(--($W$9:$Y$9>0),W63:Y63)/SUMPRODUCT(--($W$9:$Y$9<>0),--(W63:Y63<>\"\")),\"\"),\"\")","v":""},null,null,null,null,null,null,"","","",""]
[null,null,36.903,7,"Determination of Test Tolerances","Clause header",null,null,null,null,0,null,null,{"$f":"getProgress(AD64,AN64,\"%\",1,1)","v":""},{"$f":"getProgress(AE64,AO64,\"%\",1,1)","v":""},null,null,null,null,null,null,null,null,null,null,null,null,{"$f":"IF(SUMPRODUCT(--($Q$10:$Y$10>0),--(Q64:Y64<>\"\"))>0,SUMPRODUCT(--($Q$10:$Y$10>0),Q64:Y64)/SUMPRODUCT(--($Q$10:$Y$10>0),--(Q64:Y64<>\"\")),\"\")","v":""},{"$f":"IF(WpAreaA_exist,IF(SUMPRODUCT(--($Q$9:$S$9<>0),--(Q64:S64<>\"\"))>0,SUMPRODUCT(--($Q$9:$S$9>0),Q64:S64)/SUMPRODUCT(--($Q$9:$S$9<>0),--(Q64:S64<>\"\")),\"\"),\"\")","v":""},{"$f":"IF(WpAreaB_exist,IF(SUMPRODUCT(--($T$9:$V$9<>0),--(T64:V64<>\"\"))>0,SUMPRODUCT(--($T$9:$V$9>0),T64:V64)/SUMPRODUCT(--($T$9:$V$9<>0),--(T64:V64<>\"\")),\"\"),\"\")","v":""},{"$f":"IF(WpAreaC_exist,IF(SUMPRODUCT(--($W$9:$Y$9<>0),--(W64:Y64<>\"\"))>0,SUMPRODUCT(--($W$9:$Y$9>0),W64:Y64)/SUMPRODUCT(--($W$9:$Y$9<>0),--(W64:Y64<>\"\")),\"\"),\"\")","v":""},null,null,null,null,null,null,"","","",""]
[23,null,36.903,7.1,"General","Add the zip files into the attachments. The RRM test cases which have been analysed to determine Test Tolerances are included as .zip files. The name of the zip file indicates the test cases covered in TS 36.521-3.","MediaTek","RAN5#106 (Feb-25)",null,"allen.zhang@mediatek.com",0.1,{"$f":"getProgress(AB65,AL65,\"%\",1,1)","v":"0%"},{"$f":"getProgress(AC65,AM65,\"%\",1,1)","v":"0%"},{"$f":"getProgress(AD65,AN65,\"%\",1,1)","v":""},{"$f":"getProgress(AE65,AO65,\"%\",1,1)","v":""},null,0,null,null,null,null,null,null,null,null,null,null,{"$f":"IF(SUMPRODUCT(--($Q$10:$Y$10>0),--(Q65:Y65<>\"\"))>0,SUMPRODUCT(--($Q$10:$Y$10>0),Q65:Y65)/SUMPRODUCT(--($Q$10:$Y$10>0),--(Q65:Y65<>\"\")),\"\")","v":0},{"$f":"IF(WpAreaA_exist,IF(SUMPRODUCT(--($Q$9:$S$9<>0),--(Q65:S65<>\"\"))>0,SUMPRODUCT(--($Q$9:$S$9>0),Q65:S65)/SUMPRODUCT(--($Q$9:$S$9<>0),--(Q65:S65<>\"\")),\"\"),\"\")","v":0},{"$f":"IF(WpAreaB_exist,IF(SUMPRODUCT(--($T$9:$V$9<>0),--(T65:V65<>\"\"))>0,SUMPRODUCT(--($T$9:$V$9>0),T65:V65)/SUMPRODUCT(--($T$9:$V$9<>0),--(T65:V65<>\"\")),\"\"),\"\")","v":""},{"$f":"IF(WpAreaC_exist,IF(SUMPRODUCT(--($W$9:$Y$9<>0),--(W65:Y65<>\"\"))>0,SUMPRODUCT(--($W$9:$Y$9>0),W65:Y65)/SUMPRODUCT(--($W$9:$Y$9<>0),--(W65:Y65<>\"\")),\"\"),\"\")","v":""},null,null,null,null,null,null,"","","",""]
["LTE RAN and CN protocols",null,null,null,null,null,null,null,null,null,null,{"$f":"getProgress(AB66,AL66,\"%\",1,1)","v":""},{"$f":"getProgress(AC66,AM66,\"%\",1,1)","v":""},{"$f":"getProgress(AD66,AN66,\"%\",1,1)","v":""},{"$f":"getProgress(AE66,AO66,\"%\",1,1)","v":""}]
["TS 36.523-1: Protocol test cases"]
[null,null,"36.523-1",null,"Placeholder for estimation of not yet identified tasks within the area (to be removed when no further tasks expected).",null,null,null,null,null,"TBD","","","","",null,null,null,null,null,null,null,null,null,null,null,null,{"$f":"IF(SUMPRODUCT(--($Q$10:$Y$10>0),--(Q68:Y68<>\"\"))>0,SUMPRODUCT(--($Q$10:$Y$10>0),Q68:Y68)/SUMPRODUCT(--($Q$10:$Y$10>0),--(Q68:Y68<>\"\")),\"\")","v":""},{"$f":"IF(WpAreaA_exist,IF(SUMPRODUCT(--($Q$9:$S$9<>0),--(Q68:S68<>\"\"))>0,SUMPRODUCT(--($Q$9:$S$9>0),Q68:S68)/SUMPRODUCT(--($Q$9:$S$9<>0),--(Q68:S68<>\"\")),\"\"),\"\")","v":""},{"$f":"IF(WpAreaB_exist,IF(SUMPRODUCT(--($T$9:$V$9<>0),--(T68:V68<>\"\"))>0,SUMPRODUCT(--($T$9:$V$9>0),T68:V68)/SUMPRODUCT(--($T$9:$V$9<>0),--(T68:V68<>\"\")),\"\"),\"\")","v":""},{"$f":"IF(WpAreaC_exist,IF(SUMPRODUCT(--($W$9:$Y$9<>0),--(W68:Y68<>\"\"))>0,SUMPRODUCT(--($W$9:$Y$9>0),W68:Y68)/SUMPRODUCT(--($W$9:$Y$9<>0),--(W68:Y68<>\"\")),\"\"),\"\")","v":""},null,null,null,null,null,null,"","","",""]
["NB-IoT",null,null,null,null,null,null,null,null,null,null,"","","",""]
[24,"Y","36.523-1","22.3.1.14","NB-IoT / NTN /Correct HARQ process/ HARQ disabling","**** TP1: [TS 36.321, clause 5.3.2.1, 5.3.2.2, 5.4.2.1 and 5.4.2.2.]\nTest Purpose (TP)\n(1)\nwith { UE in E-UTRA RRC_CONNECTED state with DRB established and has 2 DL HARQ processes and the second HARQ process feedback is disabled by configuring downlinkHARQ-FeedbackDisabled }\nensure that {\n  when {the UE receives MAC PDUs for these two HARQ processes }\n    then { the UE doesn`t transmits ACK/NACK for the second HARQ process while ACK/NACK is trnasmitted for the first HARQ}\n                 }\n\n(2)\nwith { UE in E-UTRA RRC_CONNECTED state with DRB established and has 2 UL HARQ processes and the second HARQ process feedback is disabled by configuring HARQ Mode B }\nensure that {\n  when { UE transmits MAC PDUs but does not receive an ACK/NACK HARQ process for these 2 HARQ processes }\n    then { UE re-transmits the MAC PDU for the first HARQ process while not re-transmit for the second HARQ process }\n                }","TBD","TBD",null,null,1,{"$f":"getProgress(AB70,AL70,\"%\",1,1)","v":"0%"},{"$f":"getProgress(AC70,AM70,\"%\",1,1)","v":"0%"},{"$f":"getProgress(AD70,AN70,\"%\",1,1)","v":""},{"$f":"getProgress(AE70,AO70,\"%\",1,1)","v":""},null,0,null,null,null,null,null,null,null,null,null,null,{"$f":"IF(SUMPRODUCT(--($Q$10:$Y$10>0),--(Q70:Y70<>\"\"))>0,SUMPRODUCT(--($Q$10:$Y$10>0),Q70:Y70)/SUMPRODUCT(--($Q$10:$Y$10>0),--(Q70:Y70<>\"\")),\"\")","v":0},{"$f":"IF(WpAreaA_exist,IF(SUMPRODUCT(--($Q$9:$S$9<>0),--(Q70:S70<>\"\"))>0,SUMPRODUCT(--($Q$9:$S$9>0),Q70:S70)/SUMPRODUCT(--($Q$9:$S$9<>0),--(Q70:S70<>\"\")),\"\"),\"\")","v":0},{"$f":"IF(WpAreaB_exist,IF(SUMPRODUCT(--($T$9:$V$9<>0),--(T70:V70<>\"\"))>0,SUMPRODUCT(--($T$9:$V$9>0),T70:V70)/SUMPRODUCT(--($T$9:$V$9<>0),--(T70:V70<>\"\")),\"\"),\"\")","v":""},{"$f":"IF(WpAreaC_exist,IF(SUMPRODUCT(--($W$9:$Y$9<>0),--(W70:Y70<>\"\"))>0,SUMPRODUCT(--($W$9:$Y$9>0),W70:Y70)/SUMPRODUCT(--($W$9:$Y$9<>0),--(W70:Y70<>\"\")),\"\"),\"\")","v":""},null,null,null,null,null,null,"","","",""]
[25,"Y","36.523-1","22.3.1.15","NB-IoT / NTN / GNSS validity duration reporting","**** TP1: [TS 36.321 clauses 5.4.10]\n(1)\nwith { UE in E-UTRA RRC_CONNECTED state and GNSS is valid }\nensure that {\n  when { UE is requested to report the remaining GNSS measurement validity duration }\n    then { the UE transmits a GNSS Validity Duration Report MAC CE }\n                 }","TBD","TBD",null,null,1,{"$f":"getProgress(AB71,AL71,\"%\",1,1)","v":"0%"},{"$f":"getProgress(AC71,AM71,\"%\",1,1)","v":"0%"},{"$f":"getProgress(AD71,AN71,\"%\",1,1)","v":""},{"$f":"getProgress(AE71,AO71,\"%\",1,1)","v":""},null,0,null,null,null,null,null,null,null,null,null,null,{"$f":"IF(SUMPRODUCT(--($Q$10:$Y$10>0),--(Q71:Y71<>\"\"))>0,SUMPRODUCT(--($Q$10:$Y$10>0),Q71:Y71)/SUMPRODUCT(--($Q$10:$Y$10>0),--(Q71:Y71<>\"\")),\"\")","v":0},{"$f":"IF(WpAreaA_exist,IF(SUMPRODUCT(--($Q$9:$S$9<>0),--(Q71:S71<>\"\"))>0,SUMPRODUCT(--($Q$9:$S$9>0),Q71:S71)/SUMPRODUCT(--($Q$9:$S$9<>0),--(Q71:S71<>\"\")),\"\"),\"\")","v":0},{"$f":"IF(WpAreaB_exist,IF(SUMPRODUCT(--($T$9:$V$9<>0),--(T71:V71<>\"\"))>0,SUMPRODUCT(--($T$9:$V$9>0),T71:V71)/SUMPRODUCT(--($T$9:$V$9<>0),--(T71:V71<>\"\")),\"\"),\"\")","v":""},{"$f":"IF(WpAreaC_exist,IF(SUMPRODUCT(--($W$9:$Y$9<>0),--(W71:Y71<>\"\"))>0,SUMPRODUCT(--($W$9:$Y$9>0),W71:Y71)/SUMPRODUCT(--($W$9:$Y$9<>0),--(W71:Y71<>\"\")),\"\"),\"\")","v":""},null,null,null,null,null,null,"","","",""]
[26,"Y","36.523-1","22.4.31","NB-IoT / NTN / discontinuous coverage","**** TP1: [TS 36.331 clauses 5.3.3.23]\n(1)\nwith { UE in E-UTRA RRC_CONNECTED state supports discontinuous coverage and SIB33-NB broadcasts neighbour cell information }\nensure that {\n  when { t-Service expires and T310 is still running }\n    then { the UE enters RRC_IDLE state and reselects to the neighbour cell after UE is in its coverage }\n                 }","CMCC","RAN5#109 (Nov-25)",null,"zhaoluyang@chinamobile.com",1,{"$f":"getProgress(AB72,AL72,\"%\",1,1)","v":"0%"},{"$f":"getProgress(AC72,AM72,\"%\",1,1)","v":"0%"},{"$f":"getProgress(AD72,AN72,\"%\",1,1)","v":""},{"$f":"getProgress(AE72,AO72,\"%\",1,1)","v":""},null,0,null,null,null,null,null,null,null,null,null,null,{"$f":"IF(SUMPRODUCT(--($Q$10:$Y$10>0),--(Q72:Y72<>\"\"))>0,SUMPRODUCT(--($Q$10:$Y$10>0),Q72:Y72)/SUMPRODUCT(--($Q$10:$Y$10>0),--(Q72:Y72<>\"\")),\"\")","v":0},{"$f":"IF(WpAreaA_exist,IF(SUMPRODUCT(--($Q$9:$S$9<>0),--(Q72:S72<>\"\"))>0,SUMPRODUCT(--($Q$9:$S$9>0),Q72:S72)/SUMPRODUCT(--($Q$9:$S$9<>0),--(Q72:S72<>\"\")),\"\"),\"\")","v":0},{"$f":"IF(WpAreaB_exist,IF(SUMPRODUCT(--($T$9:$V$9<>0),--(T72:V72<>\"\"))>0,SUMPRODUCT(--($T$9:$V$9>0),T72:V72)/SUMPRODUCT(--($T$9:$V$9<>0),--(T72:V72<>\"\")),\"\"),\"\")","v":""},{"$f":"IF(WpAreaC_exist,IF(SUMPRODUCT(--($W$9:$Y$9<>0),--(W72:Y72<>\"\"))>0,SUMPRODUCT(--($W$9:$Y$9>0),W72:Y72)/SUMPRODUCT(--($W$9:$Y$9<>0),--(W72:Y72<>\"\")),\"\"),\"\")","v":""},null,null,null,null,null,null,"","","",""]
[27,"Y","36.523-1","22.4.32","NB-IoT / NTN / cell reselection/ Intra E-UTRAN / distance based measurement","**** TP1: [TS 36.304, clause 5.2.4.1, 5.2.4.2 and 5.2.4.5.]\n(1)\nwith { UE in RRC_IDLE state supports location-based measurement initiation and has obtained its location information }\nensure that {\n  when { the distance between the UE and the serving cell reference location is larger than distanceThresh }\n    then { UE performs intra-frequency measurements and reselects the new cell after UE detects the cell re-selection criteria are met }\n                }","CAICT","RAN5#109 (Nov-25)",null,"zhangyufeng@caict.ac.cn",1,{"$f":"getProgress(AB73,AL73,\"%\",1,1)","v":"0%"},{"$f":"getProgress(AC73,AM73,\"%\",1,1)","v":"0%"},{"$f":"getProgress(AD73,AN73,\"%\",1,1)","v":""},{"$f":"getProgress(AE73,AO73,\"%\",1,1)","v":""},null,0,null,null,null,null,null,null,null,null,null,null,{"$f":"IF(SUMPRODUCT(--($Q$10:$Y$10>0),--(Q73:Y73<>\"\"))>0,SUMPRODUCT(--($Q$10:$Y$10>0),Q73:Y73)/SUMPRODUCT(--($Q$10:$Y$10>0),--(Q73:Y73<>\"\")),\"\")","v":0},{"$f":"IF(WpAreaA_exist,IF(SUMPRODUCT(--($Q$9:$S$9<>0),--(Q73:S73<>\"\"))>0,SUMPRODUCT(--($Q$9:$S$9>0),Q73:S73)/SUMPRODUCT(--($Q$9:$S$9<>0),--(Q73:S73<>\"\")),\"\"),\"\")","v":0},{"$f":"IF(WpAreaB_exist,IF(SUMPRODUCT(--($T$9:$V$9<>0),--(T73:V73<>\"\"))>0,SUMPRODUCT(--($T$9:$V$9>0),T73:V73)/SUMPRODUCT(--($T$9:$V$9<>0),--(T73:V73<>\"\")),\"\"),\"\")","v":""},{"$f":"IF(WpAreaC_exist,IF(SUMPRODUCT(--($W$9:$Y$9<>0),--(W73:Y73<>\"\"))>0,SUMPRODUCT(--($W$9:$Y$9>0),W73:Y73)/SUMPRODUCT(--($W$9:$Y$9<>0),--(W73:Y73<>\"\")),\"\"),\"\")","v":""},null,null,null,null,null,null,"","","",""]
[28,"Y","36.523-1","22.4.32","NB-IoT / NTN / enhanced discontinuous coverage","**** : [TS 24.301, clause 4.11.4, 5.5.1.2 and 5.5.3.2.]\n(1)\nwith { the UE is switched-off and supports enhanced discontinuous coverage }\nensure that {\n  when { UE is powered on }\n    then { the UE transmits an ATTACH REQUEST message with the EDC bit set to \"Enhanced discontinuous coverage supported\" in the UE network capability IE }\n}\n(2)\nwith { UE in EMM-REGISTERED state and supports enhanced discontinuous coverage }\nensure that {\n  when {the UE is about to lose satellite coverage }\n   then { the UE transmits a TRACKING AREA UPDATE REQUEST message with  the unavailability type in the Unavailability information IE set to \"unavailability due to discontinuous coverage\".}\n(3)\nwith { UE is not under satellite coverage and needs to report end of unavailability }\nensure that {\n  when { the unavailability period duration has ended }\n   then { the UE transmits a TRACKING AREA UPDATE REQUEST message }","CMCC","RAN5#109 (Nov-25)",null,"zhaoluyang@chinamobile.com",1,{"$f":"getProgress(AB74,AL74,\"%\",1,1)","v":"0%"},{"$f":"getProgress(AC74,AM74,\"%\",1,1)","v":"0%"},{"$f":"getProgress(AD74,AN74,\"%\",1,1)","v":""},{"$f":"getProgress(AE74,AO74,\"%\",1,1)","v":""},null,0,null,null,null,null,null,null,null,null,null,null,{"$f":"IF(SUMPRODUCT(--($Q$10:$Y$10>0),--(Q74:Y74<>\"\"))>0,SUMPRODUCT(--($Q$10:$Y$10>0),Q74:Y74)/SUMPRODUCT(--($Q$10:$Y$10>0),--(Q74:Y74<>\"\")),\"\")","v":0},{"$f":"IF(WpAreaA_exist,IF(SUMPRODUCT(--($Q$9:$S$9<>0),--(Q74:S74<>\"\"))>0,SUMPRODUCT(--($Q$9:$S$9>0),Q74:S74)/SUMPRODUCT(--($Q$9:$S$9<>0),--(Q74:S74<>\"\")),\"\"),\"\")","v":0},{"$f":"IF(WpAreaB_exist,IF(SUMPRODUCT(--($T$9:$V$9<>0),--(T74:V74<>\"\"))>0,SUMPRODUCT(--($T$9:$V$9>0),T74:V74)/SUMPRODUCT(--($T$9:$V$9<>0),--(T74:V74<>\"\")),\"\"),\"\")","v":""},{"$f":"IF(WpAreaC_exist,IF(SUMPRODUCT(--($W$9:$Y$9<>0),--(W74:Y74<>\"\"))>0,SUMPRODUCT(--($W$9:$Y$9>0),W74:Y74)/SUMPRODUCT(--($W$9:$Y$9<>0),--(W74:Y74<>\"\")),\"\"),\"\")","v":""},null,null,null,null,null,null,"","","",""]
["TS 36.523-2: Applicability for Protocol test cases"]
[null,null,"36.523-2",null,"Placeholder for estimation of not yet identified tasks within the area (to be removed when no further tasks expected)."]
[29,null,"36.523-2","4\n","Recommended Test Case Applicability","Addition of applicability for IoT NTN enh cases","CMCC","RAN5#109 (Nov-25)",null,"zhaoluyang@chinamobile.com",0.1,{"$f":"getProgress(AB77,AL77,\"%\",1,1)","v":"0%"},{"$f":"getProgress(AC77,AM77,\"%\",1,1)","v":"0%"},{"$f":"getProgress(AD77,AN77,\"%\",1,1)","v":""},{"$f":"getProgress(AE77,AO77,\"%\",1,1)","v":""},null,0,null,null,null,null,null,null,null,null,null,null,{"$f":"IF(SUMPRODUCT(--($Q$10:$Y$10>0),--(Q77:Y77<>\"\"))>0,SUMPRODUCT(--($Q$10:$Y$10>0),Q77:Y77)/SUMPRODUCT(--($Q$10:$Y$10>0),--(Q77:Y77<>\"\")),\"\")","v":0},{"$f":"IF(WpAreaA_exist,IF(SUMPRODUCT(--($Q$9:$S$9<>0),--(Q77:S77<>\"\"))>0,SUMPRODUCT(--($Q$9:$S$9>0),Q77:S77)/SUMPRODUCT(--($Q$9:$S$9<>0),--(Q77:S77<>\"\")),\"\"),\"\")","v":0},{"$f":"IF(WpAreaB_exist,IF(SUMPRODUCT(--($T$9:$V$9<>0),--(T77:V77<>\"\"))>0,SUMPRODUCT(--($T$9:$V$9>0),T77:V77)/SUMPRODUCT(--($T$9:$V$9<>0),--(T77:V77<>\"\")),\"\"),\"\")","v":""},{"$f":"IF(WpAreaC_exist,IF(SUMPRODUCT(--($W$9:$Y$9<>0),--(W77:Y77<>\"\"))>0,SUMPRODUCT(--($W$9:$Y$9>0),W77:Y77)/SUMPRODUCT(--($W$9:$Y$9<>0),--(W77:Y77<>\"\")),\"\"),\"\")","v":""},null,null,null,null,null,null,"","","",""]
[30,null,"36.523-2","A.4.4\n","Additional information","PICS for IoT NTN enh","CMCC","RAN5#109 (Nov-25)",null,"zhaoluyang@chinamobile.com",0.1,{"$f":"getProgress(AB78,AL78,\"%\",1,1)","v":"0%"},{"$f":"getProgress(AC78,AM78,\"%\",1,1)","v":"0%"},{"$f":"getProgress(AD78,AN78,\"%\",1,1)","v":""},{"$f":"getProgress(AE78,AO78,\"%\",1,1)","v":""},null,0,null,null,null,null,null,null,null,null,null,null,{"$f":"IF(SUMPRODUCT(--($Q$10:$Y$10>0),--(Q78:Y78<>\"\"))>0,SUMPRODUCT(--($Q$10:$Y$10>0),Q78:Y78)/SUMPRODUCT(--($Q$10:$Y$10>0),--(Q78:Y78<>\"\")),\"\")","v":0},{"$f":"IF(WpAreaA_exist,IF(SUMPRODUCT(--($Q$9:$S$9<>0),--(Q78:S78<>\"\"))>0,SUMPRODUCT(--($Q$9:$S$9>0),Q78:S78)/SUMPRODUCT(--($Q$9:$S$9<>0),--(Q78:S78<>\"\")),\"\"),\"\")","v":0},{"$f":"IF(WpAreaB_exist,IF(SUMPRODUCT(--($T$9:$V$9<>0),--(T78:V78<>\"\"))>0,SUMPRODUCT(--($T$9:$V$9>0),T78:V78)/SUMPRODUCT(--($T$9:$V$9<>0),--(T78:V78<>\"\")),\"\"),\"\")","v":""},{"$f":"IF(WpAreaC_exist,IF(SUMPRODUCT(--($W$9:$Y$9<>0),--(W78:Y78<>\"\"))>0,SUMPRODUCT(--($W$9:$Y$9>0),W78:Y78)/SUMPRODUCT(--($W$9:$Y$9<>0),--(W78:Y78<>\"\")),\"\"),\"\")","v":""},null,null,null,null,null,null,"","","",""]
["End of workplan items.  Note! Do not remove this row. Introduce new work plan rows/items above this row.",null,null,null,null,null,null,null,null,null,null,null,null,null,null,null,null,null,null,null,null,null,null,null,null,null,null,"End of source data"]

{"sheet":"WP configuration","index":2,"n_rows":49,"n_cols":4,"rows_kept":49,"cut":false,"hidden":false,"merged":[[0,0,0,1],[1,0,1,1],[16,0,16,1],[25,0,25,1],[26,0,26,1],[27,0,27,1],[34,0,34,1],[35,0,35,1],[36,0,36,1],[45,0,45,1],[47,0,47,1],[48,0,57,1]]}
["Configure work plan properties",null,null,"WP support data - DO NOT EDIT THIS COLUMN"]
["Work plan scope"]
[null,"Define WP scope",null,"Active WP scope"]
["WP area A","LTE",null,{"$f":"IF(OR(B4=\"\",B4=\"N/A\"),\"N/A\",B4)","v":"LTE"}]
["sub-area#1","FDD",null,{"$f":"IF(D4=\"N/A\",\"N/A\",IF(OR(B5=\"\",B5=\"N/A\"),\"\",B5))","v":"FDD"}]
["sub-area#2","N/A",null,{"$f":"IF(OR(D5=\"N/A\",D5=\"-\"),\"N/A\",IF(B6=\"\",\"N/A\",B6))","v":"N/A"}]
["sub-area#3","FR1 + FR2",null,{"$f":"IF(OR(D6=\"N/A\",D6=\"-\"),\"N/A\",IF(B7=\"\",\"N/A\",B7))","v":"N/A"}]
["WP area B","N/A",null,{"$f":"IF(OR($D$4=\"N/A\",$B$8=\"\"),\"N/A\",B8)","v":"N/A"}]
["sub-area#1","FR1",null,{"$f":"IF(OR(D8=\"N/A\",B9=\"N/A\"),\"N/A\",IF(B9=\"\",\"\",B9))","v":"N/A"}]
["sub-area#2","FR2",null,{"$f":"IF(OR(D9=\"N/A\",B10=\"\"),\"N/A\",IF(B10=\"\",\"N/A\",B10))","v":"N/A"}]
["sub-area#3","FR1 + FR2",null,{"$f":"IF(OR(D10=\"N/A\",B11=\"\"),\"N/A\",IF(B11=\"\",\"N/A\",B11))","v":"N/A"}]
["WP area C","LTE",null,{"$f":"IF(OR($D$8=\"N/A\",$B$12=\"\"),\"N/A\",B12)","v":"N/A"}]
["sub-area#1","FDD",null,{"$f":"IF(OR(D12=\"N/A\",B13=\"N/A\"),\"N/A\",IF(B13=\"\",\"\",B13))","v":"N/A"}]
["sub-area#2","TDD",null,{"$f":"IF(OR(D13=\"N/A\",$B$13=\"\"),\"N/A\",IF(B14=\"\",\"N/A\",B14))","v":"N/A"}]
["sub-area#3","FDD + TDD",null,{"$f":"IF(OR(D14=\"N/A\",$B$13=\"\"),\"N/A\",IF(B15=\"\",\"N/A\",B15))","v":"N/A"}]
[]
["RAN5 meetings used as target values in WP"]
[null,"RAN5#103 (May-24)"]
[null,"RAN5#104 (Aug-24)"]
[null,"RAN5#105 (Nov-24)"]
[null,"RAN5#106 (Feb-25)"]
[null,"RAN5#107 (May-25)"]
[null,"RAN5#108 (Aug-25)"]
[null,"RAN5#109 (Nov-25)"]
[null,"TBD"]
["End of list (insert/replace any additional meetings above the 'TBD' row)"]
[]
["WP areas (used above for selecting WP area scope)"]
[null,"SA Option 2 (SA NR)"]
[null,"NSA Option 3 (EN-DC)"]
[null,"PX5"]
[null,"LTE"]
[null,"Band Independent"]
[null,"N/A"]
["End of list (insert any additional areas above the 'N/A' row)"]
[]
["WP sub-areas (used above for selecting WP sub-area scope)"]
[null,"FR1"]
[null,"FR2"]
[null,"FR1 + FR2"]
[null,"FDD"]
[null,"TDD"]
[null,"FDD + TDD"]
[null,"BI"]
[null,"N/A"]
["End of list (insert any additional areas above the 'N/A' row)"]
[]
["Completion Compensation"]
["After that completion progress has been reported in a status report to a RAN Plenary it should not be decreased due to late new tasks are added to the work plan or due to corrections of the work plan. \nThe earlier reported completion status should be kept until necessary progress have been achieved such that completion exceeds the earlier reported completion level. The difference between reported completion and actual completion level is handled by adding a Completion Compensation to the overlal work item completion level.\nIf needed the Completion Compensation can be reset to zero (0) by the 'Reset Completion Compensation' button."]